{"text_format":"1","workbook":"xlsx","n_sheets":13,"sheets":["programmer documentation","Instructions","Table of Contents","Child Find Best Practices","Theme Summary","Action Plan","Data","Help","ALLdata","QualityIndicators","QIRatingLookup","ElementRatingScale","IndicatorRating"],"not_rendered":{"charts":0,"images":11,"macros":1,"external_links":2,"defined_names":20,"comments":1,"pivot_tables":0},"unopened":[],"bounds":{"document_bytes":16777216,"sheet_cells":100000,"rows_first":2000,"rows_last":500,"rows_between":2000,"halvings":0,"cell_chars":16384,"cell_head_chars":4096},"cells_cut":0,"cells_raw":0,"read":"whole","date_system":"1900"}

{"sheet":"programmer documentation","index":0,"n_rows":16,"n_cols":6,"rows_kept":16,"cut":false,"hidden":true,"merged":[]}
[]
[null,"Version","Action","Date Saved"]
[null,"v01","Initial Release","2021-06-29"]
[null,"v02","[Instructions] fixed typos, added buttons, added Help content","2021-07-27"]
[null,null,"[Table of Contents] corrected content (out of order), link references, added Help",null,null,"Lorem ipsum dolor sit amet, consectetur adipiscing elit. Nulla pulvinar sit amet enim eu vulputate.  Donec pellentesque aliquam velit, a vehicula sem ornare id. Mauris at metus sit amet turpis viverra ultrices tincidunt ut neque. Aliquam erat volutpat. Ut semper pulvinar magna, laoreet accumsan leo facilisis ac. Praesent lobortis metus orci, non mattis turpis digniss im at. Nulla scelerisque rutrum efficitur. Pellentesque habitant morbi tristique senectus et netus et malesuada fames ac turpis egestas. Integer tempor posuere tincidunt. Etiam gravida nunc eros, id mollis nulla tincidunt sed. Ut eu sollicitudin enim. Fusce a mattis ex. Etiam varius ipsum orci, ac cursus dui fermentum non."]
[null,null,"[Child Find Best Practices] fixed typos"]
[null,null,"[Action Plan] Added row/column highlighting; shaded light yellow all editable cells"]
[null,null,"[Help] updated images, fixed links"]
[null,"v03","final edits from 7/27/21 release (probably only trivial edits, if any - unfortunately, didn't document!)","2021-08-06"]
[null,"v04","[Instructions] updated content to remove references to Evaluation","2021-09-09"]
[null,null,"[Table of Contents] updated content to remove references to Evaluation"]
[null,null,"[Child Find Best Practices] updated content to remove references to Evaluation; removed one Best Practice from Theme 4"]
[null,null,"[Theme Summary]  updated content to remove references to Evaluation"]
[null,null,"[All_Data]  updated content to remove references to Evaluation"]
[null,null,"[macros-many]  updated cell references to adjust for removal of two rows in Child Find Best Practices tab"]
[null,null,"[Help] updated images"]

{"sheet":"Instructions","index":1,"n_rows":96,"n_cols":2,"rows_kept":96,"cut":false,"hidden":false,"merged":[[83,2,84,7],[70,0,72,0],[75,2,76,7],[77,2,78,7],[79,2,80,7],[81,2,82,7]]}
[null,"OSEP"]
[null,"Click to jump to instructions on this tab:"]
[]
[null,"Child Find Section II: Child Find Best Practices"]
[null,"Purpose"]
["\n\n\n\n\n","The purpose of Section II of the Part B, 619 Child Find Self-Assessment (CFSA) tool is to help Local Education Agencies (LEA) identify evidence-based practices to support their Child Find efforts. States can also use the CFSA to look across LEAs at what is happening at the local level or as part of a corrective action plan in an LEA. This section includes content that is not required by the IDEA but best practices that can help Part B, 619 programs efficiently and effectively identify and locate young children ages three through five with disabilities and their families.  "]
[null,"Completion of the CFSA is voluntary. A State may choose to request technical assistance from OSEP regarding its CFSA. To request technical assistance, or ask a question about the CFSA, please send an email to your OSEP State Lead and copy the email to OSEP’s Child Find Lead -- Brenda Wilkins at Brenda.Wilkins@ed.gov. You may also call Brenda Wilkins about the CFSA at 202-245-6920. TA center support is also available. To access TA support, contact Evelyn Shaw (evelyn.shaw@unc.edu, 919-962-2001). "]
["\n\n\n\n","It is recommended that LEAs and States review additional information about the efficiency and effectiveness of their Child Find systems and engage stakeholders in identifying root causes of any identified inefficiency or ineffectiveness. Completing the CFSA at regular timepoints can also allow LEAs and States to track progress resulting from improvement activities."]
["\n\n\n\n","It is also recommended that LEAs and States complete the first section of this tool, Section I:  Regulatory Requirements Specific to Child Find, before completing Section II: Child Find Best Practices, because Section I describes the required BestPractices of a Comprehensive Child Find System. Completing Section I before Section II may help identify areas for improvement in implementing regulations related to Child Find and may result in identifying additional areas for improvement."]
[]
[null,"Who Completes the Self-Assessment?"]
["\n\n\n\n\n\n\n\n\n\n\n","The CFSA is designed to be completed by LEAs. However, it can also be used by states to look across LEAs and support continuous improvement of child find. The CFSA should be completed by individuals within the LEA with in-depth knowledge of Part B regulations, including how the LEA meets those regulations, and the local child find efforts. The CFSA should also be completed in collaboration with stakeholders, including collaborating organizations, agencies, offices, and local programs. Space is provided in the Action Plan tab to document the names, roles, and organizations for those completing the self-assessment and action plan. Partnerships among early childhood programs, such as Title 1, Head Start and Early Head Start, private preschool programs, and state pre-k are crucial as referral sources and in child find efforts. In addition, these partners and other entities, such as physicians' offices may conduct universal screening and/or developmental monitoring that can identify children who should be referred to Part B for additional evaluation and eligibility determination. It will be helpful to have individuals representing those organizations involved with the self-assessment and planning to understand the true scope of child find activities within the LEA. "]
["\n\n\n\n\n","If State staff are completing the CFSA to understand child find across LEAs or to support improvement in an LEA’s performance, those individuals should have a comprehensive knowledge of Part B regulations and be familiar with the evidence-based child find best practices included in Section II. Stakeholder input should also be included when state staff are completing the CFSA, especially when collaborating organizations, agencies, offices, and local programs assist LEAs in their child find processes."]
[]
[null,"Considerations"]
["\n\n\n\n\n\n\n\n","It is important to recognize that the outcome of improving a Child Find system may be to improve the efficiency of the child find process. Improvement activities targeting the efficiency of the process include: 1) ensuring children are referred for a full evaluation as soon as concerns arise, including not being required to go through all the tiers in a multi-tiered system of support, and 2) improving the quality of referrals from primary referral sources so children referred are likely to be found eligible.  LEAs and states should ensure that efforts to improve child find are integrated with other statewide improvement efforts, like the State Systemic Improvement Plans (SSIP) and broad early childhood initiatives (e.g., Preschool Development Grants).  Additionally, as with all Part B, 619 activities, respectful and appropriate communication with families is essential. "]
[]
[null,"Child Find Requirements"]
["\n\n\n\n","Part B of IDEA (34 CFR §300.111) requires states to have policies and procedures in place to ensure children, birth to age 21, with disabilities in need of special education and related services are identified, located, and evaluated. Additional information regarding Child Find Requirements and resources, in addition to the CFSA, to support state and LEA policies and procedures can be found on the Early Childhood Technical Assistance (ECTA) Center website. "]
[]
[null,"Transition "]
["\n\n\n\n\n","Seamless transitions for children and families are needed to ensure timely access to appropriate services. Although a seamless transition from Part C early intervention services to Part B, 619 preschool special education services is a requirement of the IDEA, it is not a focus of CFSA tool. The CFSA focuses on best practices to support Child Find efforts to locate, identify, assess, and enroll preschoolers who may be eligible for Part B, 619 services who are not already enrolled in early intervention services. Additional information about the requirements for transition and ways to support LEAs, children, and families during the transition process can be found on the ECTA website. "]
[]
[null,"Private Schools and LRE"]
["\n\n\n\n\n\n\n\n\n","Part B regulations require states to ensure services to children ages three through five years are provided in the least restrictive environment (LRE). The LRE regulations show a preference for educating children with disabilities in regular classes. LRE for preschoolers with a disability can be provided in a variety of settings, including in a public or private preschool program, a community-based childcare facility, in the child's home, or a regular kindergarten class. Although the CFSA does not focus on LRE, it does include LEAs’ obligation to find and serve children in non-public settings. ECTA provides a guidance document, Determining Least Restrictive Environment (LRE) Placements for Preschool Children with Disabilities: Reference Points and Discussion Prompts, to support state and local programs in understanding LRE. In addition, Section III of the Part B, 619 Child Find Self-Assessment: OSEP Policy Letters and Guidance, includes guidance from OSEP regarding preschool LRE and identifying and serving children in a variety of settings. "]
[]
[null,"How to Complete the Tool"]
[null,"This document groups best practices (BPs) by themes.  The themes covered in this document include:"]
[null,"Theme 1 – Cross-Sector Collaboration"]
[null,"Theme 2 – Identifying Children who are Underserved by Part B"]
[null,"Theme 3 – Data and Data Systems "]
[null,"Theme 4 – Technical Adequacy of Screening Tools "]
[null,"Theme 5 – Efficiency of Screening and Referral Process and Procedures"]
[null,"Theme 6 – Responding When Children are Found Ineligible for Part B"]
[null,"Theme 7 – Evaluation of Child Find  "]
[]
[null,"Table of Contents"]
[null,"This sheet lists all the themes in Section II of the CFSA. "]
[]
[null,"Part B, 619 Child Find Best Practices Rating Worksheet"]
["\n\n\n","Best Practices Ratings:  The worksheet titled Part B, 619 Child Find Best Practices includes each theme and the associated BPs and is used to rate the BPs. Use the Best Practice Rating Scale to identify the rating that most appropriately describes the LEA’s or state’s implementation of each BP. The scale includes the following four options:"]
[null,"1 – No - practice not in place and not planning to work on it at this time"]
[null,"2 – No - practice not in place but planning to work on it or getting started"]
[null,"3 – Yes - practice partially implemented"]
[null,"4 – Yes - practice fully implemented"]
["\n\n\n","In the Rating column, provide the rating for each BP by entering the number (1 to 4) or by selecting the value from the dropdown list. The Best Practice Rating Scale is also presented at the top of the worksheet directly above the rating column."]
["\n","It is not expected that states will be implementing every best practice, so ratings of 1 can be expected. "]
[null,"As ratings for the BPs in a theme are entered, the theme rating is automatically calculated and displayed in the row for the respective theme (in the light blue cell). The theme summary rating represents the status of implementation of the BPs rated for each theme, based on the number of BPs that are not planned or in place, partially implemented, and fully implemented. This provides a high-level view of each best practice theme. You can also assign a priority (high, medium, low) to the theme. A low BP rating and high priority rating suggests the best practice may be an area to focus improvement activities. However, there may be additional room for improvement for BPs with high ratings. "]
[]
[null,"Evidence:  Immediately below each BP is a text box (shaded light yellow) for documenting the evidence for the BP.  The text box will expand to the needed length. The evidence box is used to document your policies and procedures related to each best practice, providing support for your rating. This information is particularly helpful for tracking progress over time. In the evidence box you may include text from, links to, and/or comments about policies and procedures. This may include policies and procedures of agencies, organizations, or programs with whom Part B, 619 collaborates to conduct child find activities."]
["\n\n\n\n","There are two buttons at the top of the worksheet labeled “Show Evidence” and “Hide Evidence”. Clicking “Show Evidence” will resize the rows and display all the evidence; clicking “Hide Evidence” will hide all the evidence rows. Thus, the Child Find Best Practices Rating worksheet may be viewed and/or printed with or without the evidence displayed."]
[]
["\n\n\n","Priority:  To the right of the Rating column is a column for indicating the priority of each BP and theme. The priority ratings can help LEAs and states identify which BPs or themes should be the focus of their Child Find efforts. The priority scale includes the following three options:"]
[null,"H – High"]
[null,"M – Medium"]
[null,"L – Low"]
[]
["\n\n\n\n","In the Priority column, provide the priority rating for each BP and theme by entering the letter (H, M, or L in lower or upper case) or by selecting the letter from the dropdown list. The priority ratings are optional, and this column may be left blank. A list of the BPs marked as high priority is available in the Action Plan tab. Click \"Show High Priority BPs\" in the action plan tab to view the list. "]
["\n\n\n","It is recommended that states first enter the Best Practice Ratings for all themes that will be completed, and then go back and assign the priority ratings. This allows stakeholders to get an overall view of strengths and areas of need across multiple themes and BPs. "]
[]
[null,"Theme Summary"]
[null,"The Theme Summary sheet displays a summary of the ratings for each of the themes for which BPs were rated. Data cannot be entered or edited on this sheet because it displays the data from the Child Find Best Practices worksheet. The theme ratings are displayed in column J, and the theme priorities, if entered, are displayed in column K. The colored horizontal bars graphically depict the theme ratings:"]
[null,"Red – indicates a theme rating of 1 or 2"]
[null,"Yellow – indicates a theme rating of 3, 4, or 5"]
[null,"Blue – indicates a theme rating of 6 or 7"]
[null,"The total number of BPs in each theme is presented in column T. To the right of the total is the number of BPs in each theme with ratings of 1, 2, 3, and 4. A summary of the number of BPs within each priority level is provided on the far right; this data only includes those BPs for which a priority was indicated."]
[]
[null,"Action Plan"]
["\n\n\n\n\n\n","Use the ratings and priorities from the CFSA in conjunction with the Action Plan to document who was involved with the self-assessment and plan next steps. In the first section of the Action Plan, document the members of the Child Find planning team, their role(s), and the organization(s) they represent. In the second section, document the Child Find improvement plan, including the planned activities, resources needed, persons responsible, timeline, and the outcomes of improvement activities. In the third section of the template, describe how stakeholders will be involved in the self-assessment and improvement plan, including timelines for involvement.    "]
[]
["\n\n\n","Data"]
[null,"There is a \"Get Data\" button to the right.  If you do not see the button, please save and close this workbook and, when re-opening the workbook, be sure to click \"Enable Macros\" and \"Enable Content\" when prompted. These settings are important to access the full functionality of this workbook."]
[null,"The Get Data button (to the right) will generate a sheet with data for current theme and BP ratings. If additional themes are completed after creating the Data tab, click on the Get Data button again to refresh the sheet with all current data. Note: there is a time stamp in cell N1 that records when the Data tab was last updated."]
[]
[null,"Help"]
["\n\n\n\n\n\n","Read more information about various topics such as:\n       Enabling macros\n       Explanation of all the buttons on the Child Find Best Practices tab\n       How to enter data\n       How to save PDFs\n       How to use the Data tab"]
[]
[null,"Saving the Results of the Self-Assessment"]
["\n\n\n","The CFSA tool is an Excel workbook and needs to be saved just like any other workbook. We recommend saving the file with the date it was completed in the file name, e.g., CFSA_082221, and then saving the file with a new file name if you complete more components at a later date, e.g., CFSA_101521. Save the file often while you are working in it."]
[]
[null,"Printing the Results of the Self-Assessment"]
["\n","Table of Contents: Prints 1 page, portrait (vertical). Print as you normally would (File, Print)."]
["\n\n\n","Child Find Best Practices: Prints landscape (horizontal) with a variable number of pages depending on how much text is entered in the Evidence boxes.  To print as you normally would, please click on either the Hide Evidence or Show Evidence (whichever you prefer) prior to printing."]
["\n\n","You can also create a PDF of the content of this tab and print the PDF using one of the Print PDF buttons at the top of the page."]
["\n","Theme Summary: Prints 1 page, landscape (horizontal). Print as you normally would (File, Print)."]
["\n\n\n","Action Plan: Prints landscape (horizontal) with a variable number of pages depending on how much text is entered in the rows. If the row height does not automatically adjust to the amount of text, you may \"manually\" adjust the row heights by clicking the \"Adjust Row Height\" button to the left of the screen in the Action Plan tab."]
["\n\n","Then, please print only the pages with data (either by selecting the print area OR by specifying which pages you'd like to print in your Print Dialog interface). "]
[]
[]
[null,"Data: Prints 3 pages, landscape (horizontal). Print as you normally would (File, Print)."]
[null,"For guidance troubleshooting common challenges, view the Help tab in this workbook. "]
[]
[null,{"$f":"IFERROR(MID(B94,B96,B95-B96),\"Final characters of filename must be version number starting with v####\")","v":"Final characters of filename must be version number starting with v####"}]
[null,{"$f":"CELL(\"Filename\",A1)","v":{"$error":"#VALUE!"}}]
[null,{"$f":"FIND(\".xlsm\",B94)","v":{"$error":"#VALUE!"}}]
[null,{"$f":"FIND(\"v\",B94,B95-12)","v":{"$error":"#VALUE!"}}]

{"sheet":"Table of Contents","index":2,"n_rows":36,"n_cols":3,"rows_kept":36,"cut":false,"hidden":false,"merged":[[5,1,5,2],[21,1,21,2],[1,1,1,2],[25,1,25,2],[33,1,33,2],[3,1,3,2],[29,1,29,2]]}
[]
[null,"Table of Contents"]
[]
[null,"Instructions"]
[]
[null,"Child Find Best Practices"]
[]
[null,null,"Cross-Sector Collaboration"]
[]
[null,null,"Identifying Children who are Underserved by Part B"]
[]
[null,null,"Data and Data Systems"]
[]
[null,null,"Technical Adequacy of Screening Tools"]
[]
[null,null,"Efficiency of Screening and Referral Process and Procedures"]
[]
[null,null,"Responding When Children are Found Ineligible for Part B"]
[]
[null,null,"Evaluation of Child Find"]
[]
[null,"Theme Summary"]
[]
[null,null,"Summary ratings for each Theme (calculated from Best Practices ratings)"]
[]
[null,"Action Plan"]
[]
[null,null,"Child Find Action Plan (roster of team members, activities, etc.)"]
[]
[null,"Data"]
[]
[null,null,"Exportable data file updated via \"Get Data\" button"]
[null,null,"(see Instructions tab for more information)"]
[null,"Help"]
[]
[null,null,"Click a topic to view more information and some trouble-shooting ideas"]

{"sheet":"Child Find Best Practices","index":3,"n_rows":114,"n_cols":27,"rows_kept":114,"cut":false,"hidden":false,"merged":[[52,17,53,17],[53,5,53,8],[54,4,54,8],[54,10,55,10],[54,11,55,11],[54,13,55,13],[54,17,55,17],[55,5,55,8],[47,22,48,23],[48,4,48,8],[48,10,49,10],[48,11,49,11],[48,13,49,13],[48,17,49,17],[48,18,48,21],[49,5,49,8],[49,18,49,21],[71,17,72,17],[72,5,72,8],[46,4,46,8],[46,10,47,10],[46,11,47,11],[46,13,47,13],[46,17,47,17],[47,5,47,8],[50,4,50,8],[50,10,51,10],[50,11,51,11],[50,13,51,13],[50,17,51,17],[51,5,51,8],[52,4,52,8],[52,10,53,10],[52,11,53,11],[52,13,53,13],[67,17,68,17],[68,5,68,8],[69,4,69,8],[69,10,70,10],[69,11,70,11],[69,13,70,13],[69,17,70,17],[70,5,70,8],[22,13,23,13],[22,17,23,17],[23,5,23,8],[67,4,67,8],[67,10,68,10],[67,11,68,11],[65,17,66,17],[63,4,63,8],[63,10,64,10],[63,11,64,11],[63,13,64,13],[63,17,64,17],[64,5,64,8],[59,17,60,17],[60,5,60,8],[57,4,57,8],[59,4,59,8],[58,4,58,8],[44,4,44,8],[44,10,45,10],[44,11,45,11],[44,13,45,13],[112,4,112,8],[112,10,113,10],[112,11,113,11],[112,13,113,13],[112,17,113,17],[113,5,113,8],[88,4,88,8],[88,10,89,10],[88,11,89,11],[88,13,89,13],[88,17,89,17],[89,5,89,8],[90,4,90,8],[90,10,91,10],[90,11,91,11],[90,13,91,13],[90,17,91,17],[91,5,91,8],[110,4,110,8],[110,10,111,10],[110,11,111,11],[110,13,111,13],[110,17,111,17],[111,5,111,8],[108,4,108,8],[108,10,109,10],[108,11,109,11],[108,13,109,13],[108,17,109,17],[109,5,109,8],[104,17,105,17],[105,5,105,8],[105,22,106,23],[106,4,106,8],[106,10,107,10],[106,11,107,11],[106,13,107,13],[106,17,107,17],[106,18,106,21],[107,5,107,8],[107,18,107,21],[102,4,102,8],[104,4,104,8],[104,10,105,10],[104,11,105,11],[104,13,105,13],[103,4,103,8],[99,4,99,8],[99,10,100,10],[99,11,100,11],[99,13,100,13],[99,17,100,17],[100,5,100,8],[95,17,96,17],[96,5,96,8],[96,22,97,23],[97,4,97,8],[97,10,98,10],[97,11,98,11],[97,13,98,13],[97,17,98,17],[97,18,97,21],[98,5,98,8],[98,18,98,21],[93,4,93,8],[95,4,95,8],[95,10,96,10],[95,11,96,11],[95,13,96,13],[94,4,94,8],[86,4,86,8],[86,10,87,10],[86,11,87,11],[86,13,87,13],[86,17,87,17],[87,5,87,8],[82,4,82,8],[82,10,83,10],[82,11,83,11],[82,13,83,13],[82,17,83,17],[83,5,83,8],[80,4,80,8],[80,10,81,10],[80,11,81,11],[80,13,81,13],[80,17,81,17],[81,5,81,8],[84,4,84,8],[84,10,85,10],[84,11,85,11],[84,13,85,13],[84,17,85,17],[85,5,85,8],[76,17,77,17],[77,5,77,8],[77,22,78,23],[78,4,78,8],[78,10,79,10],[78,11,79,11],[78,13,79,13],[78,17,79,17],[78,18,78,21],[79,5,79,8],[79,18,79,21],[74,4,74,8],[76,4,76,8],[76,10,77,10],[76,11,77,11],[76,13,77,13],[75,4,75,8],[65,4,65,8],[65,10,66,10],[65,11,66,11],[65,13,66,13],[67,13,68,13],[71,4,71,8],[71,10,72,10],[71,11,72,11],[71,13,72,13],[66,5,66,8],[60,22,61,23],[61,4,61,8],[61,10,62,10],[61,11,62,11],[61,13,62,13],[61,17,62,17],[61,18,61,21],[62,5,62,8],[62,18,62,21],[59,10,60,10],[59,11,60,11],[59,13,60,13],[44,17,45,17],[45,5,45,8],[42,4,42,8],[42,10,43,10],[42,11,43,11],[42,13,43,13],[42,17,43,17],[43,5,43,8],[40,4,40,8],[40,10,41,10],[40,11,41,11],[40,13,41,13],[40,17,41,17],[41,5,41,8],[36,17,37,17],[37,5,37,8],[37,22,38,23],[38,4,38,8],[38,10,39,10],[38,11,39,11],[38,13,39,13],[38,17,39,17],[38,18,38,21],[39,5,39,8],[39,18,39,21],[34,4,34,8],[36,4,36,8],[36,10,37,10],[36,11,37,11],[36,13,37,13],[35,4,35,8],[31,4,31,8],[31,10,32,10],[31,11,32,11],[31,13,32,13],[22,4,22,8],[22,10,23,10],[22,11,23,11],[25,4,25,8],[26,4,26,8],[27,4,27,8],[27,10,28,10],[27,11,28,11],[28,22,29,23],[29,4,29,8],[29,10,30,10],[29,11,30,11],[29,13,30,13],[29,17,30,17],[29,18,29,21],[30,5,30,8],[30,18,30,21],[27,13,28,13],[17,5,17,8],[5,4,5,8],[16,4,16,8],[16,10,17,10],[14,17,15,17],[15,5,15,8],[14,10,15,10],[14,11,15,11],[31,17,32,17],[32,5,32,8],[27,17,28,17],[28,5,28,8],[18,4,18,8],[18,10,19,10],[18,11,19,11],[18,13,19,13],[18,17,19,17],[19,5,19,8],[20,4,20,8],[20,10,21,10],[20,11,21,11],[20,13,21,13],[20,17,21,17],[21,5,21,8],[6,17,7,17],[16,11,17,11],[16,13,17,13],[14,13,15,13],[8,18,8,21],[9,18,9,21],[6,10,7,10],[6,13,7,13],[8,13,9,13],[10,13,11,13],[12,13,13,13],[6,11,7,11],[16,17,17,17],[12,4,12,8],[4,4,4,8],[14,4,14,8],[6,4,6,8],[8,4,8,8],[3,23,4,23],[3,22,4,22],[7,22,8,23],[8,10,9,10],[8,11,9,11],[10,10,11,10],[10,11,11,11],[12,10,13,10],[12,11,13,11],[3,10,3,11],[8,17,9,17],[10,17,11,17],[12,17,13,17],[10,4,10,8],[7,5,7,8],[9,5,9,8],[11,5,11,8],[13,5,13,8],[3,18,3,21]]}
[{"$f":"D1&\"_\"&A2&\"_\"&TEXT(NOW(),\"DD-MMM-YYYY\")","v":"Child Find Best Practices_withEvidence_24-Feb-2022"},null,null,"Child Find Best Practices",null,null,null,null,null,null,null,null,null,null,null,null,null,null,null,null,null,null,null,null,null,{"$f":"E1&F1","v":""}]
["withEvidence",null,null,null,null,null,null,null,null,null,null,null,null,null,null,null,null,null,null,null,null,null,null,null,null,""]
[null,null,null,null,null,null,null,null,null,null,null,null,null,null,null,null,null,null,null,null,null,null,null,null,null,""]
[null,"Index",{"$f":"MID(CELL(\"Filename\",C1),FIND(\"]\",CELL(\"Filename\",C1))+1,255)","v":{"$error":"#VALUE!"}},null,null,null,null,null,null,null,"Rating",null,null,"Priority",null,null,null,null,null,null,null,null,null,null,null,""]
[null,{"$f":"IF(D5=\"\",\"\",IF(LEN(D5)>1,\"T-\"&\"BP\"&RIGHT(D5)&\"-0\",\"B-\"&MID(B3,3,3)&\"-\"&D5))","v":"T-BP1-0"},null,"Theme 1","Cross-Sector Collaboration",null,null,null,null,null,"Theme Rating: ",{"$f":"VLOOKUP(B5,ALLdata!A:H,8,FALSE)","v":0},null,null,null,null,{"$f":"IF(E5=\"Evidence:\",1,0)","v":0},null,null,null,null,null,null,null,null,{"$f":"E5&F5","v":"Cross-Sector Collaboration"},{"$f":"K5","v":"Theme Rating: "}]
[null,"",null,null,"The practices in this section focus on cross-sector collaboration to support states and Local Education Agencies (LEAs) in identifying young children who may be eligible for Part B services. Ongoing and effective collaborative relationships with local community agencies and early childhood programs supports the appropriate referral by families of young children to Part B. Effective collaborative relationships are those where there is ongoing communication and adherence to child find procedures.",null,null,null,null,null,null,null,null,null,null,null,1,null,null,null,null,null,null,null,null,"The practices in this section focus on cross-sector collaboration to support states and Local Education Agencies (LEAs) in identifying young children who may be eligible for Part B services. Ongoing and effective collaborative relationships with local community agencies and early childhood programs supports the appropriate referral by families of young children to Part B. Effective collaborative relationships are those where there is ongoing communication and adherence to child find procedures."]
[null,"B-BP1-a",null,"a","Leverage federal or state-funded early childhood systems initiatives and coordinate with collaborating agencies to promote child find awareness, screening, and referral efforts.",null,null,null,null,null,"Best Practice Rating:",null,null,null,null,null,0,null,null,null,null,null,null,null,null,"Leverage federal or state-funded early childhood systems initiatives and coordinate with collaborating agencies to promote child find awareness, screening, and referral efforts.",{"$f":"K7","v":"Best Practice Rating:"}]
[null,"",null,null,"Evidence:",null,null,null,null,null,null,null,null,null,null,null,1,null,null,null,null,null,null,null,null,"Evidence:"]
[null,"B-BP1-b",null,"b","Collaborate with Part C and other community organizations serving children and families to promote child find awareness efforts.",null,null,null,null,null,"Best Practice Rating:",null,null,null,null,null,0,null,null,null,null,null,null,null,null,"Collaborate with Part C and other community organizations serving children and families to promote child find awareness efforts.",{"$f":"K9","v":"Best Practice Rating:"}]
[null,"",null,null,"Evidence:",null,null,null,null,null,null,null,null,null,null,null,1,null,null,null,null,null,null,null,null,"Evidence:"]
[null,"B-BP1-c",null,"c","Establish policies and procedures that support ongoing and effective communication and collaborative relationships between Part C and Part B to support transition.",null,null,null,null,null,"Best Practice Rating:",null,null,null,null,null,0,null,null,null,null,null,null,null,null,"Establish policies and procedures that support ongoing and effective communication and collaborative relationships between Part C and Part B to support transition.",{"$f":"K11","v":"Best Practice Rating:"}]
[null,"",null,null,"Evidence:",null,null,null,null,null,null,null,null,null,null,null,1,null,null,null,null,null,null,null,null,"Evidence:"]
[null,"B-BP1-d",null,"d","Establish policies and procedures to support ongoing collaborative relationships with community agencies that serve underserved and at-risk populations.",null,null,null,null,null,"Best Practice Rating:",null,null,null,null,null,0,null,null,null,null,null,null,null,null,"Establish policies and procedures to support ongoing collaborative relationships with community agencies that serve underserved and at-risk populations.",{"$f":"K13","v":"Best Practice Rating:"}]
[null,"",null,null,"Evidence:",null,null,null,null,null,null,null,null,null,null,null,1,null,null,null,null,null,null,null,null,"Evidence:"]
[null,"B-BP1-e",null,"e","Collaborate with community organizations serving children and families to promote screening efforts (e.g., implementing community-wide screening) and referral efforts. Conduct regular conversations with community partners to develop shared awareness of local monitoring, screening, and referral efforts and sources.",null,null,null,null,null,"Best Practice Rating:",null,null,null,null,null,0,null,null,null,null,null,null,null,null,"Collaborate with community organizations serving children and families to promote screening efforts (e.g., implementing community-wide screening) and referral efforts. Conduct regular conversations with community partners to develop shared awareness of local monitoring, screening, and referral efforts and sources.",{"$f":"K15","v":"Best Practice Rating:"}]
[null,"",null,null,"Evidence:",null,null,null,null,null,null,null,null,null,null,null,1,null,null,null,null,null,null,null,null,"Evidence:"]
[null,"B-BP1-f",null,"f","Collaborate with child care programs, private schools, and charter schools to promote pathways for screening and referral for children served by those programs.",null,null,null,null,null,"Best Practice Rating:",null,null,null,null,null,{"$f":"IF(E17=\"Evidence:\",1,0)","v":0},null,null,null,null,null,null,null,null,{"$f":"E17&F17","v":"Collaborate with child care programs, private schools, and charter schools to promote pathways for screening and referral for children served by those programs."},{"$f":"K17","v":"Best Practice Rating:"}]
[null,"",null,null,"Evidence:",null,null,null,null,null,null,null,null,null,null,null,1,null,null,null,null,null,null,null,null,"Evidence:"]
[null,"B-BP1-g",null,"g","Collaborate with community agencies to promote partnerships with families to promote the referral process.",null,null,null,null,null,"Best Practice Rating:",null,null,null,null,null,{"$f":"IF(E19=\"Evidence:\",1,0)","v":0},null,null,null,null,null,null,null,null,{"$f":"E19&F19","v":"Collaborate with community agencies to promote partnerships with families to promote the referral process."},{"$f":"K19","v":"Best Practice Rating:"}]
[null,"",null,null,"Evidence:",null,null,null,null,null,null,null,null,null,null,null,1,null,null,null,null,null,null,null,null,"Evidence:"]
[null,"B-BP1-h",null,"h","Coordinate with surrounding Local Educatin Agencies (LEAs) to streamline referral process.",null,null,null,null,null,"Best Practice Rating:",null,null,null,null,null,{"$f":"IF(E21=\"Evidence:\",1,0)","v":0},null,null,null,null,null,null,null,null,{"$f":"E21&F21","v":"Coordinate with surrounding Local Educatin Agencies (LEAs) to streamline referral process."},{"$f":"K21","v":"Best Practice Rating:"}]
[null,"",null,null,"Evidence:",null,null,null,null,null,null,null,null,null,null,null,1,null,null,null,null,null,null,null,null,"Evidence:"]
[null,"B-BP1-i",null,"i","Implement respectful and appropriate pre-referral education and information-sharing with families to support their understanding of the importance of early childhood special education (ECSE) and to reduce stigma.",null,null,null,null,null,"Best Practice Rating:",null,null,null,null,null,{"$f":"IF(E23=\"Evidence:\",1,0)","v":0},null,null,null,null,null,null,null,null,{"$f":"E23&F23","v":"Implement respectful and appropriate pre-referral education and information-sharing with families to support their understanding of the importance of early childhood special education (ECSE) and to reduce stigma."},{"$f":"K23","v":"Best Practice Rating:"}]
[null,"",null,null,"Evidence:",null,null,null,null,null,null,null,null,null,null,null,1,null,null,null,null,null,null,null,null,"Evidence:"]
[null,""]
[null,"T-BP2-0",null,"Theme 2","Identifying Children who are Underserved by Part B",null,null,null,null,null,"Theme Rating: ",{"$f":"VLOOKUP(B26,ALLdata!A:H,8,FALSE)","v":0},null,null,null,null,{"$f":"IF(E26=\"Evidence:\",1,0)","v":0},null,null,null,null,null,null,null,null,{"$f":"E26&F26","v":"Identifying Children who are Underserved by Part B"},{"$f":"K26","v":"Theme Rating: "}]
[null,"",null,null,"The practices in this section focus on strategies for states and LEAs to consider when reaching out to underserved populations so that equal opportunity is provided for participation in Part B. Some preschool-aged children with disabilities are not readily screened and enrolled in Part B. This can be related to a lack of access to adequate screening in the settings where they receive child care or medical services, or related to the family’s understanding of the importance of early childhood special education services, among other things.",null,null,null,null,null,null,null,null,null,null,null,1,null,null,null,null,null,null,null,null,"The practices in this section focus on strategies for states and LEAs to consider when reaching out to underserved populations so that equal opportunity is provided for participation in Part B. Some preschool-aged children with disabilities are not readily screened and enrolled in Part B. This can be related to a lack of access to adequate screening in the settings where they receive child care or medical services, or related to the family’s understanding of the importance of early childhood special education services, among other things."]
[null,"B-BP2-a",null,"a","With partner organizations, target materials describing early childhood special education and the associated referral process towards underserved populations. Ensure that families are able to access materials in various formats, including in their native language.",null,null,null,null,null,"Best Practice Rating:",null,null,null,null,null,{"$f":"IF(E28=\"Evidence:\",1,0)","v":0},null,null,null,null,null,null,null,null,{"$f":"E28&F28","v":"With partner organizations, target materials describing early childhood special education and the associated referral process towards underserved populations. Ensure that families are able to access materials in various formats, including in their native language."},{"$f":"K28","v":"Best Practice Rating:"}]
[null,"",null,null,"Evidence:",null,null,null,null,null,null,null,null,null,null,null,1,null,null,null,null,null,null,null,null,"Evidence:",0]
[null,"B-BP2-b",null,"b","Use strategies such as a 211 telephone-based service to connect families to resources related to developmental screening, referral to LEAs, and other community resources.",null,null,null,null,null,"Best Practice Rating:",null,null,null,null,null,0,null,null,null,null,null,null,null,null,"Use strategies such as a 211 telephone-based service to connect families to resources related to developmental screening, referral to LEAs, and other community resources.","Best Practice Rating:"]
[null,"",null,null,"Evidence:",null,null,null,null,null,null,null,null,null,null,null,1,null,null,null,null,null,null,null,null,"Evidence:",0]
[null,"B-BP2-c",null,"c","Engage community health workers, trusted community members, and other cultural brokers to advocate for and facilitate the child find process. Cultural brokers are individuals who promote family engagement and help to bridge relationships between the community and the LEA.",null,null,null,null,null,"Best Practice Rating:",null,null,null,null,null,0,null,null,null,null,null,null,null,null,"Engage community health workers, trusted community members, and other cultural brokers to advocate for and facilitate the child find process. Cultural brokers are individuals who promote family engagement and help to bridge relationships between the community and the LEA.","Best Practice Rating:"]
[null,"",null,null,"Evidence:",null,null,null,null,null,null,null,null,null,null,null,1,null,null,null,null,null,null,null,null,"Evidence:",0]
[null,""]
[null,"T-BP3-0",null,"Theme 3","Data and Data Systems",null,null,null,null,null,"Theme Rating: ",{"$f":"VLOOKUP(B35,ALLdata!A:H,8,FALSE)","v":4},null,null,null,null,{"$f":"IF(E35=\"Evidence:\",1,0)","v":0},null,null,null,null,null,null,null,null,{"$f":"E35&F35","v":"Data and Data Systems"},{"$f":"K35","v":"Theme Rating: "}]
[null,"",null,null,"This section covers practices, processes, and procedures related to state and local data governance, data collection, data management, data sharing, and data systems to support the child find process. Data systems are a powerful tool for managing information across programs serving young children and within Part B programs.",null,null,null,null,null,null,null,null,null,null,null,1,null,null,null,null,null,null,null,null,"This section covers practices, processes, and procedures related to state and local data governance, data collection, data management, data sharing, and data systems to support the child find process. Data systems are a powerful tool for managing information across programs serving young children and within Part B programs."]
[null,{"$f":"IF(D37=\"\",\"\",IF(LEN(D37)>1,\"T-\"&\"BP\"&RIGHT(D37)&\"-0\",\"B-\"&MID(B35,3,3)&\"-\"&D37))","v":"B-BP3-a"},null,"a","States and LEAs have formal data governance structures and processes in place to ensure the protection and security of child find data. There are written policies and procedures that manage the appropriate access of data, transmission of data, and sharing of individualized education program (IEP) information.",null,null,null,null,null,"Best Practice Rating:",2,null,"M",null,null,0,null,null,null,null,null,null,null,null,"States and LEAs have formal data governance structures and processes in place to ensure the protection and security of child find data. There are written policies and procedures that manage the appropriate access of data, transmission of data, and sharing of individualized education program (IEP) information.",{"$f":"K37","v":"Best Practice Rating:"}]
[null,"",null,null,"Evidence:",null,null,null,null,null,null,null,null,null,null,null,1,null,null,null,null,null,null,null,null,"Evidence:",0]
[null,"B-BP3-b",null,"b","Establish necessary data sharing agreements, such as memorandums of understanding (MOU), with collaborating agencies and programs in accordance with federal and state data privacy laws and regulations, including the Health Insurance Portability and Accountability Act (HIPAA) and Family Educational Rights and Privacy Act (FERPA).",null,null,null,null,null,"Best Practice Rating:",3,null,"H",null,null,0,null,null,null,null,null,null,null,null,"Establish necessary data sharing agreements, such as memorandums of understanding (MOU), with collaborating agencies and programs in accordance with federal and state data privacy laws and regulations, including the Health Insurance Portability and Accountability Act (HIPAA) and Family Educational Rights and Privacy Act (FERPA).","Best Practice Rating:"]
[null,"",null,null,"Evidence:",null,null,null,null,null,null,null,null,null,null,null,1,null,null,null,null,null,null,null,null,"Evidence:",0]
[null,"B-BP3-c",null,"c","State and local data systems include sufficient technical security measures (e.g., firewalls, secure laptops, password, management, etc.) and nontechnical security measures (e.g., data access and sharing restrictions, regular staff trainings, ensuring correct access and administrative rights are granted for staff and authorized data users) to minimize the risk of disclosing Personally Identifiable Information (PII).",null,null,null,null,null,"Best Practice Rating:",1,null,"L",null,null,0,null,null,null,null,null,null,null,null,"State and local data systems include sufficient technical security measures (e.g., firewalls, secure laptops, password, management, etc.) and nontechnical security measures (e.g., data access and sharing restrictions, regular staff trainings, ensuring correct access and administrative rights are granted for staff and authorized data users) to minimize the risk of disclosing Personally Identifiable Information (PII).","Best Practice Rating:"]
[null,"",null,null,"Evidence:",null,null,null,null,null,null,null,null,null,null,null,1,null,null,null,null,null,null,null,null,"Evidence:",0]
[null,"B-BP3-d",null,"d","State and local data systems have the capacity to support accountability, program development, and program operations and includes BestPractices and features of high-quality data systems.",null,null,null,null,null,"Best Practice Rating:",4,null,null,null,null,0,null,null,null,null,null,null,null,null,"State and local data systems have the capacity to support accountability, program development, and program operations and includes BestPractices and features of high-quality data systems.","Best Practice Rating:"]
[null,"",null,null,"Evidence:",null,null,null,null,null,null,null,null,null,null,null,1,null,null,null,null,null,null,null,null,"Evidence:",0]
[null,"B-BP3-e",null,"e","State and local data systems have the capacity for data interoperability to allow the linking of Part B data with other statewide longitudinal and early childhood data systems, including Part C data systems.",null,null,null,null,null,"Best Practice Rating:",1,null,null,null,null,0,null,null,null,null,null,null,null,null,"State and local data systems have the capacity for data interoperability to allow the linking of Part B data with other statewide longitudinal and early childhood data systems, including Part C data systems.","Best Practice Rating:"]
[null,"",null,null,"Evidence:",null,null,null,null,null,null,null,null,null,null,null,1,null,null,null,null,null,null,null,null,"Evidence:",0]
[null,"B-BP3-f",null,"f","The data collected are high-quality.",null,null,null,null,null,"Best Practice Rating:",4,null,null,null,null,{"$f":"IF(E47=\"Evidence:\",1,0)","v":0},null,null,null,null,null,null,null,null,{"$f":"E47&F47","v":"The data collected are high-quality."},{"$f":"K47","v":"Best Practice Rating:"}]
[null,"",null,null,"Evidence:",null,null,null,null,null,null,null,null,null,null,null,1,null,null,null,null,null,null,null,null,"Evidence:",0]
[null,"B-BP3-g",null,"g","Referral information is included in the data system.",null,null,null,null,null,"Best Practice Rating:",null,null,null,null,null,0,null,null,null,null,null,null,null,null,"Referral information is included in the data system.","Best Practice Rating:"]
[null,"",null,null,"Evidence:",null,null,null,null,null,null,null,null,null,null,null,1,null,null,null,null,null,null,null,null,"Evidence:",0]
[null,"B-BP3-h",null,"h","State and local data systems, directly or through a related application, have reporting and analysis tools that provide end users, including state and local program staff, with easy access to the data in both raw form and reports.",null,null,null,null,null,"Best Practice Rating:",null,null,null,null,null,0,null,null,null,null,null,null,null,null,"State and local data systems, directly or through a related application, have reporting and analysis tools that provide end users, including state and local program staff, with easy access to the data in both raw form and reports.","Best Practice Rating:"]
[null,"",null,null,"Evidence:",null,null,null,null,null,null,null,null,null,null,null,1,null,null,null,null,null,null,null,null,"Evidence:",0]
[null,"B-BP3-i",null,"i","State and local data systems feature methods for identifying underserved populations.",null,null,null,null,null,"Best Practice Rating:",null,null,null,null,null,0,null,null,null,null,null,null,null,null,"State and local data systems feature methods for identifying underserved populations.","Best Practice Rating:"]
[null,"",null,null,"Evidence:",null,null,null,null,null,null,null,null,null,null,null,1,null,null,null,null,null,null,null,null,"Evidence:",0]
[null,"B-BP3-j",null,"j","Reports generated from the data systems include metrics that are useful for monitoring the child find system.",null,null,null,null,null,"Best Practice Rating:",null,null,null,null,null,0,null,null,null,null,null,null,null,null,"Reports generated from the data systems include metrics that are useful for monitoring the child find system.","Best Practice Rating:"]
[null,"",null,null,"Evidence:",null,null,null,null,null,null,null,null,null,null,null,1,null,null,null,null,null,null,null,null,"Evidence:",0]
[null,""]
[null,"T-BP4-0",null,"Theme 4","Technical Adequacy of Screening Tools",null,null,null,null,null,"Theme Rating: ",{"$f":"VLOOKUP(B58,ALLdata!A:H,8,FALSE)","v":0},null,null,null,null,{"$f":"IF(E58=\"Evidence:\",1,0)","v":0},null,null,null,null,null,null,null,null,{"$f":"E58&F58","v":"Technical Adequacy of Screening Tools"},{"$f":"K58","v":"Theme Rating: "}]
[null,"",null,null,"The practices in this section relate to the characteristics of screening tools and their administration. Tools used for screening purposes must meet standards for technical adequacy and be implemented consistently and appropriately to minimize under- or over-identification.",null,null,null,null,null,null,null,null,null,null,null,1,null,null,null,null,null,null,null,null,"The practices in this section relate to the characteristics of screening tools and their administration. Tools used for screening purposes must meet standards for technical adequacy and be implemented consistently and appropriately to minimize under- or over-identification."]
[null,"B-BP4-a",null,"a","Screening tools are used for the purpose in which they are intended.",null,null,null,null,null,"Best Practice Rating:",null,null,null,null,null,0,null,null,null,null,null,null,null,null,"Screening tools are used for the purpose in which they are intended.",{"$f":"K60","v":"Best Practice Rating:"}]
[null,"",null,null,"Evidence:",null,null,null,null,null,null,null,null,null,null,null,1,null,null,null,null,null,null,null,null,"Evidence:",0]
[null,"B-BP4-b",null,"b","Standardized developmental screening tools with strong psychometric properties and sufficient sensitivity to detect child progress are used.",null,null,null,null,null,"Best Practice Rating:",null,null,null,null,null,0,null,null,null,null,null,null,null,null,"Standardized developmental screening tools with strong psychometric properties and sufficient sensitivity to detect child progress are used.","Best Practice Rating:"]
[null,"",null,null,"Evidence:",null,null,null,null,null,null,null,null,null,null,null,1,null,null,null,null,null,null,null,null,"Evidence:",0]
[null,"B-BP4-c",null,"c","Screening tools are brief and have a reduced literacy burden.",null,null,null,null,null,"Best Practice Rating:",null,null,null,null,null,0,null,null,null,null,null,null,null,null,"Screening tools are brief and have a reduced literacy burden.","Best Practice Rating:"]
[null,"",null,null,"Evidence:",null,null,null,null,null,null,null,null,null,null,null,1,null,null,null,null,null,null,null,null,"Evidence:",0]
[null,"B-BP4-d",null,"d","Developmental screening tools include social-emotional development.",null,null,null,null,null,"Best Practice Rating:",null,null,null,null,null,0,null,null,null,null,null,null,null,null,"Developmental screening tools include social-emotional development.","Best Practice Rating:"]
[null,"",null,null,"Evidence:",null,null,null,null,null,null,null,null,null,null,null,1,null,null,null,null,null,null,null,null,"Evidence:",0]
[null,"B-BP4-e",null,"e","Individuals conducting screenings are qualified and trained in the instrument’s administration, scoring, and interpretation of results.",null,null,null,null,null,"Best Practice Rating:",null,null,null,null,null,{"$f":"IF(E68=\"Evidence:\",1,0)","v":0},null,null,null,null,null,null,null,null,{"$f":"E68&F68","v":"Individuals conducting screenings are qualified and trained in the instrument’s administration, scoring, and interpretation of results."},{"$f":"K68","v":"Best Practice Rating:"}]
[null,{"$f":"IF(D69=\"\",\"\",IF(LEN(D69)>1,\"T-\"&\"BP\"&RIGHT(D69)&\"-0\",\"B-\"&MID(B67,3,3)&\"-\"&D69))","v":""},null,null,"Evidence:",null,null,null,null,null,null,null,null,null,null,null,1,null,null,null,null,null,null,null,null,"Evidence:",0]
[null,"B-BP4-f",null,"f","Screening tools are culturally and linguistically appropriate for the individual child. Interpreters administer screenings in the child’s dominant language.",null,null,null,null,null,"Best Practice Rating:",null,null,null,null,null,0,null,null,null,null,null,null,null,null,"Screening tools are culturally and linguistically appropriate for the individual child. Interpreters administer screenings in the child’s dominant language.","Best Practice Rating:"]
[null,"",null,null,"Evidence:",null,null,null,null,null,null,null,null,null,null,null,1,null,null,null,null,null,null,null,null,"Evidence:",0]
[null,"B-BP4-g",null,"g","Valid and reliable screening tools are available to use in-person and remotely.",null,null,null,null,null,"Best Practice Rating:",null,null,null,null,null,0,null,null,null,null,null,null,null,null,"Valid and reliable screening tools are available to use in-person and remotely.","Best Practice Rating:"]
[null,"",null,null,"Evidence:",null,null,null,null,null,null,null,null,null,null,null,1,null,null,null,null,null,null,null,null,"Evidence:",0]
[null,{"$f":"IF(D74=\"\",\"\",IF(LEN(D74)>1,\"T-\"&\"BP\"&RIGHT(D74)&\"-0\",\"B-\"&MID(#REF!,3,3)&\"-\"&D74))","v":""}]
[null,{"$f":"IF(D75=\"\",\"\",IF(LEN(D75)>1,\"T-\"&\"BP\"&RIGHT(D75)&\"-0\",\"B-\"&MID(#REF!,3,3)&\"-\"&D75))","v":"T-BP5-0"},null,"Theme 5","Efficiency of Screening and Referral Process and Procedures",null,null,null,null,null,"Theme Rating: ",{"$f":"VLOOKUP(B75,ALLdata!A:H,8,FALSE)","v":0},null,null,null,null,{"$f":"IF(E75=\"Evidence:\",1,0)","v":0},null,null,null,null,null,null,null,null,{"$f":"E75&F75","v":"Efficiency of Screening and Referral Process and Procedures"},{"$f":"K75","v":"Theme Rating: "}]
[null,"",null,null,"The practices in this section support efficiency and effectiveness of child find processes and procedures. These include coordination with collaborating agencies that are already screening children, cultural considerations for screening, and referral within multi-tiered systems of support.",null,null,null,null,null,null,null,null,null,null,null,1,null,null,null,null,null,null,null,null,"The practices in this section support efficiency and effectiveness of child find processes and procedures. These include coordination with collaborating agencies that are already screening children, cultural considerations for screening, and referral within multi-tiered systems of support."]
[null,"B-BP5-a",null,"a","Ensure screening opportunities reach all children by coordinating with community-wide screening efforts to meet existing and essential timelines and recommendations for screenings (e.g., health, vision, hearing, immunizations) and ensure children are referred appropriately.",null,null,null,null,null,"Best Practice Rating:",null,null,null,null,null,0,null,null,null,null,null,null,null,null,"Ensure screening opportunities reach all children by coordinating with community-wide screening efforts to meet existing and essential timelines and recommendations for screenings (e.g., health, vision, hearing, immunizations) and ensure children are referred appropriately.",{"$f":"K77","v":"Best Practice Rating:"}]
[null,"",null,null,"Evidence:",null,null,null,null,null,null,null,null,null,null,null,1,null,null,null,null,null,null,null,null,"Evidence:",0]
[null,"B-BP5-b",null,"b","The early childhood community coordinates with physician developmental monitoring, screening, and surveillance.",null,null,null,null,null,"Best Practice Rating:",null,null,null,null,null,0,null,null,null,null,null,null,null,null,"The early childhood community coordinates with physician developmental monitoring, screening, and surveillance.","Best Practice Rating:"]
[null,"",null,null,"Evidence:",null,null,null,null,null,null,null,null,null,null,null,1,null,null,null,null,null,null,null,null,"Evidence:",0]
[null,"B-BP5-c",null,"c","Screening involves family partnership and perspectives, considers family preferences and cultural contexts, and is conducted in the child’s dominant language.",null,null,null,null,null,"Best Practice Rating:",null,null,null,null,null,0,null,null,null,null,null,null,null,null,"Screening involves family partnership and perspectives, considers family preferences and cultural contexts, and is conducted in the child’s dominant language.","Best Practice Rating:"]
[null,"",null,null,"Evidence:",null,null,null,null,null,null,null,null,null,null,null,1,null,null,null,null,null,null,null,null,"Evidence:",0]
[null,"B-BP5-d",null,"d","Simple, straightforward referral processes are used to facilitate ease of referral by the family, which may include the use of a universal intake form or information form.",null,null,null,null,null,"Best Practice Rating:",null,null,null,null,null,0,null,null,null,null,null,null,null,null,"Simple, straightforward referral processes are used to facilitate ease of referral by the family, which may include the use of a universal intake form or information form.","Best Practice Rating:"]
[null,"",null,null,"Evidence:",null,null,null,null,null,null,null,null,null,null,null,1,null,null,null,null,null,null,null,null,"Evidence:",0]
[null,"B-BP5-e",null,"e","Referral information is entered into the data system.",null,null,null,null,null,"Best Practice Rating:",null,null,null,null,null,{"$f":"IF(E85=\"Evidence:\",1,0)","v":0},null,null,null,null,null,null,null,null,{"$f":"E85&F85","v":"Referral information is entered into the data system."},{"$f":"K85","v":"Best Practice Rating:"}]
[null,"",null,null,"Evidence:",null,null,null,null,null,null,null,null,null,null,null,1,null,null,null,null,null,null,null,null,"Evidence:",0]
[null,"B-BP5-f",null,"f","Within multi-tiered systems of support (e.g., RTI), children suspected of having a disability cannot be required to go through all tiers of the system before referral to early childhood special education.",null,null,null,null,null,"Best Practice Rating:",null,null,null,null,null,0,null,null,null,null,null,null,null,null,"Within multi-tiered systems of support (e.g., RTI), children suspected of having a disability cannot be required to go through all tiers of the system before referral to early childhood special education.","Best Practice Rating:"]
[null,"",null,null,"Evidence:",null,null,null,null,null,null,null,null,null,null,null,1,null,null,null,null,null,null,null,null,"Evidence:",0]
[null,"B-BP5-g",null,"g","Effective screening policies and procedures are in place to respond to disruptions caused by emergencies and natural disasters.",null,null,null,null,null,"Best Practice Rating:",null,null,null,null,null,0,null,null,null,null,null,null,null,null,"Effective screening policies and procedures are in place to respond to disruptions caused by emergencies and natural disasters.","Best Practice Rating:"]
[null,"",null,null,"Evidence:",null,null,null,null,null,null,null,null,null,null,null,1,null,null,null,null,null,null,null,null,"Evidence:",0]
[null,"B-BP5-h",null,"h","Screening and referral procedures are re-aligned to meet health and safety measures and requirements during emergencies and natural disasters.",null,null,null,null,null,"Best Practice Rating:",null,null,null,null,null,{"$f":"IF(E91=\"Evidence:\",1,0)","v":0},null,null,null,null,null,null,null,null,{"$f":"E91&F91","v":"Screening and referral procedures are re-aligned to meet health and safety measures and requirements during emergencies and natural disasters."},{"$f":"K91","v":"Best Practice Rating:"}]
[null,"",null,null,"Evidence:",null,null,null,null,null,null,null,null,null,null,null,1,null,null,null,null,null,null,null,null,"Evidence:",0]
[null,""]
[null,"T-BP6-0",null,"Theme 6","Responding When Children are Found Ineligible for Part B",null,null,null,null,null,"Theme Rating: ",{"$f":"VLOOKUP(B94,ALLdata!A:H,8,FALSE)","v":0},null,null,null,null,{"$f":"IF(E94=\"Evidence:\",1,0)","v":0},null,null,null,null,null,null,null,null,{"$f":"E94&F94","v":"Responding When Children are Found Ineligible for Part B"},{"$f":"K94","v":"Theme Rating: "}]
[null,"",null,null,"The practices in this section focus on connecting families with collaborating community agencies and resources and continued developmental surveillance when a child is found ineligible for early childhood special education. Children who are at risk but who do not initially meet eligibility criteria for early childhood special education have an increased likelihood of qualifying for special education later.",null,null,null,null,null,null,null,null,null,null,null,1,null,null,null,null,null,null,null,null,"The practices in this section focus on connecting families with collaborating community agencies and resources and continued developmental surveillance when a child is found ineligible for early childhood special education. Children who are at risk but who do not initially meet eligibility criteria for early childhood special education have an increased likelihood of qualifying for special education later."]
[null,"B-BP6-a",null,"a","Connect families to resources, local community agencies, or early childhood programs to meet family/child needs that ECSE does not currently address.",null,null,null,null,null,"Best Practice Rating:",null,null,null,null,null,0,null,null,null,null,null,null,null,null,"Connect families to resources, local community agencies, or early childhood programs to meet family/child needs that ECSE does not currently address.",{"$f":"K96","v":"Best Practice Rating:"}]
[null,"",null,null,"Evidence:",null,null,null,null,null,null,null,null,null,null,null,1,null,null,null,null,null,null,null,null,"Evidence:",0]
[null,"B-BP6-b",null,"b","Promote linkages between ECSE and a network of programs and services so that children’s developmental concerns are addressed.",null,null,null,null,null,"Best Practice Rating:",null,null,null,null,null,0,null,null,null,null,null,null,null,null,"Promote linkages between ECSE and a network of programs and services so that children’s developmental concerns are addressed.","Best Practice Rating:"]
[null,{"$f":"IF(D99=\"\",\"\",IF(LEN(D99)>1,\"T-\"&\"BP\"&RIGHT(D99)&\"-0\",\"B-\"&MID(B97,3,3)&\"-\"&D99))","v":""},null,null,"Evidence:",null,null,null,null,null,null,null,null,null,null,null,1,null,null,null,null,null,null,null,null,"Evidence:",0]
[null,"B-BP6-c",null,"c","Repeat screening and monitoring for children whose assessment scores indicated they are at risk but who did not meet eligibility criteria.",null,null,null,null,null,"Best Practice Rating:",null,null,null,null,null,0,null,null,null,null,null,null,null,null,"Repeat screening and monitoring for children whose assessment scores indicated they are at risk but who did not meet eligibility criteria.","Best Practice Rating:"]
[null,"",null,null,"Evidence:",null,null,null,null,null,null,null,null,null,null,null,1,null,null,null,null,null,null,null,null,"Evidence:",0]
[null,""]
[null,"T-BP7-0",null,"Theme 7","Evaluation of Child Find",null,null,null,null,null,"Theme Rating: ",{"$f":"VLOOKUP(B103,ALLdata!A:H,8,FALSE)","v":0},null,null,null,null,{"$f":"IF(E103=\"Evidence:\",1,0)","v":0},null,null,null,null,null,null,null,null,{"$f":"E103&F103","v":"Evaluation of Child Find"},{"$f":"K103","v":"Theme Rating: "}]
[null,"",null,null,"The practices in this section focus on methods for periodic evaluation and revision of the child find system.Like other critical components of state and local infrastructure, it is important to review and revise the child find system periodically to ensure that policies and procedures are still relevant and are being implemented with fidelity.",null,null,null,null,null,null,null,null,null,null,null,1,null,null,null,null,null,null,null,null,"The practices in this section focus on methods for periodic evaluation and revision of the child find system.Like other critical components of state and local infrastructure, it is important to review and revise the child find system periodically to ensure that policies and procedures are still relevant and are being implemented with fidelity."]
[null,"B-BP7-a",null,"a","The state has a method for evaluating the effectiveness of child find efforts across the state.",null,null,null,null,null,"Best Practice Rating:",null,null,null,null,null,0,null,null,null,null,null,null,null,null,"The state has a method for evaluating the effectiveness of child find efforts across the state.",{"$f":"K105","v":"Best Practice Rating:"}]
[null,"",null,null,"Evidence:",null,null,null,null,null,null,null,null,null,null,null,1,null,null,null,null,null,null,null,null,"Evidence:",0]
[null,"B-BP7-b",null,"b","Reports from the state data system include metrics useful for monitoring the child find system.",null,null,null,null,null,"Best Practice Rating:",null,null,null,null,null,0,null,null,null,null,null,null,null,null,"Reports from the state data system include metrics useful for monitoring the child find system.","Best Practice Rating:"]
[null,"",null,null,"Evidence:",null,null,null,null,null,null,null,null,null,null,null,1,null,null,null,null,null,null,null,null,"Evidence:",0]
[null,"B-BP7-c",null,"c","The LEA has a method for evaluating the effectiveness of local child find efforts and progress towards best practices, including experiences of parents and primary referral source.",null,null,null,null,null,"Best Practice Rating:",null,null,null,null,null,0,null,null,null,null,null,null,null,null,"The LEA has a method for evaluating the effectiveness of local child find efforts and progress towards best practices, including experiences of parents and primary referral source.","Best Practice Rating:"]
[null,"",null,null,"Evidence:",null,null,null,null,null,null,null,null,null,null,null,1,null,null,null,null,null,null,null,null,"Evidence:",0]
[null,"B-BP7-d",null,"d","The LEA data system, directly or through a related application, has reporting and analysis tools that provide end users, including state and local program staff, with easy access to the data in both raw form and reports.                                                                           ",null,null,null,null,null,"Best Practice Rating:",null,null,null,null,null,0,null,null,null,null,null,null,null,null,"The LEA data system, directly or through a related application, has reporting and analysis tools that provide end users, including state and local program staff, with easy access to the data in both raw form and reports.                                                                           ","Best Practice Rating:"]
[null,"",null,null,"Evidence:",null,null,null,null,null,null,null,null,null,null,null,1,null,null,null,null,null,null,null,null,"Evidence:",0]
[null,"B-BP7-e",null,"e","Data systems (state and LEA) feature methods for identifying underserved populations.",null,null,null,null,null,"Best Practice Rating:",null,null,null,null,null,{"$f":"IF(E113=\"Evidence:\",1,0)","v":0},null,null,null,null,null,null,null,null,{"$f":"E113&F113","v":"Data systems (state and LEA) feature methods for identifying underserved populations."},{"$f":"K113","v":"Best Practice Rating:"}]
[null,"",null,null,"Evidence:",null,null,null,null,null,null,null,null,null,null,null,1,null,null,null,null,null,null,null,null,"Evidence:",0]

{"sheet":"Theme Summary","index":4,"n_rows":33,"n_cols":30,"rows_kept":33,"cut":false,"hidden":false,"merged":[[30,2,30,8],[31,12,31,18],[32,2,32,8],[33,12,33,18],[19,12,19,18],[25,12,25,18],[26,2,26,8],[27,12,27,18],[28,2,28,8],[29,12,29,18],[20,2,20,8],[21,12,21,18],[22,2,22,8],[23,12,23,18],[24,2,24,8],[19,2,19,8],[7,2,7,8],[4,12,4,18],[0,26,0,28],[1,26,1,28],[0,21,0,24],[1,21,1,24],[0,19,2,19],[0,2,1,8],[1,9,1,18],[5,2,5,8],[3,2,3,8],[6,12,6,18],[8,12,8,18],[9,2,9,8],[11,2,11,8],[18,12,18,18],[16,12,16,18],[14,12,14,18],[12,12,12,18],[13,2,13,8],[15,2,15,8],[17,2,17,8],[10,12,10,18]]}
[null,null,"THEME SUMMARY",null,null,null,null,null,null,null,null,null,null,null,null,null,null,null,null,"Total # of Practices",null,"# of Practices in this theme",null,null,null,null,"# of Practices in this theme"]
[null,null,null,null,null,null,null,null,null,"Theme Rating",null,null,null,null,null,null,null,null,null,null,null,"with RATING…",null,null,null,null,"with PRIORITY…"]
[null,null,null,null,null,null,null,null,null,"Rating","Priority",null,1,2,3,4,5,6,7,null,null,1,2,3,4,null,"Low","Medium","High"]
[null,null,"Child Find Best Practices"]
[]
["T-BP1-0","BP 1",{"$f":"VLOOKUP(A6,ALLdata!A:F,6,FALSE)","v":"Cross-Sector Collaboration"},null,null,null,null,null,null,{"$f":"VLOOKUP(A6,ALLdata!A:H,8,FALSE)","v":0},{"$f":"VLOOKUP(A6,ALLdata!A:I,9,FALSE)","v":0},null,{"$f":"VLOOKUP($A6,ALLdata!$A:$I,8,FALSE)","v":0},{"$f":"VLOOKUP($A6,ALLdata!$A:$I,8,FALSE)","v":0},{"$f":"VLOOKUP($A6,ALLdata!$A:$I,8,FALSE)","v":0},{"$f":"VLOOKUP($A6,ALLdata!$A:$I,8,FALSE)","v":0},{"$f":"VLOOKUP($A6,ALLdata!$A:$I,8,FALSE)","v":0},{"$f":"VLOOKUP($A6,ALLdata!$A:$I,8,FALSE)","v":0},{"$f":"VLOOKUP($A6,ALLdata!$A:$I,8,FALSE)","v":0},{"$f":"COUNTIFS(ALLdata!B:B,\"BestPractice\",ALLdata!D:D,B6)","v":9},null,{"$f":"COUNTIFS(ALLdata!$B:$B,\"BestPractice\",ALLdata!$D:$D,$B6,ALLdata!$G:$G,V$3)","v":0},{"$f":"COUNTIFS(ALLdata!$B:$B,\"BestPractice\",ALLdata!$D:$D,$B6,ALLdata!$G:$G,W$3)","v":0},{"$f":"COUNTIFS(ALLdata!$B:$B,\"BestPractice\",ALLdata!$D:$D,$B6,ALLdata!$G:$G,X$3)","v":0},{"$f":"COUNTIFS(ALLdata!$B:$B,\"BestPractice\",ALLdata!$D:$D,$B6,ALLdata!$G:$G,Y$3)","v":0},null,{"$f":"COUNTIFS(ALLdata!$B:$B,\"BestPractice\",ALLdata!$D:$D,$B6,ALLdata!$I:$I,LEFT(AA$3))","v":0},{"$f":"COUNTIFS(ALLdata!$B:$B,\"BestPractice\",ALLdata!$D:$D,$B6,ALLdata!$I:$I,LEFT(AB$3))","v":0},{"$f":"COUNTIFS(ALLdata!$B:$B,\"BestPractice\",ALLdata!$D:$D,$B6,ALLdata!$I:$I,LEFT(AC$3))","v":0},{"$f":"IF(SUM(V6:Y6)=0,\"* Note: No BPs have been rated for this theme.\",\"\")","v":"* Note: No BPs have been rated for this theme."}]
[]
["T-BP2-0","BP 2",{"$f":"VLOOKUP(A8,ALLdata!A:F,6,FALSE)","v":"Identifying Children who are Underserved by Part B"},null,null,null,null,null,null,{"$f":"VLOOKUP(A8,ALLdata!A:H,8,FALSE)","v":0},{"$f":"VLOOKUP(A8,ALLdata!A:I,9,FALSE)","v":0},null,{"$f":"VLOOKUP($A8,ALLdata!$A:$I,8,FALSE)","v":0},{"$f":"VLOOKUP($A8,ALLdata!$A:$I,8,FALSE)","v":0},{"$f":"VLOOKUP($A8,ALLdata!$A:$I,8,FALSE)","v":0},{"$f":"VLOOKUP($A8,ALLdata!$A:$I,8,FALSE)","v":0},{"$f":"VLOOKUP($A8,ALLdata!$A:$I,8,FALSE)","v":0},{"$f":"VLOOKUP($A8,ALLdata!$A:$I,8,FALSE)","v":0},{"$f":"VLOOKUP($A8,ALLdata!$A:$I,8,FALSE)","v":0},{"$f":"COUNTIFS(ALLdata!B:B,\"BestPractice\",ALLdata!D:D,B8)","v":3},null,{"$f":"COUNTIFS(ALLdata!$B:$B,\"BestPractice\",ALLdata!$D:$D,$B8,ALLdata!$G:$G,V$3)","v":0},{"$f":"COUNTIFS(ALLdata!$B:$B,\"BestPractice\",ALLdata!$D:$D,$B8,ALLdata!$G:$G,W$3)","v":0},{"$f":"COUNTIFS(ALLdata!$B:$B,\"BestPractice\",ALLdata!$D:$D,$B8,ALLdata!$G:$G,X$3)","v":0},{"$f":"COUNTIFS(ALLdata!$B:$B,\"BestPractice\",ALLdata!$D:$D,$B8,ALLdata!$G:$G,Y$3)","v":0},null,{"$f":"COUNTIFS(ALLdata!$B:$B,\"BestPractice\",ALLdata!$D:$D,$B8,ALLdata!$I:$I,LEFT(AA$3))","v":0},{"$f":"COUNTIFS(ALLdata!$B:$B,\"BestPractice\",ALLdata!$D:$D,$B8,ALLdata!$I:$I,LEFT(AB$3))","v":0},{"$f":"COUNTIFS(ALLdata!$B:$B,\"BestPractice\",ALLdata!$D:$D,$B8,ALLdata!$I:$I,LEFT(AC$3))","v":0},{"$f":"IF(SUM(V8:Y8)=0,\"* Note: No BPs have been rated for this theme.\",\"\")","v":"* Note: No BPs have been rated for this theme."}]
[]
["T-BP3-0","BP 3",{"$f":"VLOOKUP(A10,ALLdata!A:F,6,FALSE)","v":"Data and Data Systems"},null,null,null,null,null,null,{"$f":"VLOOKUP(A10,ALLdata!A:H,8,FALSE)","v":4},{"$f":"VLOOKUP(A10,ALLdata!A:I,9,FALSE)","v":0},null,{"$f":"VLOOKUP($A10,ALLdata!$A:$I,8,FALSE)","v":4},{"$f":"VLOOKUP($A10,ALLdata!$A:$I,8,FALSE)","v":4},{"$f":"VLOOKUP($A10,ALLdata!$A:$I,8,FALSE)","v":4},{"$f":"VLOOKUP($A10,ALLdata!$A:$I,8,FALSE)","v":4},{"$f":"VLOOKUP($A10,ALLdata!$A:$I,8,FALSE)","v":4},{"$f":"VLOOKUP($A10,ALLdata!$A:$I,8,FALSE)","v":4},{"$f":"VLOOKUP($A10,ALLdata!$A:$I,8,FALSE)","v":4},{"$f":"COUNTIFS(ALLdata!B:B,\"BestPractice\",ALLdata!D:D,B10)","v":10},null,{"$f":"COUNTIFS(ALLdata!$B:$B,\"BestPractice\",ALLdata!$D:$D,$B10,ALLdata!$G:$G,V$3)","v":2},{"$f":"COUNTIFS(ALLdata!$B:$B,\"BestPractice\",ALLdata!$D:$D,$B10,ALLdata!$G:$G,W$3)","v":1},{"$f":"COUNTIFS(ALLdata!$B:$B,\"BestPractice\",ALLdata!$D:$D,$B10,ALLdata!$G:$G,X$3)","v":1},{"$f":"COUNTIFS(ALLdata!$B:$B,\"BestPractice\",ALLdata!$D:$D,$B10,ALLdata!$G:$G,Y$3)","v":2},null,{"$f":"COUNTIFS(ALLdata!$B:$B,\"BestPractice\",ALLdata!$D:$D,$B10,ALLdata!$I:$I,LEFT(AA$3))","v":1},{"$f":"COUNTIFS(ALLdata!$B:$B,\"BestPractice\",ALLdata!$D:$D,$B10,ALLdata!$I:$I,LEFT(AB$3))","v":1},{"$f":"COUNTIFS(ALLdata!$B:$B,\"BestPractice\",ALLdata!$D:$D,$B10,ALLdata!$I:$I,LEFT(AC$3))","v":1},{"$f":"IF(SUM(V10:Y10)=0,\"* Note: No BPs have been rated for this theme.\",\"\")","v":""}]
[]
["T-BP4-0","BP 4",{"$f":"VLOOKUP(A12,ALLdata!A:F,6,FALSE)","v":"Technical Adequacy of Screening Tools"},null,null,null,null,null,null,{"$f":"VLOOKUP(A12,ALLdata!A:H,8,FALSE)","v":0},{"$f":"VLOOKUP(A12,ALLdata!A:I,9,FALSE)","v":0},null,{"$f":"VLOOKUP($A12,ALLdata!$A:$I,8,FALSE)","v":0},{"$f":"VLOOKUP($A12,ALLdata!$A:$I,8,FALSE)","v":0},{"$f":"VLOOKUP($A12,ALLdata!$A:$I,8,FALSE)","v":0},{"$f":"VLOOKUP($A12,ALLdata!$A:$I,8,FALSE)","v":0},{"$f":"VLOOKUP($A12,ALLdata!$A:$I,8,FALSE)","v":0},{"$f":"VLOOKUP($A12,ALLdata!$A:$I,8,FALSE)","v":0},{"$f":"VLOOKUP($A12,ALLdata!$A:$I,8,FALSE)","v":0},{"$f":"COUNTIFS(ALLdata!B:B,\"BestPractice\",ALLdata!D:D,B12)","v":7},null,{"$f":"COUNTIFS(ALLdata!$B:$B,\"BestPractice\",ALLdata!$D:$D,$B12,ALLdata!$G:$G,V$3)","v":0},{"$f":"COUNTIFS(ALLdata!$B:$B,\"BestPractice\",ALLdata!$D:$D,$B12,ALLdata!$G:$G,W$3)","v":0},{"$f":"COUNTIFS(ALLdata!$B:$B,\"BestPractice\",ALLdata!$D:$D,$B12,ALLdata!$G:$G,X$3)","v":0},{"$f":"COUNTIFS(ALLdata!$B:$B,\"BestPractice\",ALLdata!$D:$D,$B12,ALLdata!$G:$G,Y$3)","v":0},null,{"$f":"COUNTIFS(ALLdata!$B:$B,\"BestPractice\",ALLdata!$D:$D,$B12,ALLdata!$I:$I,LEFT(AA$3))","v":0},{"$f":"COUNTIFS(ALLdata!$B:$B,\"BestPractice\",ALLdata!$D:$D,$B12,ALLdata!$I:$I,LEFT(AB$3))","v":0},{"$f":"COUNTIFS(ALLdata!$B:$B,\"BestPractice\",ALLdata!$D:$D,$B12,ALLdata!$I:$I,LEFT(AC$3))","v":0},{"$f":"IF(SUM(V12:Y12)=0,\"* Note: No BPs have been rated for this theme.\",\"\")","v":"* Note: No BPs have been rated for this theme."}]
[]
["T-BP5-0","BP 5",{"$f":"VLOOKUP(A14,ALLdata!A:F,6,FALSE)","v":"Efficiency of Screening and Referral Process and Procedures"},null,null,null,null,null,null,{"$f":"VLOOKUP(A14,ALLdata!A:H,8,FALSE)","v":0},{"$f":"VLOOKUP(A14,ALLdata!A:I,9,FALSE)","v":0},null,{"$f":"VLOOKUP($A14,ALLdata!$A:$I,8,FALSE)","v":0},{"$f":"VLOOKUP($A14,ALLdata!$A:$I,8,FALSE)","v":0},{"$f":"VLOOKUP($A14,ALLdata!$A:$I,8,FALSE)","v":0},{"$f":"VLOOKUP($A14,ALLdata!$A:$I,8,FALSE)","v":0},{"$f":"VLOOKUP($A14,ALLdata!$A:$I,8,FALSE)","v":0},{"$f":"VLOOKUP($A14,ALLdata!$A:$I,8,FALSE)","v":0},{"$f":"VLOOKUP($A14,ALLdata!$A:$I,8,FALSE)","v":0},{"$f":"COUNTIFS(ALLdata!B:B,\"BestPractice\",ALLdata!D:D,B14)","v":8},null,{"$f":"COUNTIFS(ALLdata!$B:$B,\"BestPractice\",ALLdata!$D:$D,$B14,ALLdata!$G:$G,V$3)","v":0},{"$f":"COUNTIFS(ALLdata!$B:$B,\"BestPractice\",ALLdata!$D:$D,$B14,ALLdata!$G:$G,W$3)","v":0},{"$f":"COUNTIFS(ALLdata!$B:$B,\"BestPractice\",ALLdata!$D:$D,$B14,ALLdata!$G:$G,X$3)","v":0},{"$f":"COUNTIFS(ALLdata!$B:$B,\"BestPractice\",ALLdata!$D:$D,$B14,ALLdata!$G:$G,Y$3)","v":0},null,{"$f":"COUNTIFS(ALLdata!$B:$B,\"BestPractice\",ALLdata!$D:$D,$B14,ALLdata!$I:$I,LEFT(AA$3))","v":0},{"$f":"COUNTIFS(ALLdata!$B:$B,\"BestPractice\",ALLdata!$D:$D,$B14,ALLdata!$I:$I,LEFT(AB$3))","v":0},{"$f":"COUNTIFS(ALLdata!$B:$B,\"BestPractice\",ALLdata!$D:$D,$B14,ALLdata!$I:$I,LEFT(AC$3))","v":0},{"$f":"IF(SUM(V14:Y14)=0,\"* Note: No BPs have been rated for this theme.\",\"\")","v":"* Note: No BPs have been rated for this theme."}]
[]
["T-BP6-0","BP 6",{"$f":"VLOOKUP(A16,ALLdata!A:F,6,FALSE)","v":"Responding When Children are Found Ineligible for Part B"},null,null,null,null,null,null,{"$f":"VLOOKUP(A16,ALLdata!A:H,8,FALSE)","v":0},{"$f":"VLOOKUP(A16,ALLdata!A:I,9,FALSE)","v":0},null,{"$f":"VLOOKUP($A16,ALLdata!$A:$I,8,FALSE)","v":0},{"$f":"VLOOKUP($A16,ALLdata!$A:$I,8,FALSE)","v":0},{"$f":"VLOOKUP($A16,ALLdata!$A:$I,8,FALSE)","v":0},{"$f":"VLOOKUP($A16,ALLdata!$A:$I,8,FALSE)","v":0},{"$f":"VLOOKUP($A16,ALLdata!$A:$I,8,FALSE)","v":0},{"$f":"VLOOKUP($A16,ALLdata!$A:$I,8,FALSE)","v":0},{"$f":"VLOOKUP($A16,ALLdata!$A:$I,8,FALSE)","v":0},{"$f":"COUNTIFS(ALLdata!B:B,\"BestPractice\",ALLdata!D:D,B16)","v":3},null,{"$f":"COUNTIFS(ALLdata!$B:$B,\"BestPractice\",ALLdata!$D:$D,$B16,ALLdata!$G:$G,V$3)","v":0},{"$f":"COUNTIFS(ALLdata!$B:$B,\"BestPractice\",ALLdata!$D:$D,$B16,ALLdata!$G:$G,W$3)","v":0},{"$f":"COUNTIFS(ALLdata!$B:$B,\"BestPractice\",ALLdata!$D:$D,$B16,ALLdata!$G:$G,X$3)","v":0},{"$f":"COUNTIFS(ALLdata!$B:$B,\"BestPractice\",ALLdata!$D:$D,$B16,ALLdata!$G:$G,Y$3)","v":0},null,{"$f":"COUNTIFS(ALLdata!$B:$B,\"BestPractice\",ALLdata!$D:$D,$B16,ALLdata!$I:$I,LEFT(AA$3))","v":0},{"$f":"COUNTIFS(ALLdata!$B:$B,\"BestPractice\",ALLdata!$D:$D,$B16,ALLdata!$I:$I,LEFT(AB$3))","v":0},{"$f":"COUNTIFS(ALLdata!$B:$B,\"BestPractice\",ALLdata!$D:$D,$B16,ALLdata!$I:$I,LEFT(AC$3))","v":0},{"$f":"IF(SUM(V16:Y16)=0,\"* Note: No BPs have been rated for this theme.\",\"\")","v":"* Note: No BPs have been rated for this theme."}]
[]
["T-BP7-0","BP 7",{"$f":"VLOOKUP(A18,ALLdata!A:F,6,FALSE)","v":"Evaluation of Child Find"},null,null,null,null,null,null,{"$f":"VLOOKUP(A18,ALLdata!A:H,8,FALSE)","v":0},{"$f":"VLOOKUP(A18,ALLdata!A:I,9,FALSE)","v":0},null,{"$f":"VLOOKUP($A18,ALLdata!$A:$I,8,FALSE)","v":0},{"$f":"VLOOKUP($A18,ALLdata!$A:$I,8,FALSE)","v":0},{"$f":"VLOOKUP($A18,ALLdata!$A:$I,8,FALSE)","v":0},{"$f":"VLOOKUP($A18,ALLdata!$A:$I,8,FALSE)","v":0},{"$f":"VLOOKUP($A18,ALLdata!$A:$I,8,FALSE)","v":0},{"$f":"VLOOKUP($A18,ALLdata!$A:$I,8,FALSE)","v":0},{"$f":"VLOOKUP($A18,ALLdata!$A:$I,8,FALSE)","v":0},{"$f":"COUNTIFS(ALLdata!B:B,\"BestPractice\",ALLdata!D:D,B18)","v":5},null,{"$f":"COUNTIFS(ALLdata!$B:$B,\"BestPractice\",ALLdata!$D:$D,$B18,ALLdata!$G:$G,V$3)","v":0},{"$f":"COUNTIFS(ALLdata!$B:$B,\"BestPractice\",ALLdata!$D:$D,$B18,ALLdata!$G:$G,W$3)","v":0},{"$f":"COUNTIFS(ALLdata!$B:$B,\"BestPractice\",ALLdata!$D:$D,$B18,ALLdata!$G:$G,X$3)","v":0},{"$f":"COUNTIFS(ALLdata!$B:$B,\"BestPractice\",ALLdata!$D:$D,$B18,ALLdata!$G:$G,Y$3)","v":0},null,{"$f":"COUNTIFS(ALLdata!$B:$B,\"BestPractice\",ALLdata!$D:$D,$B18,ALLdata!$I:$I,LEFT(AA$3))","v":0},{"$f":"COUNTIFS(ALLdata!$B:$B,\"BestPractice\",ALLdata!$D:$D,$B18,ALLdata!$I:$I,LEFT(AB$3))","v":0},{"$f":"COUNTIFS(ALLdata!$B:$B,\"BestPractice\",ALLdata!$D:$D,$B18,ALLdata!$I:$I,LEFT(AC$3))","v":0},{"$f":"IF(SUM(V18:Y18)=0,\"* Note: No BPs have been rated for this theme.\",\"\")","v":"* Note: No BPs have been rated for this theme."}]
[]
[null,null,"Page 2",null,null,null,null,null,null,"Rating","Priority"]
["T-P21-0","P2 1",{"$f":"VLOOKUP(A21,ALLdata!A:F,6,FALSE)","v":{"$error":"#N/A"}},null,null,null,null,null,null,{"$f":"VLOOKUP(A21,ALLdata!A:H,8,FALSE)","v":{"$error":"#N/A"}},{"$f":"VLOOKUP(A21,ALLdata!A:I,9,FALSE)","v":{"$error":"#N/A"}},null,{"$f":"VLOOKUP($A21,ALLdata!$A:$I,8,FALSE)","v":{"$error":"#N/A"}},{"$f":"VLOOKUP($A21,ALLdata!$A:$I,8,FALSE)","v":{"$error":"#N/A"}},{"$f":"VLOOKUP($A21,ALLdata!$A:$I,8,FALSE)","v":{"$error":"#N/A"}},{"$f":"VLOOKUP($A21,ALLdata!$A:$I,8,FALSE)","v":{"$error":"#N/A"}},{"$f":"VLOOKUP($A21,ALLdata!$A:$I,8,FALSE)","v":{"$error":"#N/A"}},{"$f":"VLOOKUP($A21,ALLdata!$A:$I,8,FALSE)","v":{"$error":"#N/A"}},{"$f":"VLOOKUP($A21,ALLdata!$A:$I,8,FALSE)","v":{"$error":"#N/A"}},{"$f":"COUNTIFS(ALLdata!B:B,\"BestPractice\",ALLdata!D:D,B21)","v":0},null,{"$f":"COUNTIFS(ALLdata!$B:$B,\"BestPractice\",ALLdata!$D:$D,B21,ALLdata!$G:$G,#REF!)","v":0},{"$f":"COUNTIFS(ALLdata!$B:$B,\"BestPractice\",ALLdata!$D:$D,B21,ALLdata!$G:$G,#REF!)","v":0},{"$f":"COUNTIFS(ALLdata!$B:$B,\"BestPractice\",ALLdata!$D:$D,B21,ALLdata!$G:$G,#REF!)","v":0},{"$f":"COUNTIFS(ALLdata!$B:$B,\"BestPractice\",ALLdata!$D:$D,B21,ALLdata!$G:$G,#REF!)","v":0},null,{"$f":"COUNTIFS(ALLdata!$B:$B,\"BestPractice\",ALLdata!$D:$D,B21,ALLdata!$I:$I,LEFT(#REF!))","v":0},{"$f":"COUNTIFS(ALLdata!$B:$B,\"BestPractice\",ALLdata!$D:$D,B21,ALLdata!$I:$I,LEFT(#REF!))","v":0},{"$f":"COUNTIFS(ALLdata!$B:$B,\"BestPractice\",ALLdata!$D:$D,B21,ALLdata!$I:$I,LEFT(#REF!))","v":0}]
[]
["T-P22-0","P2 2",{"$f":"VLOOKUP(A23,ALLdata!A:F,6,FALSE)","v":{"$error":"#N/A"}},null,null,null,null,null,null,{"$f":"VLOOKUP(A23,ALLdata!A:H,8,FALSE)","v":{"$error":"#N/A"}},{"$f":"VLOOKUP(A23,ALLdata!A:I,9,FALSE)","v":{"$error":"#N/A"}},null,{"$f":"VLOOKUP($A23,ALLdata!$A:$I,8,FALSE)","v":{"$error":"#N/A"}},{"$f":"VLOOKUP($A23,ALLdata!$A:$I,8,FALSE)","v":{"$error":"#N/A"}},{"$f":"VLOOKUP($A23,ALLdata!$A:$I,8,FALSE)","v":{"$error":"#N/A"}},{"$f":"VLOOKUP($A23,ALLdata!$A:$I,8,FALSE)","v":{"$error":"#N/A"}},{"$f":"VLOOKUP($A23,ALLdata!$A:$I,8,FALSE)","v":{"$error":"#N/A"}},{"$f":"VLOOKUP($A23,ALLdata!$A:$I,8,FALSE)","v":{"$error":"#N/A"}},{"$f":"VLOOKUP($A23,ALLdata!$A:$I,8,FALSE)","v":{"$error":"#N/A"}},{"$f":"COUNTIFS(ALLdata!B:B,\"BestPractice\",ALLdata!D:D,B23)","v":0},null,{"$f":"COUNTIFS(ALLdata!$B:$B,\"BestPractice\",ALLdata!$D:$D,B23,ALLdata!$G:$G,#REF!)","v":0},{"$f":"COUNTIFS(ALLdata!$B:$B,\"BestPractice\",ALLdata!$D:$D,B23,ALLdata!$G:$G,#REF!)","v":0},{"$f":"COUNTIFS(ALLdata!$B:$B,\"BestPractice\",ALLdata!$D:$D,B23,ALLdata!$G:$G,#REF!)","v":0},{"$f":"COUNTIFS(ALLdata!$B:$B,\"BestPractice\",ALLdata!$D:$D,B23,ALLdata!$G:$G,#REF!)","v":0},null,{"$f":"COUNTIFS(ALLdata!$B:$B,\"BestPractice\",ALLdata!$D:$D,B23,ALLdata!$I:$I,LEFT(#REF!))","v":0},{"$f":"COUNTIFS(ALLdata!$B:$B,\"BestPractice\",ALLdata!$D:$D,B23,ALLdata!$I:$I,LEFT(#REF!))","v":0},{"$f":"COUNTIFS(ALLdata!$B:$B,\"BestPractice\",ALLdata!$D:$D,B23,ALLdata!$I:$I,LEFT(#REF!))","v":0}]
[]
["T-P23-0","P2 3",{"$f":"VLOOKUP(A25,ALLdata!A:F,6,FALSE)","v":{"$error":"#N/A"}},null,null,null,null,null,null,{"$f":"VLOOKUP(A25,ALLdata!A:H,8,FALSE)","v":{"$error":"#N/A"}},{"$f":"VLOOKUP(A25,ALLdata!A:I,9,FALSE)","v":{"$error":"#N/A"}},null,{"$f":"VLOOKUP($A25,ALLdata!$A:$I,8,FALSE)","v":{"$error":"#N/A"}},{"$f":"VLOOKUP($A25,ALLdata!$A:$I,8,FALSE)","v":{"$error":"#N/A"}},{"$f":"VLOOKUP($A25,ALLdata!$A:$I,8,FALSE)","v":{"$error":"#N/A"}},{"$f":"VLOOKUP($A25,ALLdata!$A:$I,8,FALSE)","v":{"$error":"#N/A"}},{"$f":"VLOOKUP($A25,ALLdata!$A:$I,8,FALSE)","v":{"$error":"#N/A"}},{"$f":"VLOOKUP($A25,ALLdata!$A:$I,8,FALSE)","v":{"$error":"#N/A"}},{"$f":"VLOOKUP($A25,ALLdata!$A:$I,8,FALSE)","v":{"$error":"#N/A"}},{"$f":"COUNTIFS(ALLdata!B:B,\"BestPractice\",ALLdata!D:D,B25)","v":0},null,{"$f":"COUNTIFS(ALLdata!$B:$B,\"BestPractice\",ALLdata!$D:$D,B25,ALLdata!$G:$G,#REF!)","v":0},{"$f":"COUNTIFS(ALLdata!$B:$B,\"BestPractice\",ALLdata!$D:$D,B25,ALLdata!$G:$G,#REF!)","v":0},{"$f":"COUNTIFS(ALLdata!$B:$B,\"BestPractice\",ALLdata!$D:$D,B25,ALLdata!$G:$G,#REF!)","v":0},{"$f":"COUNTIFS(ALLdata!$B:$B,\"BestPractice\",ALLdata!$D:$D,B25,ALLdata!$G:$G,#REF!)","v":0},null,{"$f":"COUNTIFS(ALLdata!$B:$B,\"BestPractice\",ALLdata!$D:$D,B25,ALLdata!$I:$I,LEFT(#REF!))","v":0},{"$f":"COUNTIFS(ALLdata!$B:$B,\"BestPractice\",ALLdata!$D:$D,B25,ALLdata!$I:$I,LEFT(#REF!))","v":0},{"$f":"COUNTIFS(ALLdata!$B:$B,\"BestPractice\",ALLdata!$D:$D,B25,ALLdata!$I:$I,LEFT(#REF!))","v":0}]
[]
["T-P24-0","P2 4",{"$f":"VLOOKUP(A27,ALLdata!A:F,6,FALSE)","v":{"$error":"#N/A"}},null,null,null,null,null,null,{"$f":"VLOOKUP(A27,ALLdata!A:H,8,FALSE)","v":{"$error":"#N/A"}},{"$f":"VLOOKUP(A27,ALLdata!A:I,9,FALSE)","v":{"$error":"#N/A"}},null,{"$f":"VLOOKUP($A27,ALLdata!$A:$I,8,FALSE)","v":{"$error":"#N/A"}},{"$f":"VLOOKUP($A27,ALLdata!$A:$I,8,FALSE)","v":{"$error":"#N/A"}},{"$f":"VLOOKUP($A27,ALLdata!$A:$I,8,FALSE)","v":{"$error":"#N/A"}},{"$f":"VLOOKUP($A27,ALLdata!$A:$I,8,FALSE)","v":{"$error":"#N/A"}},{"$f":"VLOOKUP($A27,ALLdata!$A:$I,8,FALSE)","v":{"$error":"#N/A"}},{"$f":"VLOOKUP($A27,ALLdata!$A:$I,8,FALSE)","v":{"$error":"#N/A"}},{"$f":"VLOOKUP($A27,ALLdata!$A:$I,8,FALSE)","v":{"$error":"#N/A"}},{"$f":"COUNTIFS(ALLdata!B:B,\"BestPractice\",ALLdata!D:D,B27)","v":0},null,{"$f":"COUNTIFS(ALLdata!$B:$B,\"BestPractice\",ALLdata!$D:$D,B27,ALLdata!$G:$G,#REF!)","v":0},{"$f":"COUNTIFS(ALLdata!$B:$B,\"BestPractice\",ALLdata!$D:$D,B27,ALLdata!$G:$G,#REF!)","v":0},{"$f":"COUNTIFS(ALLdata!$B:$B,\"BestPractice\",ALLdata!$D:$D,B27,ALLdata!$G:$G,#REF!)","v":0},{"$f":"COUNTIFS(ALLdata!$B:$B,\"BestPractice\",ALLdata!$D:$D,B27,ALLdata!$G:$G,#REF!)","v":0},null,{"$f":"COUNTIFS(ALLdata!$B:$B,\"BestPractice\",ALLdata!$D:$D,B27,ALLdata!$I:$I,LEFT(#REF!))","v":0},{"$f":"COUNTIFS(ALLdata!$B:$B,\"BestPractice\",ALLdata!$D:$D,B27,ALLdata!$I:$I,LEFT(#REF!))","v":0},{"$f":"COUNTIFS(ALLdata!$B:$B,\"BestPractice\",ALLdata!$D:$D,B27,ALLdata!$I:$I,LEFT(#REF!))","v":0}]
[]
["T-P25-0","P2 5",{"$f":"VLOOKUP(A29,ALLdata!A:F,6,FALSE)","v":{"$error":"#N/A"}},null,null,null,null,null,null,{"$f":"VLOOKUP(A29,ALLdata!A:H,8,FALSE)","v":{"$error":"#N/A"}},{"$f":"VLOOKUP(A29,ALLdata!A:I,9,FALSE)","v":{"$error":"#N/A"}},null,{"$f":"VLOOKUP($A29,ALLdata!$A:$I,8,FALSE)","v":{"$error":"#N/A"}},{"$f":"VLOOKUP($A29,ALLdata!$A:$I,8,FALSE)","v":{"$error":"#N/A"}},{"$f":"VLOOKUP($A29,ALLdata!$A:$I,8,FALSE)","v":{"$error":"#N/A"}},{"$f":"VLOOKUP($A29,ALLdata!$A:$I,8,FALSE)","v":{"$error":"#N/A"}},{"$f":"VLOOKUP($A29,ALLdata!$A:$I,8,FALSE)","v":{"$error":"#N/A"}},{"$f":"VLOOKUP($A29,ALLdata!$A:$I,8,FALSE)","v":{"$error":"#N/A"}},{"$f":"VLOOKUP($A29,ALLdata!$A:$I,8,FALSE)","v":{"$error":"#N/A"}},{"$f":"COUNTIFS(ALLdata!B:B,\"BestPractice\",ALLdata!D:D,B29)","v":0},null,{"$f":"COUNTIFS(ALLdata!$B:$B,\"BestPractice\",ALLdata!$D:$D,B29,ALLdata!$G:$G,#REF!)","v":0},{"$f":"COUNTIFS(ALLdata!$B:$B,\"BestPractice\",ALLdata!$D:$D,B29,ALLdata!$G:$G,#REF!)","v":0},{"$f":"COUNTIFS(ALLdata!$B:$B,\"BestPractice\",ALLdata!$D:$D,B29,ALLdata!$G:$G,#REF!)","v":0},{"$f":"COUNTIFS(ALLdata!$B:$B,\"BestPractice\",ALLdata!$D:$D,B29,ALLdata!$G:$G,#REF!)","v":0},null,{"$f":"COUNTIFS(ALLdata!$B:$B,\"BestPractice\",ALLdata!$D:$D,B29,ALLdata!$I:$I,LEFT(#REF!))","v":0},{"$f":"COUNTIFS(ALLdata!$B:$B,\"BestPractice\",ALLdata!$D:$D,B29,ALLdata!$I:$I,LEFT(#REF!))","v":0},{"$f":"COUNTIFS(ALLdata!$B:$B,\"BestPractice\",ALLdata!$D:$D,B29,ALLdata!$I:$I,LEFT(#REF!))","v":0}]
[]
["T-P26-0","P2 6",{"$f":"VLOOKUP(A31,ALLdata!A:F,6,FALSE)","v":{"$error":"#N/A"}},null,null,null,null,null,null,{"$f":"VLOOKUP(A31,ALLdata!A:H,8,FALSE)","v":{"$error":"#N/A"}},{"$f":"VLOOKUP(A31,ALLdata!A:I,9,FALSE)","v":{"$error":"#N/A"}},null,{"$f":"VLOOKUP($A31,ALLdata!$A:$I,8,FALSE)","v":{"$error":"#N/A"}},{"$f":"VLOOKUP($A31,ALLdata!$A:$I,8,FALSE)","v":{"$error":"#N/A"}},{"$f":"VLOOKUP($A31,ALLdata!$A:$I,8,FALSE)","v":{"$error":"#N/A"}},{"$f":"VLOOKUP($A31,ALLdata!$A:$I,8,FALSE)","v":{"$error":"#N/A"}},{"$f":"VLOOKUP($A31,ALLdata!$A:$I,8,FALSE)","v":{"$error":"#N/A"}},{"$f":"VLOOKUP($A31,ALLdata!$A:$I,8,FALSE)","v":{"$error":"#N/A"}},{"$f":"VLOOKUP($A31,ALLdata!$A:$I,8,FALSE)","v":{"$error":"#N/A"}},{"$f":"COUNTIFS(ALLdata!B:B,\"BestPractice\",ALLdata!D:D,B31)","v":0},null,{"$f":"COUNTIFS(ALLdata!$B:$B,\"BestPractice\",ALLdata!$D:$D,B31,ALLdata!$G:$G,#REF!)","v":0},{"$f":"COUNTIFS(ALLdata!$B:$B,\"BestPractice\",ALLdata!$D:$D,B31,ALLdata!$G:$G,#REF!)","v":0},{"$f":"COUNTIFS(ALLdata!$B:$B,\"BestPractice\",ALLdata!$D:$D,B31,ALLdata!$G:$G,#REF!)","v":0},{"$f":"COUNTIFS(ALLdata!$B:$B,\"BestPractice\",ALLdata!$D:$D,B31,ALLdata!$G:$G,#REF!)","v":0},null,{"$f":"COUNTIFS(ALLdata!$B:$B,\"BestPractice\",ALLdata!$D:$D,B31,ALLdata!$I:$I,LEFT(#REF!))","v":0},{"$f":"COUNTIFS(ALLdata!$B:$B,\"BestPractice\",ALLdata!$D:$D,B31,ALLdata!$I:$I,LEFT(#REF!))","v":0},{"$f":"COUNTIFS(ALLdata!$B:$B,\"BestPractice\",ALLdata!$D:$D,B31,ALLdata!$I:$I,LEFT(#REF!))","v":0}]
[]
["T-P27-0","P2 7",{"$f":"VLOOKUP(A33,ALLdata!A:F,6,FALSE)","v":{"$error":"#N/A"}},null,null,null,null,null,null,{"$f":"VLOOKUP(A33,ALLdata!A:H,8,FALSE)","v":{"$error":"#N/A"}},{"$f":"VLOOKUP(A33,ALLdata!A:I,9,FALSE)","v":{"$error":"#N/A"}},null,{"$f":"VLOOKUP($A33,ALLdata!$A:$I,8,FALSE)","v":{"$error":"#N/A"}},{"$f":"VLOOKUP($A33,ALLdata!$A:$I,8,FALSE)","v":{"$error":"#N/A"}},{"$f":"VLOOKUP($A33,ALLdata!$A:$I,8,FALSE)","v":{"$error":"#N/A"}},{"$f":"VLOOKUP($A33,ALLdata!$A:$I,8,FALSE)","v":{"$error":"#N/A"}},{"$f":"VLOOKUP($A33,ALLdata!$A:$I,8,FALSE)","v":{"$error":"#N/A"}},{"$f":"VLOOKUP($A33,ALLdata!$A:$I,8,FALSE)","v":{"$error":"#N/A"}},{"$f":"VLOOKUP($A33,ALLdata!$A:$I,8,FALSE)","v":{"$error":"#N/A"}},{"$f":"COUNTIFS(ALLdata!B:B,\"BestPractice\",ALLdata!D:D,B33)","v":0},null,{"$f":"COUNTIFS(ALLdata!$B:$B,\"BestPractice\",ALLdata!$D:$D,B33,ALLdata!$G:$G,#REF!)","v":0},{"$f":"COUNTIFS(ALLdata!$B:$B,\"BestPractice\",ALLdata!$D:$D,B33,ALLdata!$G:$G,#REF!)","v":0},{"$f":"COUNTIFS(ALLdata!$B:$B,\"BestPractice\",ALLdata!$D:$D,B33,ALLdata!$G:$G,#REF!)","v":0},{"$f":"COUNTIFS(ALLdata!$B:$B,\"BestPractice\",ALLdata!$D:$D,B33,ALLdata!$G:$G,#REF!)","v":0},null,{"$f":"COUNTIFS(ALLdata!$B:$B,\"BestPractice\",ALLdata!$D:$D,B33,ALLdata!$I:$I,LEFT(#REF!))","v":0},{"$f":"COUNTIFS(ALLdata!$B:$B,\"BestPractice\",ALLdata!$D:$D,B33,ALLdata!$I:$I,LEFT(#REF!))","v":0},{"$f":"COUNTIFS(ALLdata!$B:$B,\"BestPractice\",ALLdata!$D:$D,B33,ALLdata!$I:$I,LEFT(#REF!))","v":0}]

{"sheet":"Action Plan","index":5,"n_rows":257,"n_cols":17,"rows_kept":257,"cut":false,"hidden":false,"merged":[[7,1,26,1],[2,0,5,1],[6,0,11,0],[0,1,1,1],[3,14,3,16],[4,14,4,16],[3,8,4,12],[3,4,3,6],[4,4,4,6]]}
[null,"Action Plan"]
[]
[" jump to:"]
[null,null,null,null,"Planning Team Members",null,null,null,"Child Find Improvement Plan",null,null,null,null,null,"Stakeholder Involvement"]
[null,null,null,null,"State Child Find Planning Team Members, Role and Organization Represented",null,null,null,null,null,null,null,null,null,"Describe the stakeholders and how they will be involved in the self-assessment and improvement plan."]
[]
[null,null,null,null,"Child Find Planning Team Member","Role","Organization",null,"Outcomes of activities","Activities to improve Child Find","Resources Needed (fiscal, partners, personnel, materials)","Who Is Responsible ","Timeline (projected initiation & completion dates)",null,"Stakeholder(s)","How will they be involved?","Timeline"]
[null,"\nInstructions:\n\nFill out the charts to the right. Use as many rows as necessary.\n\nNOTE ON PRINTING: \nIf you would like to print, this page is set up to print each chart on its own page, going across.  You will want to print only the pages that have data in them - if you print this whole tab you may end up with many pages with no information.",1]
[null,null,2]
[null,null,3]
[null,null,4]
[null,null,5]
[null,null,6]
[null,null,7]
[null,null,8]
[null,null,9]
[null,null,10]
[null,null,11]
[null,null,12]
[null,null,13]
[null,null,14]
[null,null,15]
[null,null,16]
[null,null,17]
[null,null,18]
[null,null,19]
[null,null,20]
[null,null,21]
[null,null,22]
[null,null,23]
[null,null,24]
[null,null,25]
[null,null,26]
[null,null,27]
[null,null,28]
[null,null,29]
[null,null,30]
[null,null,31]
[null,null,32]
[null,null,33]
[null,null,34]
[null,null,35]
[null,null,36]
[null,null,37]
[null,null,38]
[null,null,39]
[null,null,40]
[null,null,41]
[null,null,42]
[null,null,43]
[null,null,44]
[null,null,45]
[null,null,46]
[null,null,47]
[null,null,48]
[null,null,49]
[null,null,50]
[null,null,51]
[null,null,52]
[null,null,53]
[null,null,54]
[null,null,55]
[null,null,56]
[null,null,57]
[null,null,58]
[null,null,59]
[null,null,60]
[null,null,61]
[null,null,62]
[null,null,63]
[null,null,64]
[null,null,65]
[null,null,66]
[null,null,67]
[null,null,68]
[null,null,69]
[null,null,70]
[null,null,71]
[null,null,72]
[null,null,73]
[null,null,74]
[null,null,75]
[null,null,76]
[null,null,77]
[null,null,78]
[null,null,79]
[null,null,80]
[null,null,81]
[null,null,82]
[null,null,83]
[null,null,84]
[null,null,85]
[null,null,86]
[null,null,87]
[null,null,88]
[null,null,89]
[null,null,90]
[null,null,91]
[null,null,92]
[null,null,93]
[null,null,94]
[null,null,95]
[null,null,96]
[null,null,97]
[null,null,98]
[null,null,99]
[null,null,100]
[null,null,101]
[null,null,102]
[null,null,103]
[null,null,104]
[null,null,105]
[null,null,106]
[null,null,107]
[null,null,108]
[null,null,109]
[null,null,110]
[null,null,111]
[null,null,112]
[null,null,113]
[null,null,114]
[null,null,115]
[null,null,116]
[null,null,117]
[null,null,118]
[null,null,119]
[null,null,120]
[null,null,121]
[null,null,122]
[null,null,123]
[null,null,124]
[null,null,125]
[null,null,126]
[null,null,127]
[null,null,128]
[null,null,129]
[null,null,130]
[null,null,131]
[null,null,132]
[null,null,133]
[null,null,134]
[null,null,135]
[null,null,136]
[null,null,137]
[null,null,138]
[null,null,139]
[null,null,140]
[null,null,141]
[null,null,142]
[null,null,143]
[null,null,144]
[null,null,145]
[null,null,146]
[null,null,147]
[null,null,148]
[null,null,149]
[null,null,150]
[null,null,151]
[null,null,152]
[null,null,153]
[null,null,154]
[null,null,155]
[null,null,156]
[null,null,157]
[null,null,158]
[null,null,159]
[null,null,160]
[null,null,161]
[null,null,162]
[null,null,163]
[null,null,164]
[null,null,165]
[null,null,166]
[null,null,167]
[null,null,168]
[null,null,169]
[null,null,170]
[null,null,171]
[null,null,172]
[null,null,173]
[null,null,174]
[null,null,175]
[null,null,176]
[null,null,177]
[null,null,178]
[null,null,179]
[null,null,180]
[null,null,181]
[null,null,182]
[null,null,183]
[null,null,184]
[null,null,185]
[null,null,186]
[null,null,187]
[null,null,188]
[null,null,189]
[null,null,190]
[null,null,191]
[null,null,192]
[null,null,193]
[null,null,194]
[null,null,195]
[null,null,196]
[null,null,197]
[null,null,198]
[null,null,199]
[null,null,200]
[null,null,201]
[null,null,202]
[null,null,203]
[null,null,204]
[null,null,205]
[null,null,206]
[null,null,207]
[null,null,208]
[null,null,209]
[null,null,210]
[null,null,211]
[null,null,212]
[null,null,213]
[null,null,214]
[null,null,215]
[null,null,216]
[null,null,217]
[null,null,218]
[null,null,219]
[null,null,220]
[null,null,221]
[null,null,222]
[null,null,223]
[null,null,224]
[null,null,225]
[null,null,226]
[null,null,227]
[null,null,228]
[null,null,229]
[null,null,230]
[null,null,231]
[null,null,232]
[null,null,233]
[null,null,234]
[null,null,235]
[null,null,236]
[null,null,237]
[null,null,238]
[null,null,239]
[null,null,240]
[null,null,241]
[null,null,242]
[null,null,243]
[null,null,244]
[null,null,245]
[null,null,246]
[null,null,247]
[null,null,248]
[null,null,249]
[null,null,250]

{"sheet":"Data","index":6,"n_rows":54,"n_cols":14,"rows_kept":54,"cut":false,"hidden":false,"merged":[]}
["Index","Type","Component","ThemeNumber","BPNumber","Text","Rating","Priority","Date","Count_Expected","Count_Actual",null,null,"2021-11-22T13:31:20.330"]
["T-BP1-0","Theme","Collaboration","BP 1",0,"Cross-Sector Collaboration",0,0,"2021-11-22",9,0]
["T-BP2-0","Theme","Identification","BP 2",0,"Identifying Children who are Underserved by Part B",0,0,"2021-11-22",3,0]
["T-BP3-0","Theme","DataSystems","BP 3",0,"Data and Data Systems",4,0,"2021-11-22",10,6]
["T-BP4-0","Theme","Adequacy","BP 4",0,"Technical Adequacy of Screening Tools",0,0,"2021-11-22",7,0]
["T-BP5-0","Theme","Efficiency","BP 5",0,"Efficiency of Screening and Referral Process and Procedures",0,0,"2021-11-22",8,0]
["T-BP6-0","Theme","Ineligible","BP 6",0,"Responding When Children are Found Ineligible for Part B",0,0,"2021-11-22",3,0]
["T-BP7-0","Theme","Evaluation","BP 7",0,"Evaluation of Child Find",0,0,"2021-11-22",5,0]
[]
["B-BP1-a","BestPractice","Collaboration","BP 1","a","Leverage federal or state-funded early childhood systems initiatives and coordinate with collaborating agencies to promote child find awareness, screening, and referral efforts.",0,0,"2021-11-22"]
["B-BP1-b","BestPractice","Collaboration","BP 1","b","Collaborate with Part C and other community organizations serving children and families to promote child find awareness efforts.",0,0,"2021-11-22"]
["B-BP1-c","BestPractice","Collaboration","BP 1","c","Establish policies and procedures that support ongoing and effective communication and collaborative relationships between Part C and Part B to support transition.",0,0,"2021-11-22"]
["B-BP1-d","BestPractice","Collaboration","BP 1","d","Establish policies and procedures to support ongoing collaborative relationships with community agencies that serve underserved and at-risk populations.",0,0,"2021-11-22"]
["B-BP1-e","BestPractice","Collaboration","BP 1","e","Collaborate with community organizations serving children and families to promote screening efforts (e.g., implementing community-wide screening) and referral efforts. Conduct regular conversations with community partners to develop shared awareness of local monitoring, screening, and referral efforts and sources.",0,0,"2021-11-22"]
["B-BP1-f","BestPractice","Collaboration","BP 1","f","Collaborate with child care programs, private schools, and charter schools to promote pathways for screening and referral for children served by those programs.",0,0,"2021-11-22"]
["B-BP1-g","BestPractice","Collaboration","BP 1","g","Collaborate with community agencies to promote partnerships with families to promote the referral process.",0,0,"2021-11-22"]
["B-BP1-h","BestPractice","Collaboration","BP 1","h","Coordinate with surrounding Local Education Agencies (LEAs) to streamline referral process.",0,0,"2021-11-22"]
["B-BP1-i","BestPractice","Collaboration","BP 1","i","Implement respectful and appropriate pre-referral education and information-sharing with families to support their understanding of the importance of early childhood special education (ECSE) and to reduce stigma.",0,0,"2021-11-22"]
["B-BP2-a","BestPractice","Identification","BP 2","a","With partner organizations, target materials describing early childhood special education and the associated referral process towards underserved populations. Ensure that families are able to access materials in various formats, including in their native language.",0,0,"2021-11-22"]
["B-BP2-b","BestPractice","Identification","BP 2","b","Use strategies such as a 211 telephone-based service to connect families to resources related to developmental screening, referral to LEAs, and other community resources.",0,0,"2021-11-22"]
["B-BP2-c","BestPractice","Identification","BP 2","c","Engage community health workers, trusted community members, and other cultural brokers to advocate for and facilitate the child find process. Cultural brokers are individuals who promote family engagement and help to bridge relationships between the community and the LEA.",0,0,"2021-11-22"]
["B-BP3-a","BestPractice","DataSystems","BP 3","a","States and LEAs have formal data governance structures and processes in place to ensure the protection and security of child find data. There are written policies and procedures that manage the appropriate access of data, transmission of data, and sharing of individualized education program (IEP) information.",2,"M","2021-11-22"]
["B-BP3-b","BestPractice","DataSystems","BP 3","b","Establish necessary data sharing agreements, such as memorandums of understanding (MOU), with collaborating agencies and programs in accordance with federal and state data privacy laws and regulations, including the Health Insurance Portability and Accountability Act (HIPAA) and Family Educational Rights and Privacy Act (FERPA).",3,"H","2021-11-22"]
["B-BP3-c","BestPractice","DataSystems","BP 3","c","State and local data systems include sufficient technical security measures (e.g., firewalls, secure laptops, password, management, etc.) and nontechnical security measures (e.g., data access and sharing restrictions, regular staff trainings, ensuring correct access and administrative rights are granted for staff and authorized data users) to minimize the risk of disclosing Personally Identifiable Information (PII).",1,"L","2021-11-22"]
["B-BP3-d","BestPractice","DataSystems","BP 3","d","State and local data systems have the capacity to support accountability, program development, and program operations and includes BestPractices and features of high-quality data systems.",4,0,"2021-11-22"]
["B-BP3-e","BestPractice","DataSystems","BP 3","e","State and local data systems have the capacity for data interoperability to allow the linking of Part B data with other statewide longitudinal and early childhood data systems, including Part C data systems.",1,0,"2021-11-22"]
["B-BP3-f","BestPractice","DataSystems","BP 3","f","The data collected are high-quality.",4,0,"2021-11-22"]
["B-BP3-g","BestPractice","DataSystems","BP 3","g","Referral information is included in the data system.",0,0,"2021-11-22"]
["B-BP3-h","BestPractice","DataSystems","BP 3","h","State and local data systems, directly or through a related application, have reporting and analysis tools that provide end users, including state and local program staff, with easy access to the data in both raw form and reports.",0,0,"2021-11-22"]
["B-BP3-i","BestPractice","DataSystems","BP 3","i","State and local data systems feature methods for identifying underserved populations.",0,0,"2021-11-22"]
["B-BP3-j","BestPractice","DataSystems","BP 3","j","Reports generated from the data systems include metrics that are useful for monitoring the child find system.",0,0,"2021-11-22"]
["B-BP4-a","BestPractice","Evaluation","BP 4","a","Screening tools are used for the purpose in which they are intended.",0,0,"2021-11-22"]
["B-BP4-b","BestPractice","Evaluation","BP 4","b","Standardized developmental screening tools with strong psychometric properties and sufficient sensitivity to detect child progress are used.",0,0,"2021-11-22"]
["B-BP4-c","BestPractice","Evaluation","BP 4","c","Screening tools are brief and have a reduced literacy burden.",0,0,"2021-11-22"]
["B-BP4-d","BestPractice","Evaluation","BP 4","d","Developmental screening tools include social-emotional development.",0,0,"2021-11-22"]
["B-BP4-e","BestPractice","Evaluation","BP 4","e","Individuals conducting screenings are qualified and trained in the instrument’s administration, scoring, and interpretation of results.",0,0,"2021-11-22"]
["B-BP4-f","BestPractice","Evaluation","BP 4","f","Screening tools are culturally and linguistically appropriate for the individual child. Interpreters administer screenings and evaluations in the child’s dominant language.",0,0,"2021-11-22"]
["B-BP4-g","BestPractice","Evaluation","BP 4","g","Valid and reliable screening tools are available to use in-person and remotely.",0,0,"2021-11-22"]
["B-BP5-a","BestPractice","Adequacy","BP 5","a","Ensure screening opportunities reach all children by coordinating with community-wide screening efforts to meet existing and essential timelines and recommendations for screenings (e.g., health, vision, hearing, immunizations) and ensure children are referred appropriately.",0,0,"2021-11-22"]
["B-BP5-b","BestPractice","Adequacy","BP 5","b","The early childhood community coordinates with physician developmental monitoring, screening, and surveillance.",0,0,"2021-11-22"]
["B-BP5-c","BestPractice","Adequacy","BP 5","c","Screening involves family partnership and perspectives, considers family preferences and cultural contexts, and is conducted in the child’s dominant language.",0,0,"2021-11-22"]
["B-BP5-d","BestPractice","Adequacy","BP 5","d","Simple, straightforward referral processes are used to facilitate ease of referral by the family, which may include the use of a universal intake form or information form.",0,0,"2021-11-22"]
["B-BP5-e","BestPractice","Adequacy","BP 5","e","Referral information is entered into the data system.",0,0,"2021-11-22"]
["B-BP5-f","BestPractice","Adequacy","BP 5","f","Within multi-tiered systems of support (e.g., RTI), children suspected of having a disability cannot be required to go through all tiers of the system before referral to early childhood special education.",0,0,"2021-11-22"]
["B-BP5-g","BestPractice","Adequacy","BP 5","g","Effective screening policies and procedures are in place to respond to disruptions caused by emergencies and natural disasters.",0,0,"2021-11-22"]
["B-BP5-h","BestPractice","Adequacy","BP 5","h","Screening and referral procedures are re-aligned to meet health and safety measures and requirements during emergencies and natural disasters.",0,0,"2021-11-22"]
["B-BP6-a","BestPractice","Efficiency","BP 6","a","Connect families to resources, local community agencies, or early childhood programs to meet family/child needs that ECSE does not currently address.",0,0,"2021-11-22"]
["B-BP6-b","BestPractice","Efficiency","BP 6","b","Promote linkages between ECSE and a network of programs and services so that children’s developmental concerns are addressed.",0,0,"2021-11-22"]
["B-BP6-c","BestPractice","Efficiency","BP 6","c","Repeat screening and monitoring for children whose assessment scores indicated they are at risk but who did not meet eligibility criteria.",0,0,"2021-11-22"]
["B-BP7-a","BestPractice","Ineligible","BP 7","a","The state has a method for evaluating the effectiveness of child find efforts across the state.",0,0,"2021-11-22"]
["B-BP7-b","BestPractice","Ineligible","BP 7","b","Reports from the state data system include metrics useful for monitoring the child find system.",0,0,"2021-11-22"]
["B-BP7-c","BestPractice","Ineligible","BP 7","c","The LEA has a method for evaluating the effectiveness of local child find efforts and progress towards best practices, including experiences of parents and primary referral source.",0,0,"2021-11-22"]
["B-BP7-d","BestPractice","Ineligible","BP 7","d","The LEA data system, directly or through a related application, has reporting and analysis tools that provide end users, including state and local program staff, with easy access to the data in both raw form and reports.                                                                           ",0,0,"2021-11-22"]
["B-BP7-e","BestPractice","Ineligible","BP 7","e","Data systems (state and LEA) feature methods for identifying underserved populations.",0,0,"2021-11-22"]

{"sheet":"Help","index":7,"n_rows":210,"n_cols":3,"rows_kept":210,"cut":false,"hidden":false,"merged":[[194,0,219,0],[194,1,195,1],[196,1,199,1],[200,1,205,1],[206,1,208,1],[209,1,219,1],[167,0,192,0],[167,1,168,1],[169,1,171,1],[172,1,176,1],[177,1,180,1],[181,1,184,1],[138,0,165,0],[138,1,139,1],[140,1,143,1],[144,1,165,1],[100,0,136,0],[100,1,101,1],[82,1,91,1],[92,1,93,1],[102,1,105,1],[106,1,135,1],[0,1,0,3],[1,2,1,3],[15,1,16,1],[17,1,18,1],[59,1,61,1],[21,1,23,1],[39,1,43,1],[79,1,81,1],[4,0,36,0],[4,1,5,1],[6,1,7,1],[9,1,10,1],[12,1,13,1]]}
[null,"Help!   Click a topic to view more information and some trouble-shooting ideas"]
[]
[]
[]
[null,"Enable Macros in Excel","For more on enabling macros, please see: https://powerspreadsheets.com/how-to-enablB-macros-excel/"]
[]
[null,"When you open this file, you should see a prompt at the top of the window to \"Enable Content.\""]
[]
[]
[null,"If you see this button, click, \"Enable Content\" so that the macros will be allowed to work."]
[]
[]
[null,"If you do NOT see the \"Enable Content\" button, you may need to change your macro settings in Excel."]
[]
[]
[null,"Change Macro Settings in Excel"]
[]
[null,"To begin, click the \"File\" tab at the top left corner of your Excel window."]
[]
[]
[]
[null,"Once you have clicked \"File\" you will see this screen with \"Options\" at the bottom of the list.  Click \"Options.\""]
[]
[]
[]
[]
[]
[]
[]
[]
[]
[]
[]
[]
[]
[]
[]
[]
[]
[null,"After you click \"Options\" in the previous step, you should see this popup window with \"Trust Center\" at the bottom of the list of options on the left. Click \"Trust Center.\""]
[]
[]
[]
[]
[]
[]
[]
[]
[]
[]
[]
[]
[]
[]
[]
[]
[]
[]
[]
[null,"From the Trust Center, select \"Trust Center Settings.\""]
[]
[]
[]
[]
[]
[]
[]
[]
[]
[]
[]
[]
[]
[]
[]
[]
[]
[]
[]
[null,"On the Trust Center Settings, select Macro Settings from the left menu."]
[]
[]
[null,"On this screen you might see that your macro option is set to \"Disable all macros without notification.\"  Change this to \"Disable all macros with notification\" which will give you the option to enable macros each time you open a macro-driven file. These macro settings are in order from more secure (at the top) to less secure (at the bottom), so keeping the ability to selectively enable macros when you choose to do so is your best option."]
[]
[]
[]
[]
[]
[]
[]
[]
[]
[null,"Click \"OK\" twice to finalize your settings."]
[]
[]
[]
[]
[]
[]
[]
[null,"What do all these buttons do?"]
[]
[null,"On the \"Child Find Best Practices\" tab, the rounded-corner buttons and the curved arrow button will allow you to interact with this workbook:"]
[]
[]
[]
[null," - Table of Contents: Link jumps you to Table of Contents tab (and away from this tab)\n - Theme 1, Theme 2, etc.: Each of these multi-colored buttons jumps you to that Theme.  These are all located in this same tab - you can navigate with these buttons or by scrolling, whichever you prefer.\n - Show Evidence: If the Evidence rows are hidden, this button reveals all the Evidence rows (e.g. rows 8, 10, 12, 14, etc. in the image to the right).\n - Hide Evidence: If the Evidence rows are visible, this button hides all the Evidence rows (e.g. rows 8, 10, 12, 14, etc. in the image to the right).\n - PDF with Evidence: First shows all Evidence rows, then creates a PDF of this tab. (Evidence rows will be shown in the PDF and in the workbook).\n - PDF without Evidence: First hides all Evidence rows, then creates a PDF of this tab. (Evidence rows will be hidden in the PDF and in the workbook).\n - Theme Ratings Explained: Shows a pop-up window describing what each Theme Rating means. This window  can be moved around to float over your screen as a reference as you work or closed at any time by clicking the \"x\" in the upper right corner.\n - Best Practice Ratings Explained: Shows a pop-up window describing what each Best Practice Rating means. This window  can be moved around to float over your screen as a reference as you work or closed at any time by clicking the \"x\" in the upper right corner."]
[]
[]
[]
[]
[]
[]
[]
[]
[]
[]
[]
[]
[]
[]
[]
[]
[null,null,"More information about saving PDFs is included below."]
[]
[]
[]
[]
[]
[]
[]
[]
[]
[]
[]
[]
[]
[]
[null,"How to Enter Data"]
[]
[null,"On the \"Child Find Best Practices\" tab, the light yellow cells are the only places where you can add text or enter ratings for your program. Other cells are protected and cannot be edited."]
[]
[]
[]
[null," - Evidence: You may wish to include notes or evidence about a particular best practice for your own record-keeping (optional). \nNote: if you do not see Evidence rows as shown in the image to the right, click the \"Show Evidence\" button at the top of the tab to unhide those rows.\n\n - Best Practice Rating: You may give any individual Best Practice a Rating of 1, 2, 3, or 4 (in column L), explained in the Best Practice Rating Chart that you access by clicking the button at the top of the page.\nNote: You CANNOT RATE A THEME overall; instead, a theme rating is calculated once you have entered ratings for its individual best practices.\n\n - PRIORITY: You may give a priority rating for any Best Practice and/or Theme by entering the letter (H, M, or L in lower- or upper- case) or by selecting a letter from the dropdown list. The priority ratings are optional. A list of any BPs marked as high priority is available in the Action Plan tab."]
[]
[]
[]
[]
[]
[]
[]
[]
[]
[]
[]
[]
[]
[]
[]
[]
[]
[]
[]
[]
[]
[]
[null,"Saving PDFs"]
[]
[null,"At the top of the Child Find Best Practices tab are the buttons: PDF with Evidence, and PDF without Evidence."]
[]
[]
[null,"When you click on one of these PDF buttons, you will be prompted to choose a folder in which to save the file.  The file is automatically named for you and includes the current date in the file name."]
[]
[]
[]
[]
[null,"In this example, I created a folder on my desktop called \"Child Find Best Practices\" where this PDF will be stored. "]
[]
[]
[]
[null,"Once the file is created, it may open automatically in your browser (depending on your settings) or you may need to navigate to where the file is stored to open it."]
[]
[]
[]
[]
[]
[]
[]
[]
[]
[]
[]
[]
[null,"Data tab"]
[]
[null,"On the Instructions tab or on the Table of Contents tab there is a \"Get Data\" button which pulls all data entered in the workbook into one data sheet (Data tab)."]
[]
[]
[]
[null,"The information in the Data tab is a chart of each Theme, its overall rating and priority as well as how many Best Practices contributed to that rating (Count_Actual, column K).  Date is included (column I) to show when the Get Data operation was executed."]
[]
[]
[]
[]
[]
[null,"Below the Themes (rows 2:8) are all the individual Best Practices (rows 10:46)."]
[]
[]
[null,"Note: Each time you visit the Data tab, its contents update with the latest values from the workbook. If you would like to make a change to a value in the Data worksheet, you should find the Theme or Best Practice in the Child Find Best Practices tab and make the change there.  Any change(s) you make in the Data tab will be over-written the next time you come back to the Data tab.  The contents of this tab are NOT write-protected so that you can copy/paste the data elsewhere if you would like to do so."]

{"sheet":"ALLdata","index":8,"n_rows":61,"n_cols":18,"rows_kept":61,"cut":false,"hidden":true,"merged":[]}
["Index","Type","Component","QINumber","BestPracticeNumber","Text","BestPracticeRating","QIRating","Priority","Date","Count_Expected","Count_Actual",1,2,3,4,"Not Applicable","RatingToLookup"]
[{"$f":"\"T-\"&LEFT(D2,2)&RIGHT(D2)&\"-0\"","v":"T-BP1-0"},"Theme","Collaboration","BP 1",0,"Cross-Sector Collaboration","-",{"$f":"IF(L2<>0,VLOOKUP(R2,QIRatingLookup!A:B,2,FALSE),0)","v":0},{"$f":"IFERROR(VLOOKUP($A2,'Child Find Best Practices'!$B:$N,13,FALSE),\"\")","v":0},{"$f":"TODAY()","v":"2022-02-24"},{"$f":"COUNTIFS($B:$B,\"BestPractice\",$D:$D,$D2)","v":9},{"$f":"VALUE(M2)+VALUE(N2)+VALUE(O2)+VALUE(P2)+VALUE(Q2)","v":0},{"$f":"RIGHT(\"0\"&COUNTIFS($D:$D,$D2,$G:$G,M$1,$B:$B,\"BestPractice\"),2)","v":"00"},"00","00","00",null,{"$f":"M2&\"-\"&N2&\"-\"&O2&\"-\"&P2","v":"00-00-00-00"}]
["T-BP2-0","Theme","Identification","BP 2",0,"Identifying Children who are Underserved by Part B","-",{"$f":"IF(L3<>0,VLOOKUP(R3,QIRatingLookup!A:B,2,FALSE),0)","v":0},{"$f":"IFERROR(VLOOKUP($A3,'Child Find Best Practices'!$B:$N,13,FALSE),\"\")","v":0},{"$f":"TODAY()","v":"2022-02-24"},3,{"$f":"VALUE(M3)+VALUE(N3)+VALUE(O3)+VALUE(P3)+VALUE(Q3)","v":0},"00","00","00","00",null,{"$f":"M3&\"-\"&N3&\"-\"&O3&\"-\"&P3","v":"00-00-00-00"}]
["T-BP3-0","Theme","DataSystems","BP 3",0,"Data and Data Systems","-",{"$f":"IF(L4<>0,VLOOKUP(R4,QIRatingLookup!A:B,2,FALSE),0)","v":4},{"$f":"IFERROR(VLOOKUP($A4,'Child Find Best Practices'!$B:$N,13,FALSE),\"\")","v":0},"2022-02-24",10,{"$f":"VALUE(M4)+VALUE(N4)+VALUE(O4)+VALUE(P4)+VALUE(Q4)","v":6},"02","01","01","02",null,"02-01-01-02"]
["T-BP4-0","Theme","Adequacy","BP 4",0,"Technical Adequacy of Screening Tools","-",{"$f":"IF(L5<>0,VLOOKUP(R5,QIRatingLookup!A:B,2,FALSE),0)","v":0},{"$f":"IFERROR(VLOOKUP($A5,'Child Find Best Practices'!$B:$N,13,FALSE),\"\")","v":0},"2022-02-24",7,0,"00","00","00","00",null,"00-00-00-00"]
["T-BP5-0","Theme","Efficiency","BP 5",0,"Efficiency of Screening and Referral Process and Procedures","-",{"$f":"IF(L6<>0,VLOOKUP(R6,QIRatingLookup!A:B,2,FALSE),0)","v":0},{"$f":"IFERROR(VLOOKUP($A6,'Child Find Best Practices'!$B:$N,13,FALSE),\"\")","v":0},"2022-02-24",8,0,"00","00","00","00",null,"00-00-00-00"]
["T-BP6-0","Theme","Ineligible","BP 6",0,"Responding When Children are Found Ineligible for Part B","-",{"$f":"IF(L7<>0,VLOOKUP(R7,QIRatingLookup!A:B,2,FALSE),0)","v":0},{"$f":"IFERROR(VLOOKUP($A7,'Child Find Best Practices'!$B:$N,13,FALSE),\"\")","v":0},"2022-02-24",3,{"$f":"VALUE(M7)+VALUE(N7)+VALUE(O7)+VALUE(P7)+VALUE(Q7)","v":0},"00","00","00","00",null,{"$f":"M7&\"-\"&N7&\"-\"&O7&\"-\"&P7","v":"00-00-00-00"}]
["T-BP7-0","Theme","Evaluation","BP 7",0,"Evaluation of Child Find","-",{"$f":"IF(L8<>0,VLOOKUP(R8,QIRatingLookup!A:B,2,FALSE),0)","v":0},{"$f":"IFERROR(VLOOKUP($A8,'Child Find Best Practices'!$B:$N,13,FALSE),\"\")","v":0},"2022-02-24",5,0,"00","00","00","00",null,"00-00-00-00"]
[]
[]
[]
[]
[]
[]
[]
[null,null,null,null,null,null,null,null,null,null,null,null,null,null,null,null,null,{"$f":"R17&R18&R19&R20&R21&R22&R23&R24&R25&R26&R27&R28&R29&R30&R31&R32&R33&R34&R35&R36&R37&R38&R39&R40&R41&R42&R43&R44&R45&R46&R47&R48&R49&R50&R51&R52&R53&R54&R55&R56&R57&R58&R59&R60&R61","v":"\n[BP 3-b]  Establish necessary data sharing agreements, such as memorandums of understanding (MOU), with collaborating agencies and programs in accordance with federal and state data privacy laws and regulations, including the Health Insurance Portability and Accountability Act (HIPAA) and Family Educational Rights and Privacy Act (FERPA).\n"}]
[{"$f":"\"B-\"&LEFT(D17,2)&RIGHT(D17)&\"-\"&E17","v":"B-BP1-a"},"BestPractice","Collaboration","BP 1","a","Leverage federal or state-funded early childhood systems initiatives and coordinate with collaborating agencies to promote child find awareness, screening, and referral efforts.",{"$f":"IFERROR(VLOOKUP($A17,'Child Find Best Practices'!$B:$N,11,FALSE),\"\")","v":0},"-",{"$f":"IFERROR(VLOOKUP($A17,'Child Find Best Practices'!$B:$N,13,FALSE),\"\")","v":0},"2022-02-24",null,null,{"$f":"IF($I17=\"H\",MAX($M$16:$M16)+1,\"\")","v":""},{"$f":"\"[\"&D17&\"-\"&E17&\"]\"&\"  \"&F17","v":"[BP 1-a]  Leverage federal or state-funded early childhood systems initiatives and coordinate with collaborating agencies to promote child find awareness, screening, and referral efforts."},null,1,{"$f":"IFERROR(VLOOKUP($P17,$M$17:$N$81,2,FALSE),\"\")","v":"[BP 3-b]  Establish necessary data sharing agreements, such as memorandums of understanding (MOU), with collaborating agencies and programs in accordance with federal and state data privacy laws and regulations, including the Health Insurance Portability and Accountability Act (HIPAA) and Family Educational Rights and Privacy Act (FERPA)."},{"$f":"IF(Q17=\"\",\"\",CHAR(10)&Q17&CHAR(10))","v":"\n[BP 3-b]  Establish necessary data sharing agreements, such as memorandums of understanding (MOU), with collaborating agencies and programs in accordance with federal and state data privacy laws and regulations, including the Health Insurance Portability and Accountability Act (HIPAA) and Family Educational Rights and Privacy Act (FERPA).\n"}]
["B-BP1-b","BestPractice","Collaboration","BP 1","b","Collaborate with Part C and other community organizations serving children and families to promote child find awareness efforts.",{"$f":"IFERROR(VLOOKUP($A18,'Child Find Best Practices'!$B:$N,11,FALSE),\"\")","v":0},"-",{"$f":"IFERROR(VLOOKUP($A18,'Child Find Best Practices'!$B:$N,13,FALSE),\"\")","v":0},"2022-02-24",null,null,{"$f":"IF($I18=\"H\",MAX($M$16:$M17)+1,\"\")","v":""},{"$f":"\"[\"&D18&\"-\"&E18&\"]\"&\"  \"&F18","v":"[BP 1-b]  Collaborate with Part C and other community organizations serving children and families to promote child find awareness efforts."},null,2,"",{"$f":"IF(Q18=\"\",\"\",CHAR(10)&Q18&CHAR(10))","v":""}]
["B-BP1-c","BestPractice","Collaboration","BP 1","c","Establish policies and procedures that support ongoing and effective communication and collaborative relationships between Part C and Part B to support transition.",{"$f":"IFERROR(VLOOKUP($A19,'Child Find Best Practices'!$B:$N,11,FALSE),\"\")","v":0},"-",{"$f":"IFERROR(VLOOKUP($A19,'Child Find Best Practices'!$B:$N,13,FALSE),\"\")","v":0},"2022-02-24",null,null,{"$f":"IF($I19=\"H\",MAX($M$16:$M18)+1,\"\")","v":""},"[BP 1-c]  Establish policies and procedures that support ongoing and effective communication and collaborative relationships between Part C and Part B to support transition.",null,3,"",""]
["B-BP1-d","BestPractice","Collaboration","BP 1","d","Establish policies and procedures to support ongoing collaborative relationships with community agencies that serve underserved and at-risk populations.",{"$f":"IFERROR(VLOOKUP($A20,'Child Find Best Practices'!$B:$N,11,FALSE),\"\")","v":0},"-",{"$f":"IFERROR(VLOOKUP($A20,'Child Find Best Practices'!$B:$N,13,FALSE),\"\")","v":0},"2022-02-24",null,null,{"$f":"IF($I20=\"H\",MAX($M$16:$M19)+1,\"\")","v":""},"[BP 1-d]  Establish policies and procedures to support ongoing collaborative relationships with community agencies that serve underserved and at-risk populations.",null,4,"",""]
["B-BP1-e","BestPractice","Collaboration","BP 1","e","Collaborate with community organizations serving children and families to promote screening efforts (e.g., implementing community-wide screening) and referral efforts. Conduct regular conversations with community partners to develop shared awareness of local monitoring, screening, and referral efforts and sources.",{"$f":"IFERROR(VLOOKUP($A21,'Child Find Best Practices'!$B:$N,11,FALSE),\"\")","v":0},"-",{"$f":"IFERROR(VLOOKUP($A21,'Child Find Best Practices'!$B:$N,13,FALSE),\"\")","v":0},"2022-02-24",null,null,{"$f":"IF($I21=\"H\",MAX($M$16:$M20)+1,\"\")","v":""},"[BP 1-e]  Collaborate with community organizations serving children and families to promote screening efforts (e.g., implementing community-wide screening) and referral efforts. Conduct regular conversations with community partners to develop shared awareness of local monitoring, screening, and referral efforts and sources.",null,5,"",""]
["B-BP1-f","BestPractice","Collaboration","BP 1","f","Collaborate with child care programs, private schools, and charter schools to promote pathways for screening and referral for children served by those programs.",{"$f":"IFERROR(VLOOKUP($A22,'Child Find Best Practices'!$B:$N,11,FALSE),\"\")","v":0},"-",{"$f":"IFERROR(VLOOKUP($A22,'Child Find Best Practices'!$B:$N,13,FALSE),\"\")","v":0},"2022-02-24",null,null,{"$f":"IF($I22=\"H\",MAX($M$16:$M21)+1,\"\")","v":""},"[BP 1-f]  Collaborate with child care programs, private schools, and charter schools to promote pathways for screening and referral for children served by those programs.",null,6,"",""]
["B-BP1-g","BestPractice","Collaboration","BP 1","g","Collaborate with community agencies to promote partnerships with families to promote the referral process.",{"$f":"IFERROR(VLOOKUP($A23,'Child Find Best Practices'!$B:$N,11,FALSE),\"\")","v":0},"-",{"$f":"IFERROR(VLOOKUP($A23,'Child Find Best Practices'!$B:$N,13,FALSE),\"\")","v":0},"2022-02-24",null,null,{"$f":"IF($I23=\"H\",MAX($M$16:$M22)+1,\"\")","v":""},{"$f":"\"[\"&D23&\"-\"&E23&\"]\"&\"  \"&F23","v":"[BP 1-g]  Collaborate with community agencies to promote partnerships with families to promote the referral process."},null,7,"",""]
["B-BP1-h","BestPractice","Collaboration","BP 1","h","Coordinate with surrounding Local Education Agencies (LEAs) to streamline referral process.",{"$f":"IFERROR(VLOOKUP($A24,'Child Find Best Practices'!$B:$N,11,FALSE),\"\")","v":0},"-",{"$f":"IFERROR(VLOOKUP($A24,'Child Find Best Practices'!$B:$N,13,FALSE),\"\")","v":0},"2022-02-24",null,null,{"$f":"IF($I24=\"H\",MAX($M$16:$M23)+1,\"\")","v":""},{"$f":"\"[\"&D24&\"-\"&E24&\"]\"&\"  \"&F24","v":"[BP 1-h]  Coordinate with surrounding Local Education Agencies (LEAs) to streamline referral process."},null,8,"",""]
["B-BP1-i","BestPractice","Collaboration","BP 1","i","Implement respectful and appropriate pre-referral education and information-sharing with families to support their understanding of the importance of early childhood special education (ECSE) and to reduce stigma.",{"$f":"IFERROR(VLOOKUP($A25,'Child Find Best Practices'!$B:$N,11,FALSE),\"\")","v":0},"-",{"$f":"IFERROR(VLOOKUP($A25,'Child Find Best Practices'!$B:$N,13,FALSE),\"\")","v":0},"2022-02-24",null,null,{"$f":"IF($I25=\"H\",MAX($M$16:$M24)+1,\"\")","v":""},{"$f":"\"[\"&D25&\"-\"&E25&\"]\"&\"  \"&F25","v":"[BP 1-i]  Implement respectful and appropriate pre-referral education and information-sharing with families to support their understanding of the importance of early childhood special education (ECSE) and to reduce stigma."},null,9,"",""]
["B-BP2-a","BestPractice","Identification","BP 2","a","With partner organizations, target materials describing early childhood special education and the associated referral process towards underserved populations. Ensure that families are able to access materials in various formats, including in their native language.",{"$f":"IFERROR(VLOOKUP($A26,'Child Find Best Practices'!$B:$N,11,FALSE),\"\")","v":0},"-",{"$f":"IFERROR(VLOOKUP($A26,'Child Find Best Practices'!$B:$N,13,FALSE),\"\")","v":0},"2022-02-24",null,null,{"$f":"IF($I26=\"H\",MAX($M$16:$M25)+1,\"\")","v":""},"[BP 2-a]  With partner organizations, target materials describing early childhood special education and the associated referral process towards underserved populations. Ensure that families are able to access materials in various formats, including in their native language.",null,10,"",""]
["B-BP2-b","BestPractice","Identification","BP 2","b","Use strategies such as a 211 telephone-based service to connect families to resources related to developmental screening, referral to LEAs, and other community resources.",{"$f":"IFERROR(VLOOKUP($A27,'Child Find Best Practices'!$B:$N,11,FALSE),\"\")","v":0},"-",{"$f":"IFERROR(VLOOKUP($A27,'Child Find Best Practices'!$B:$N,13,FALSE),\"\")","v":0},"2022-02-24",null,null,{"$f":"IF($I27=\"H\",MAX($M$16:$M26)+1,\"\")","v":""},"[BP 2-b]  Use strategies such as a 211 telephone-based service to connect families to resources related to developmental screening, referral to LEAs, and other community resources.",null,11,"",""]
["B-BP2-c","BestPractice","Identification","BP 2","c","Engage community health workers, trusted community members, and other cultural brokers to advocate for and facilitate the child find process. Cultural brokers are individuals who promote family engagement and help to bridge relationships between the community and the LEA.",{"$f":"IFERROR(VLOOKUP($A28,'Child Find Best Practices'!$B:$N,11,FALSE),\"\")","v":0},"-",{"$f":"IFERROR(VLOOKUP($A28,'Child Find Best Practices'!$B:$N,13,FALSE),\"\")","v":0},"2022-02-24",null,null,{"$f":"IF($I28=\"H\",MAX($M$16:$M27)+1,\"\")","v":""},"[BP 2-c]  Engage community health workers, trusted community members, and other cultural brokers to advocate for and facilitate the child find process. Cultural brokers are individuals who promote family engagement and help to bridge relationships between the community and the LEA.",null,12,"",""]
["B-BP3-a","BestPractice","DataSystems","BP 3","a","States and LEAs have formal data governance structures and processes in place to ensure the protection and security of child find data. There are written policies and procedures that manage the appropriate access of data, transmission of data, and sharing of individualized education program (IEP) information.",{"$f":"IFERROR(VLOOKUP($A29,'Child Find Best Practices'!$B:$N,11,FALSE),\"\")","v":2},"-",{"$f":"IFERROR(VLOOKUP($A29,'Child Find Best Practices'!$B:$N,13,FALSE),\"\")","v":"M"},"2022-02-24",null,null,{"$f":"IF($I29=\"H\",MAX($M$16:$M28)+1,\"\")","v":""},"[BP 3-a]  States and LEAs have formal data governance structures and processes in place to ensure the protection and security of child find data. There are written policies and procedures that manage the appropriate access of data, transmission of data, and sharing of individualized education program (IEP) information.",null,13,"",""]
["B-BP3-b","BestPractice","DataSystems","BP 3","b","Establish necessary data sharing agreements, such as memorandums of understanding (MOU), with collaborating agencies and programs in accordance with federal and state data privacy laws and regulations, including the Health Insurance Portability and Accountability Act (HIPAA) and Family Educational Rights and Privacy Act (FERPA).",{"$f":"IFERROR(VLOOKUP($A30,'Child Find Best Practices'!$B:$N,11,FALSE),\"\")","v":3},"-",{"$f":"IFERROR(VLOOKUP($A30,'Child Find Best Practices'!$B:$N,13,FALSE),\"\")","v":"H"},"2022-02-24",null,null,{"$f":"IF($I30=\"H\",MAX($M$16:$M29)+1,\"\")","v":1},"[BP 3-b]  Establish necessary data sharing agreements, such as memorandums of understanding (MOU), with collaborating agencies and programs in accordance with federal and state data privacy laws and regulations, including the Health Insurance Portability and Accountability Act (HIPAA) and Family Educational Rights and Privacy Act (FERPA).",null,14,"",""]
["B-BP3-c","BestPractice","DataSystems","BP 3","c","State and local data systems include sufficient technical security measures (e.g., firewalls, secure laptops, password, management, etc.) and nontechnical security measures (e.g., data access and sharing restrictions, regular staff trainings, ensuring correct access and administrative rights are granted for staff and authorized data users) to minimize the risk of disclosing Personally Identifiable Information (PII).",{"$f":"IFERROR(VLOOKUP($A31,'Child Find Best Practices'!$B:$N,11,FALSE),\"\")","v":1},"-",{"$f":"IFERROR(VLOOKUP($A31,'Child Find Best Practices'!$B:$N,13,FALSE),\"\")","v":"L"},"2022-02-24",null,null,{"$f":"IF($I31=\"H\",MAX($M$16:$M30)+1,\"\")","v":""},"[BP 3-c]  State and local data systems include sufficient technical security measures (e.g., firewalls, secure laptops, password, management, etc.) and nontechnical security measures (e.g., data access and sharing restrictions, regular staff trainings, ensuring correct access and administrative rights are granted for staff and authorized data users) to minimize the risk of disclosing Personally Identifiable Information (PII).",null,15,"",""]
["B-BP3-d","BestPractice","DataSystems","BP 3","d","State and local data systems have the capacity to support accountability, program development, and program operations and includes BestPractices and features of high-quality data systems.",{"$f":"IFERROR(VLOOKUP($A32,'Child Find Best Practices'!$B:$N,11,FALSE),\"\")","v":4},"-",{"$f":"IFERROR(VLOOKUP($A32,'Child Find Best Practices'!$B:$N,13,FALSE),\"\")","v":0},"2022-02-24",null,null,{"$f":"IF($I32=\"H\",MAX($M$16:$M31)+1,\"\")","v":""},"[BP 3-d]  State and local data systems have the capacity to support accountability, program development, and program operations and includes BestPractices and features of high-quality data systems.",null,16,"",""]
["B-BP3-e","BestPractice","DataSystems","BP 3","e","State and local data systems have the capacity for data interoperability to allow the linking of Part B data with other statewide longitudinal and early childhood data systems, including Part C data systems.",{"$f":"IFERROR(VLOOKUP($A33,'Child Find Best Practices'!$B:$N,11,FALSE),\"\")","v":1},"-",{"$f":"IFERROR(VLOOKUP($A33,'Child Find Best Practices'!$B:$N,13,FALSE),\"\")","v":0},"2022-02-24",null,null,{"$f":"IF($I33=\"H\",MAX($M$16:$M32)+1,\"\")","v":""},"[BP 3-e]  State and local data systems have the capacity for data interoperability to allow the linking of Part B data with other statewide longitudinal and early childhood data systems, including Part C data systems.",null,17,"",""]
["B-BP3-f","BestPractice","DataSystems","BP 3","f","The data collected are high-quality.",{"$f":"IFERROR(VLOOKUP($A34,'Child Find Best Practices'!$B:$N,11,FALSE),\"\")","v":4},"-",{"$f":"IFERROR(VLOOKUP($A34,'Child Find Best Practices'!$B:$N,13,FALSE),\"\")","v":0},"2022-02-24",null,null,{"$f":"IF($I34=\"H\",MAX($M$16:$M33)+1,\"\")","v":""},{"$f":"\"[\"&D34&\"-\"&E34&\"]\"&\"  \"&F34","v":"[BP 3-f]  The data collected are high-quality."},null,18,"",""]
["B-BP3-g","BestPractice","DataSystems","BP 3","g","Referral information is included in the data system.",{"$f":"IFERROR(VLOOKUP($A35,'Child Find Best Practices'!$B:$N,11,FALSE),\"\")","v":0},"-",{"$f":"IFERROR(VLOOKUP($A35,'Child Find Best Practices'!$B:$N,13,FALSE),\"\")","v":0},"2022-02-24",null,null,{"$f":"IF($I35=\"H\",MAX($M$16:$M34)+1,\"\")","v":""},"[BP 3-g]  Referral information is included in the data system.",null,19,"",""]
["B-BP3-h","BestPractice","DataSystems","BP 3","h","State and local data systems, directly or through a related application, have reporting and analysis tools that provide end users, including state and local program staff, with easy access to the data in both raw form and reports.",{"$f":"IFERROR(VLOOKUP($A36,'Child Find Best Practices'!$B:$N,11,FALSE),\"\")","v":0},"-",{"$f":"IFERROR(VLOOKUP($A36,'Child Find Best Practices'!$B:$N,13,FALSE),\"\")","v":0},"2022-02-24",null,null,{"$f":"IF($I36=\"H\",MAX($M$16:$M35)+1,\"\")","v":""},"[BP 3-h]  State and local data systems, directly or through a related application, have reporting and analysis tools that provide end users, including state and local program staff, with easy access to the data in both raw form and reports.",null,20,"",""]
["B-BP3-i","BestPractice","DataSystems","BP 3","i","State and local data systems feature methods for identifying underserved populations.",{"$f":"IFERROR(VLOOKUP($A37,'Child Find Best Practices'!$B:$N,11,FALSE),\"\")","v":0},"-",{"$f":"IFERROR(VLOOKUP($A37,'Child Find Best Practices'!$B:$N,13,FALSE),\"\")","v":0},"2022-02-24",null,null,{"$f":"IF($I37=\"H\",MAX($M$16:$M36)+1,\"\")","v":""},"[BP 3-i]  State and local data systems feature methods for identifying underserved populations.",null,21,"",""]
["B-BP3-j","BestPractice","DataSystems","BP 3","j","Reports generated from the data systems include metrics that are useful for monitoring the child find system.",{"$f":"IFERROR(VLOOKUP($A38,'Child Find Best Practices'!$B:$N,11,FALSE),\"\")","v":0},"-",{"$f":"IFERROR(VLOOKUP($A38,'Child Find Best Practices'!$B:$N,13,FALSE),\"\")","v":0},"2022-02-24",null,null,{"$f":"IF($I38=\"H\",MAX($M$16:$M37)+1,\"\")","v":""},"[BP 3-j]  Reports generated from the data systems include metrics that are useful for monitoring the child find system.",null,22,"",""]
["B-BP4-a","BestPractice","Evaluation","BP 4","a","Screening tools are used for the purpose in which they are intended.",{"$f":"IFERROR(VLOOKUP($A39,'Child Find Best Practices'!$B:$N,11,FALSE),\"\")","v":0},"-",{"$f":"IFERROR(VLOOKUP($A39,'Child Find Best Practices'!$B:$N,13,FALSE),\"\")","v":0},"2022-02-24",null,null,{"$f":"IF($I39=\"H\",MAX($M$16:$M38)+1,\"\")","v":""},"[BP 4-a]  Screening tools are used for the purpose in which they are intended.",null,23,"",""]
["B-BP4-b","BestPractice","Evaluation","BP 4","b","Standardized developmental screening tools with strong psychometric properties and sufficient sensitivity to detect child progress are used.",{"$f":"IFERROR(VLOOKUP($A40,'Child Find Best Practices'!$B:$N,11,FALSE),\"\")","v":0},"-",{"$f":"IFERROR(VLOOKUP($A40,'Child Find Best Practices'!$B:$N,13,FALSE),\"\")","v":0},"2022-02-24",null,null,{"$f":"IF($I40=\"H\",MAX($M$16:$M39)+1,\"\")","v":""},"[BP 4-b]  Standardized developmental screening tools with strong psychometric properties and sufficient sensitivity to detect child progress are used.",null,24,"",""]
["B-BP4-c","BestPractice","Evaluation","BP 4","c","Screening tools are brief and have a reduced literacy burden.",{"$f":"IFERROR(VLOOKUP($A41,'Child Find Best Practices'!$B:$N,11,FALSE),\"\")","v":0},"-",{"$f":"IFERROR(VLOOKUP($A41,'Child Find Best Practices'!$B:$N,13,FALSE),\"\")","v":0},"2022-02-24",null,null,{"$f":"IF($I41=\"H\",MAX($M$16:$M40)+1,\"\")","v":""},"[BP 4-c]  Screening tools are brief and have a reduced literacy burden.",null,25,"",""]
["B-BP4-d","BestPractice","Evaluation","BP 4","d","Developmental screening tools include social-emotional development.",{"$f":"IFERROR(VLOOKUP($A42,'Child Find Best Practices'!$B:$N,11,FALSE),\"\")","v":0},"-",{"$f":"IFERROR(VLOOKUP($A42,'Child Find Best Practices'!$B:$N,13,FALSE),\"\")","v":0},"2022-02-24",null,null,{"$f":"IF($I42=\"H\",MAX($M$16:$M41)+1,\"\")","v":""},"[BP 4-d]  Developmental screening tools include social-emotional development.",null,26,"",""]
["B-BP4-e","BestPractice","Evaluation","BP 4","e","Individuals conducting screenings are qualified and trained in the instrument’s administration, scoring, and interpretation of results.",{"$f":"IFERROR(VLOOKUP($A43,'Child Find Best Practices'!$B:$N,11,FALSE),\"\")","v":0},"-",{"$f":"IFERROR(VLOOKUP($A43,'Child Find Best Practices'!$B:$N,13,FALSE),\"\")","v":0},"2022-02-24",null,null,{"$f":"IF($I43=\"H\",MAX($M$16:$M42)+1,\"\")","v":""},{"$f":"\"[\"&D43&\"-\"&E43&\"]\"&\"  \"&F43","v":"[BP 4-e]  Individuals conducting screenings are qualified and trained in the instrument’s administration, scoring, and interpretation of results."},null,27,"",""]
["B-BP4-f","BestPractice","Evaluation","BP 4","f","Screening tools are culturally and linguistically appropriate for the individual child. Interpreters administer screenings and evaluations in the child’s dominant language.",{"$f":"IFERROR(VLOOKUP($A44,'Child Find Best Practices'!$B:$N,11,FALSE),\"\")","v":0},"-",{"$f":"IFERROR(VLOOKUP($A44,'Child Find Best Practices'!$B:$N,13,FALSE),\"\")","v":0},"2022-02-24",null,null,{"$f":"IF($I44=\"H\",MAX($M$16:$M43)+1,\"\")","v":""},"[BP 4-f]  Screening tools are culturally and linguistically appropriate for the individual child. Interpreters administer screenings and evaluations in the child’s dominant language.",null,28,"",""]
["B-BP4-g","BestPractice","Evaluation","BP 4","g","Valid and reliable screening tools are available to use in-person and remotely.",{"$f":"IFERROR(VLOOKUP($A45,'Child Find Best Practices'!$B:$N,11,FALSE),\"\")","v":0},"-",{"$f":"IFERROR(VLOOKUP($A45,'Child Find Best Practices'!$B:$N,13,FALSE),\"\")","v":0},"2022-02-24",null,null,{"$f":"IF($I45=\"H\",MAX($M$16:$M44)+1,\"\")","v":""},"[BP 4-g]  Valid and reliable screening tools are available to use in-person and remotely.",null,29,"",""]
["B-BP5-a","BestPractice","Adequacy","BP 5","a","Ensure screening opportunities reach all children by coordinating with community-wide screening efforts to meet existing and essential timelines and recommendations for screenings (e.g., health, vision, hearing, immunizations) and ensure children are referred appropriately.",{"$f":"IFERROR(VLOOKUP($A46,'Child Find Best Practices'!$B:$N,11,FALSE),\"\")","v":0},"-",{"$f":"IFERROR(VLOOKUP($A46,'Child Find Best Practices'!$B:$N,13,FALSE),\"\")","v":0},"2022-02-24",null,null,{"$f":"IF($I46=\"H\",MAX($M$16:$M45)+1,\"\")","v":""},"[BP 5-a]  Ensure screening opportunities reach all children by coordinating with community-wide screening efforts to meet existing and essential timelines and recommendations for screenings (e.g., health, vision, hearing, immunizations) and ensure children are referred appropriately.",null,31,"",""]
["B-BP5-b","BestPractice","Adequacy","BP 5","b","The early childhood community coordinates with physician developmental monitoring, screening, and surveillance.",{"$f":"IFERROR(VLOOKUP($A47,'Child Find Best Practices'!$B:$N,11,FALSE),\"\")","v":0},"-",{"$f":"IFERROR(VLOOKUP($A47,'Child Find Best Practices'!$B:$N,13,FALSE),\"\")","v":0},"2022-02-24",null,null,{"$f":"IF($I47=\"H\",MAX($M$16:$M46)+1,\"\")","v":""},"[BP 5-b]  The early childhood community coordinates with physician developmental monitoring, screening, and surveillance.",null,32,"",""]
["B-BP5-c","BestPractice","Adequacy","BP 5","c","Screening involves family partnership and perspectives, considers family preferences and cultural contexts, and is conducted in the child’s dominant language.",{"$f":"IFERROR(VLOOKUP($A48,'Child Find Best Practices'!$B:$N,11,FALSE),\"\")","v":0},"-",{"$f":"IFERROR(VLOOKUP($A48,'Child Find Best Practices'!$B:$N,13,FALSE),\"\")","v":0},"2022-02-24",null,null,{"$f":"IF($I48=\"H\",MAX($M$16:$M47)+1,\"\")","v":""},"[BP 5-c]  Screening involves family partnership and perspectives, considers family preferences and cultural contexts, and is conducted in the child’s dominant language.",null,33,"",""]
["B-BP5-d","BestPractice","Adequacy","BP 5","d","Simple, straightforward referral processes are used to facilitate ease of referral by the family, which may include the use of a universal intake form or information form.",{"$f":"IFERROR(VLOOKUP($A49,'Child Find Best Practices'!$B:$N,11,FALSE),\"\")","v":0},"-",{"$f":"IFERROR(VLOOKUP($A49,'Child Find Best Practices'!$B:$N,13,FALSE),\"\")","v":0},"2022-02-24",null,null,{"$f":"IF($I49=\"H\",MAX($M$16:$M48)+1,\"\")","v":""},"[BP 5-d]  Simple, straightforward referral processes are used to facilitate ease of referral by the family, which may include the use of a universal intake form or information form.",null,34,"",""]
["B-BP5-e","BestPractice","Adequacy","BP 5","e","Referral information is entered into the data system.",{"$f":"IFERROR(VLOOKUP($A50,'Child Find Best Practices'!$B:$N,11,FALSE),\"\")","v":0},"-",{"$f":"IFERROR(VLOOKUP($A50,'Child Find Best Practices'!$B:$N,13,FALSE),\"\")","v":0},"2022-02-24",null,null,{"$f":"IF($I50=\"H\",MAX($M$16:$M49)+1,\"\")","v":""},"[BP 5-e]  Referral information is entered into the data system.",null,35,"",""]
["B-BP5-f","BestPractice","Adequacy","BP 5","f","Within multi-tiered systems of support (e.g., RTI), children suspected of having a disability cannot be required to go through all tiers of the system before referral to early childhood special education.",{"$f":"IFERROR(VLOOKUP($A51,'Child Find Best Practices'!$B:$N,11,FALSE),\"\")","v":0},"-",{"$f":"IFERROR(VLOOKUP($A51,'Child Find Best Practices'!$B:$N,13,FALSE),\"\")","v":0},"2022-02-24",null,null,{"$f":"IF($I51=\"H\",MAX($M$16:$M50)+1,\"\")","v":""},"[BP 5-f]  Within multi-tiered systems of support (e.g., RTI), children suspected of having a disability cannot be required to go through all tiers of the system before referral to early childhood special education.",null,36,"",""]
["B-BP5-g","BestPractice","Adequacy","BP 5","g","Effective screening policies and procedures are in place to respond to disruptions caused by emergencies and natural disasters.",{"$f":"IFERROR(VLOOKUP($A52,'Child Find Best Practices'!$B:$N,11,FALSE),\"\")","v":0},"-",{"$f":"IFERROR(VLOOKUP($A52,'Child Find Best Practices'!$B:$N,13,FALSE),\"\")","v":0},"2022-02-24",null,null,{"$f":"IF($I52=\"H\",MAX($M$16:$M51)+1,\"\")","v":""},{"$f":"\"[\"&D52&\"-\"&E52&\"]\"&\"  \"&F52","v":"[BP 5-g]  Effective screening policies and procedures are in place to respond to disruptions caused by emergencies and natural disasters."},null,37,"",""]
["B-BP5-h","BestPractice","Adequacy","BP 5","h","Screening and referral procedures are re-aligned to meet health and safety measures and requirements during emergencies and natural disasters.",{"$f":"IFERROR(VLOOKUP($A53,'Child Find Best Practices'!$B:$N,11,FALSE),\"\")","v":0},"-",{"$f":"IFERROR(VLOOKUP($A53,'Child Find Best Practices'!$B:$N,13,FALSE),\"\")","v":0},"2022-02-24",null,null,{"$f":"IF($I53=\"H\",MAX($M$16:$M52)+1,\"\")","v":""},{"$f":"\"[\"&D53&\"-\"&E53&\"]\"&\"  \"&F53","v":"[BP 5-h]  Screening and referral procedures are re-aligned to meet health and safety measures and requirements during emergencies and natural disasters."},null,38,"",""]
["B-BP6-a","BestPractice","Efficiency","BP 6","a","Connect families to resources, local community agencies, or early childhood programs to meet family/child needs that ECSE does not currently address.",{"$f":"IFERROR(VLOOKUP($A54,'Child Find Best Practices'!$B:$N,11,FALSE),\"\")","v":0},"-",{"$f":"IFERROR(VLOOKUP($A54,'Child Find Best Practices'!$B:$N,13,FALSE),\"\")","v":0},"2022-02-24",null,null,{"$f":"IF($I54=\"H\",MAX($M$16:$M53)+1,\"\")","v":""},"[BP 6-a]  Connect families to resources, local community agencies, or early childhood programs to meet family/child needs that ECSE does not currently address.",null,39,"",""]
["B-BP6-b","BestPractice","Efficiency","BP 6","b","Promote linkages between ECSE and a network of programs and services so that children’s developmental concerns are addressed.",{"$f":"IFERROR(VLOOKUP($A55,'Child Find Best Practices'!$B:$N,11,FALSE),\"\")","v":0},"-",{"$f":"IFERROR(VLOOKUP($A55,'Child Find Best Practices'!$B:$N,13,FALSE),\"\")","v":0},"2022-02-24",null,null,{"$f":"IF($I55=\"H\",MAX($M$16:$M54)+1,\"\")","v":""},"[BP 6-b]  Promote linkages between ECSE and a network of programs and services so that children’s developmental concerns are addressed.",null,40,"",""]
["B-BP6-c","BestPractice","Efficiency","BP 6","c","Repeat screening and monitoring for children whose assessment scores indicated they are at risk but who did not meet eligibility criteria.",{"$f":"IFERROR(VLOOKUP($A56,'Child Find Best Practices'!$B:$N,11,FALSE),\"\")","v":0},"-",{"$f":"IFERROR(VLOOKUP($A56,'Child Find Best Practices'!$B:$N,13,FALSE),\"\")","v":0},"2022-02-24",null,null,{"$f":"IF($I56=\"H\",MAX($M$16:$M55)+1,\"\")","v":""},"[BP 6-c]  Repeat screening and monitoring for children whose assessment scores indicated they are at risk but who did not meet eligibility criteria.",null,41,"",""]
["B-BP7-a","BestPractice","Ineligible","BP 7","a","The state has a method for evaluating the effectiveness of child find efforts across the state.",{"$f":"IFERROR(VLOOKUP($A57,'Child Find Best Practices'!$B:$N,11,FALSE),\"\")","v":0},"-",{"$f":"IFERROR(VLOOKUP($A57,'Child Find Best Practices'!$B:$N,13,FALSE),\"\")","v":0},"2022-02-24",null,null,{"$f":"IF($I57=\"H\",MAX($M$16:$M56)+1,\"\")","v":""},{"$f":"\"[\"&D57&\"-\"&E57&\"]\"&\"  \"&F57","v":"[BP 7-a]  The state has a method for evaluating the effectiveness of child find efforts across the state."},null,42,"",""]
["B-BP7-b","BestPractice","Ineligible","BP 7","b","Reports from the state data system include metrics useful for monitoring the child find system.",{"$f":"IFERROR(VLOOKUP($A58,'Child Find Best Practices'!$B:$N,11,FALSE),\"\")","v":0},"-",{"$f":"IFERROR(VLOOKUP($A58,'Child Find Best Practices'!$B:$N,13,FALSE),\"\")","v":0},"2022-02-24",null,null,{"$f":"IF($I58=\"H\",MAX($M$16:$M57)+1,\"\")","v":""},"[BP 7-b]  Reports from the state data system include metrics useful for monitoring the child find system.",null,43,"",""]
["B-BP7-c","BestPractice","Ineligible","BP 7","c","The LEA has a method for evaluating the effectiveness of local child find efforts and progress towards best practices, including experiences of parents and primary referral source.",{"$f":"IFERROR(VLOOKUP($A59,'Child Find Best Practices'!$B:$N,11,FALSE),\"\")","v":0},"-",{"$f":"IFERROR(VLOOKUP($A59,'Child Find Best Practices'!$B:$N,13,FALSE),\"\")","v":0},"2022-02-24",null,null,{"$f":"IF($I59=\"H\",MAX($M$16:$M58)+1,\"\")","v":""},"[BP 7-c]  The LEA has a method for evaluating the effectiveness of local child find efforts and progress towards best practices, including experiences of parents and primary referral source.",null,44,"",""]
["B-BP7-d","BestPractice","Ineligible","BP 7","d","The LEA data system, directly or through a related application, has reporting and analysis tools that provide end users, including state and local program staff, with easy access to the data in both raw form and reports.                                                                           ",{"$f":"IFERROR(VLOOKUP($A60,'Child Find Best Practices'!$B:$N,11,FALSE),\"\")","v":0},"-",{"$f":"IFERROR(VLOOKUP($A60,'Child Find Best Practices'!$B:$N,13,FALSE),\"\")","v":0},"2022-02-24",null,null,{"$f":"IF($I60=\"H\",MAX($M$16:$M59)+1,\"\")","v":""},"[BP 7-d]  The LEA data system, directly or through a related application, has reporting and analysis tools that provide end users, including state and local program staff, with easy access to the data in both raw form and reports.                                                                           ",null,45,"",""]
["B-BP7-e","BestPractice","Ineligible","BP 7","e","Data systems (state and LEA) feature methods for identifying underserved populations.",{"$f":"IFERROR(VLOOKUP($A61,'Child Find Best Practices'!$B:$N,11,FALSE),\"\")","v":0},"-",{"$f":"IFERROR(VLOOKUP($A61,'Child Find Best Practices'!$B:$N,13,FALSE),\"\")","v":0},"2022-02-24",null,null,{"$f":"IF($I61=\"H\",MAX($M$16:$M60)+1,\"\")","v":""},{"$f":"\"[\"&D61&\"-\"&E61&\"]\"&\"  \"&F61","v":"[BP 7-e]  Data systems (state and LEA) feature methods for identifying underserved populations."},null,46,"",""]

{"sheet":"QualityIndicators","index":9,"n_rows":8,"n_cols":2,"rows_kept":8,"cut":false,"hidden":true,"merged":[]}
["QualityIndicatorCode","QualityIndicatorText"]
["BP 1","Collaboration with primary referral sources"]
["BP 2","Identification of infants and toddlers who are underserved by Part C"]
["BP 3","Data Systems "]
["BP 4","Evaluation of Child Find"]
["BP 5","Technical Adequacy of Screening and Evaluation Tools"]
["BP 6","Efficiency of Screening, Referral, and Evaluation Process and Procedures"]
["BP 7","Responding to Children Found Ineligible for Early Intervention"]

{"sheet":"QIRatingLookup","index":10,"n_rows":4846,"n_cols":12,"rows_kept":4846,"cut":false,"hidden":true,"merged":[]}
["Index","Rating",null,"Total","Number of 1s","Number of 2s","Number of 3s","Number of 4s","TEXT Number of 1s","TEXT Number of 2s","TEXT Number of 3s","TEXT Number of 4s"]
["INCOMPLETE",{"$f":"\"-\"","v":"-"}]
[{"$f":"I3&\"-\"&J3&\"-\"&K3&\"-\"&L3","v":"00-00-00-01"},7,null,1,0,0,0,1,{"$f":"IF(LEN(E3)=1,0&E3,IF(LEN(E3)=0,\"00\",RIGHT(E3,2)))","v":"00"},"00","00","01"]
[{"$f":"I4&\"-\"&J4&\"-\"&K4&\"-\"&L4","v":"00-00-01-00"},4,null,1,0,0,1,0,"00","00","01","00"]
[{"$f":"I5&\"-\"&J5&\"-\"&K5&\"-\"&L5","v":"00-01-00-00"},2,null,1,0,1,0,0,"00","01","00","00"]
[{"$f":"I6&\"-\"&J6&\"-\"&K6&\"-\"&L6","v":"01-00-00-00"},1,null,1,1,0,0,0,"01","00","00","00"]
[{"$f":"I7&\"-\"&J7&\"-\"&K7&\"-\"&L7","v":"00-00-00-02"},7,null,2,0,0,0,2,"00","00","00","02"]
["00-00-01-01",6,null,2,0,0,1,1,{"$f":"IF(LEN(E8)=1,0&E8,IF(LEN(E8)=0,\"00\",RIGHT(E8,2)))","v":"00"},{"$f":"IF(LEN(F8)=1,0&F8,IF(LEN(F8)=0,\"00\",RIGHT(F8,2)))","v":"00"},{"$f":"IF(LEN(G8)=1,0&G8,IF(LEN(G8)=0,\"00\",RIGHT(G8,2)))","v":"01"},{"$f":"IF(LEN(H8)=1,0&H8,IF(LEN(H8)=0,\"00\",RIGHT(H8,2)))","v":"01"}]
["00-00-02-00",4,null,2,0,0,2,0,"00","00","02","00"]
["00-01-00-01",5,null,2,0,1,0,1,"00","01","00","01"]
["00-01-01-00",4,null,2,0,1,1,0,"00","01","01","00"]
["00-02-00-00",2,null,2,0,2,0,0,"00","02","00","00"]
["01-00-00-01",4,null,2,1,0,0,1,"01","00","00","01"]
["01-00-01-00",3,null,2,1,0,1,0,"01","00","01","00"]
["01-01-00-00",2,null,2,1,1,0,0,"01","01","00","00"]
["02-00-00-00",1,null,2,2,0,0,0,"02","00","00","00"]
["00-00-00-03",7,null,3,0,0,0,3,"00","00","00","03"]
["00-00-01-02",6,null,3,0,0,1,2,"00","00","01","02"]
["00-00-02-01",5,null,3,0,0,2,1,"00","00","02","01"]
["00-00-03-00",4,null,3,0,0,3,0,"00","00","03","00"]
["00-01-00-02",5,null,3,0,1,0,2,"00","01","00","02"]
["00-01-01-01",5,null,3,0,1,1,1,"00","01","01","01"]
["00-01-02-00",4,null,3,0,1,2,0,"00","01","02","00"]
["00-02-00-01",3,null,3,0,2,0,1,"00","02","00","01"]
["00-02-01-00",3,null,3,0,2,1,0,"00","02","01","00"]
["00-03-00-00",2,null,3,0,3,0,0,"00","03","00","00"]
["01-00-00-02",4,null,3,1,0,0,2,"01","00","00","02"]
["01-00-01-01",4,null,3,1,0,1,1,"01","00","01","01"]
["01-00-02-00",4,null,3,1,0,2,0,"01","00","02","00"]
["01-01-00-01",3,null,3,1,1,0,1,"01","01","00","01"]
["01-01-01-00",3,null,3,1,1,1,0,"01","01","01","00"]
["01-02-00-00",2,null,3,1,2,0,0,"01","02","00","00"]
["02-00-00-01",3,null,3,2,0,0,1,"02","00","00","01"]
["02-00-01-00",3,null,3,2,0,1,0,"02","00","01","00"]
["02-01-00-00",2,null,3,2,1,0,0,"02","01","00","00"]
["03-00-00-00",1,null,3,3,0,0,0,"03","00","00","00"]
["00-00-00-04",7,null,4,0,0,0,4,"00","00","00","04"]
["00-00-01-03",6,null,4,0,0,1,3,"00","00","01","03"]
["00-00-02-02",6,null,4,0,0,2,2,"00","00","02","02"]
["00-00-03-01",5,null,4,0,0,3,1,"00","00","03","01"]
["00-00-04-00",4,null,4,0,0,4,0,"00","00","04","00"]
["00-01-00-03",5,null,4,0,1,0,3,"00","01","00","03"]
["00-01-01-02",5,null,4,0,1,1,2,"00","01","01","02"]
["00-01-02-01",5,null,4,0,1,2,1,"00","01","02","01"]
["00-01-03-00",4,null,4,0,1,3,0,"00","01","03","00"]
["00-02-00-02",4,null,4,0,2,0,2,"00","02","00","02"]
["00-02-01-01",4,null,4,0,2,1,1,"00","02","01","01"]
["00-02-02-00",4,null,4,0,2,2,0,"00","02","02","00"]
["00-03-00-01",3,null,4,0,3,0,1,"00","03","00","01"]
["00-03-01-00",3,null,4,0,3,1,0,"00","03","01","00"]
["00-04-00-00",2,null,4,0,4,0,0,"00","04","00","00"]
["01-00-00-03",5,null,4,1,0,0,3,"01","00","00","03"]
["01-00-01-02",4,null,4,1,0,1,2,"01","00","01","02"]
["01-00-02-01",4,null,4,1,0,2,1,"01","00","02","01"]
["01-00-03-00",4,null,4,1,0,3,0,"01","00","03","00"]
["01-01-00-02",4,null,4,1,1,0,2,"01","01","00","02"]
["01-01-01-01",4,null,4,1,1,1,1,"01","01","01","01"]
["01-01-02-00",4,null,4,1,1,2,0,"01","01","02","00"]
["01-02-00-01",3,null,4,1,2,0,1,"01","02","00","01"]
["01-02-01-00",2,null,4,1,2,1,0,"01","02","01","00"]
["01-03-00-00",2,null,4,1,3,0,0,"01","03","00","00"]
["02-00-00-02",4,null,4,2,0,0,2,"02","00","00","02"]
["02-00-01-01",3,null,4,2,0,1,1,"02","00","01","01"]
["02-00-02-00",3,null,4,2,0,2,0,"02","00","02","00"]
["02-01-00-01",3,null,4,2,1,0,1,"02","01","00","01"]
["02-01-01-00",2,null,4,2,1,1,0,"02","01","01","00"]
["02-02-00-00",2,null,4,2,2,0,0,"02","02","00","00"]
["03-00-00-01",3,null,4,3,0,0,1,"03","00","00","01"]
["03-00-01-00",2,null,4,3,0,1,0,"03","00","01","00"]
["03-01-00-00",2,null,4,3,1,0,0,"03","01","00","00"]
[{"$f":"I71&\"-\"&J71&\"-\"&K71&\"-\"&L71","v":"04-00-00-00"},1,null,4,4,0,0,0,"04","00","00","00"]
["00-00-00-05",7,null,5,0,0,0,5,{"$f":"IF(LEN(E72)=1,0&E72,IF(LEN(E72)=0,\"00\",RIGHT(E72,2)))","v":"00"},{"$f":"IF(LEN(F72)=1,0&F72,IF(LEN(F72)=0,\"00\",RIGHT(F72,2)))","v":"00"},{"$f":"IF(LEN(G72)=1,0&G72,IF(LEN(G72)=0,\"00\",RIGHT(G72,2)))","v":"00"},{"$f":"IF(LEN(H72)=1,0&H72,IF(LEN(H72)=0,\"00\",RIGHT(H72,2)))","v":"05"}]
["00-00-01-04",6,null,5,0,0,1,4,"00","00","01","04"]
["00-00-02-03",6,null,5,0,0,2,3,"00","00","02","03"]
["00-00-03-02",5,null,5,0,0,3,2,"00","00","03","02"]
["00-00-04-01",5,null,5,0,0,4,1,"00","00","04","01"]
["00-00-05-00",4,null,5,0,0,5,0,"00","00","05","00"]
["00-01-01-03",5,null,5,0,1,1,3,"00","01","01","03"]
["00-01-02-02",5,null,5,0,1,2,2,"00","01","02","02"]
["00-01-03-01",5,null,5,0,1,3,1,"00","01","03","01"]
["00-01-04-00",4,null,5,0,1,4,0,"00","01","04","00"]
["00-01-00-04",5,null,5,0,1,null,4,"00","01","00","04"]
["00-02-00-03",5,null,5,0,2,0,3,"00","02","00","03"]
["00-02-01-02",5,null,5,0,2,1,2,"00","02","01","02"]
["00-02-02-01",4,null,5,0,2,2,1,"00","02","02","01"]
["00-02-03-00",4,null,5,0,2,3,0,"00","02","03","00"]
["00-03-00-02",3,null,5,0,3,0,2,"00","03","00","02"]
["00-03-01-01",3,null,5,0,3,1,1,"00","03","01","01"]
["00-03-02-00",3,null,5,0,3,2,0,"00","03","02","00"]
["00-04-00-01",3,null,5,0,4,0,1,"00","04","00","01"]
["00-04-01-00",3,null,5,0,4,1,0,"00","04","01","00"]
["00-05-00-00",2,null,5,0,5,0,0,"00","05","00","00"]
["01-00-00-04",5,null,5,1,0,0,4,"01","00","00","04"]
["01-00-01-03",5,null,5,1,0,1,3,"01","00","01","03"]
["01-00-02-02",5,null,5,1,0,2,2,"01","00","02","02"]
["01-00-03-01",4,null,5,1,0,3,1,"01","00","03","01"]
["01-00-04-00",4,null,5,1,0,4,0,"01","00","04","00"]
["01-01-00-03",4,null,5,1,1,0,3,"01","01","00","03"]
["01-01-01-02",4,null,5,1,1,1,2,"01","01","01","02"]
["01-01-02-01",4,null,5,1,1,2,1,"01","01","02","01"]
["01-01-03-00",4,null,5,1,1,3,0,"01","01","03","00"]
["01-02-00-02",3,null,5,1,2,0,2,"01","02","00","02"]
["01-02-01-01",3,null,5,1,2,1,1,"01","02","01","01"]
["01-02-02-00",3,null,5,1,2,2,0,"01","02","02","00"]
["01-03-00-01",3,null,5,1,3,0,1,"01","03","00","01"]
["01-03-01-00",2,null,5,1,3,1,0,"01","03","01","00"]
["01-04-00-00",2,null,5,1,4,0,0,"01","04","00","00"]
["02-00-00-03",4,null,5,2,0,0,3,"02","00","00","03"]
["02-00-01-02",4,null,5,2,0,1,2,"02","00","01","02"]
["02-00-02-01",4,null,5,2,0,2,1,"02","00","02","01"]
["02-00-03-00",4,null,5,2,0,3,0,"02","00","03","00"]
["02-01-00-02",3,null,5,2,1,0,2,"02","01","00","02"]
["02-01-01-01",3,null,5,2,1,1,1,"02","01","01","01"]
["02-01-02-00",3,null,5,2,1,2,0,"02","01","02","00"]
["02-02-00-01",3,null,5,2,2,0,1,"02","02","00","01"]
["02-02-01-00",2,null,5,2,2,1,0,"02","02","01","00"]
["02-03-00-00",2,null,5,2,3,0,0,"02","03","00","00"]
["03-00-00-02",3,null,5,3,0,0,2,"03","00","00","02"]
["03-00-01-01",3,null,5,3,0,1,1,"03","00","01","01"]
["03-00-02-00",3,null,5,3,0,2,0,"03","00","02","00"]
["03-01-00-01",3,null,5,3,1,0,1,"03","01","00","01"]
["03-01-01-00",2,null,5,3,1,1,0,"03","01","01","00"]
["03-02-00-00",2,null,5,3,2,0,0,"03","02","00","00"]
["04-00-00-01",3,null,5,4,0,0,1,"04","00","00","01"]
["04-00-01-00",2,null,5,4,0,1,0,"04","00","01","00"]
["04-01-00-00",2,null,5,4,1,0,0,"04","01","00","00"]
["05-00-00-00",1,null,5,5,0,0,0,"05","00","00","00"]
["00-00-00-06",7,null,6,0,0,0,6,"00","00","00","06"]
["00-00-01-05",6,null,6,0,0,1,5,"00","00","01","05"]
["00-00-02-04",6,null,6,0,0,2,4,"00","00","02","04"]
["00-00-03-03",6,null,6,0,0,3,3,"00","00","03","03"]
["00-00-04-02",5,null,6,0,0,4,2,"00","00","04","02"]
["00-00-05-01",4,null,6,0,0,5,1,"00","00","05","01"]
["00-00-06-00",4,null,6,0,0,6,0,"00","00","06","00"]
[{"$f":"I135&\"-\"&J135&\"-\"&K135&\"-\"&L135","v":"00-01-00-05"},5,null,6,0,1,0,5,"00","01","00","05"]
["00-01-01-04",5,null,6,0,1,1,4,{"$f":"IF(LEN(E136)=1,0&E136,IF(LEN(E136)=0,\"00\",RIGHT(E136,2)))","v":"00"},{"$f":"IF(LEN(F136)=1,0&F136,IF(LEN(F136)=0,\"00\",RIGHT(F136,2)))","v":"01"},{"$f":"IF(LEN(G136)=1,0&G136,IF(LEN(G136)=0,\"00\",RIGHT(G136,2)))","v":"01"},{"$f":"IF(LEN(H136)=1,0&H136,IF(LEN(H136)=0,\"00\",RIGHT(H136,2)))","v":"04"}]
["00-01-02-03",5,null,6,0,1,2,3,"00","01","02","03"]
["00-01-03-02",5,null,6,0,1,3,2,"00","01","03","02"]
["00-01-04-01",4,null,6,0,1,4,1,"00","01","04","01"]
["00-01-05-00",4,null,6,0,1,5,0,"00","01","05","00"]
["00-02-00-04",5,null,6,0,2,0,4,"00","02","00","04"]
["00-02-01-03",5,null,6,0,2,1,3,"00","02","01","03"]
["00-02-02-02",5,null,6,0,2,2,2,"00","02","02","02"]
["00-02-03-01",4,null,6,0,2,3,1,"00","02","03","01"]
["00-02-04-00",4,null,6,0,2,4,0,"00","02","04","00"]
["00-03-00-03",4,null,6,0,3,0,3,"00","03","00","03"]
["00-03-01-02",4,null,6,0,3,1,2,"00","03","01","02"]
["00-03-02-01",4,null,6,0,3,2,1,"00","03","02","01"]
["00-03-03-00",4,null,6,0,3,3,0,"00","03","03","00"]
["00-04-00-02",3,null,6,0,4,0,2,"00","04","00","02"]
["00-04-01-01",3,null,6,0,4,1,1,"00","04","01","01"]
["00-04-02-00",3,null,6,0,4,2,0,"00","04","02","00"]
["00-05-00-01",3,null,6,0,5,0,1,"00","05","00","01"]
["00-05-01-00",2,null,6,0,5,1,0,"00","05","01","00"]
["00-06-00-00",2,null,6,0,6,0,0,"00","06","00","00"]
["01-00-00-05",5,null,6,1,0,0,5,"01","00","00","05"]
["01-00-01-04",5,null,6,1,0,1,4,"01","00","01","04"]
["01-00-02-03",5,null,6,1,0,2,3,"01","00","02","03"]
["01-00-03-02",5,null,6,1,0,3,2,"01","00","03","02"]
["01-00-04-01",4,null,6,1,0,4,1,"01","00","04","01"]
["01-00-05-00",4,null,6,1,0,5,0,"01","00","05","00"]
["01-01-00-04",5,null,6,1,1,0,4,"01","01","00","04"]
["01-01-01-03",4,null,6,1,1,1,3,"01","01","01","03"]
["01-01-02-02",4,null,6,1,1,2,2,"01","01","02","02"]
["01-01-03-01",4,null,6,1,1,3,1,"01","01","03","01"]
["01-01-04-00",4,null,6,1,1,4,0,"01","01","04","00"]
["01-02-00-03",4,null,6,1,2,0,3,"01","02","00","03"]
["01-02-01-02",4,null,6,1,2,1,2,"01","02","01","02"]
["01-02-02-01",4,null,6,1,2,2,1,"01","02","02","01"]
["01-02-03-00",4,null,6,1,2,3,0,"01","02","03","00"]
["01-03-00-02",3,null,6,1,3,0,2,"01","03","00","02"]
["01-03-01-01",3,null,6,1,3,1,1,"01","03","01","01"]
["01-03-02-00",3,null,6,1,3,2,0,"01","03","02","00"]
["01-04-00-01",2,null,6,1,4,0,1,"01","04","00","01"]
["01-04-01-00",2,null,6,1,4,1,0,"01","04","01","00"]
["01-05-00-00",2,null,6,1,5,0,0,"01","05","00","00"]
["02-00-00-04",4,null,6,2,0,0,4,"02","00","00","04"]
["02-00-01-03",4,null,6,2,0,1,3,"02","00","01","03"]
["02-00-02-02",4,null,6,2,0,2,2,"02","00","02","02"]
["02-00-03-01",4,null,6,2,0,3,1,"02","00","03","01"]
["02-00-04-00",4,null,6,2,0,4,0,"02","00","04","00"]
["02-01-00-03",4,null,6,2,1,0,3,"02","01","00","03"]
["02-01-01-02",4,null,6,2,1,1,2,"02","01","01","02"]
["02-01-02-01",4,null,6,2,1,2,1,"02","01","02","01"]
["02-01-03-00",3,null,6,2,1,3,0,"02","01","03","00"]
["02-02-00-02",3,null,6,2,2,0,2,"02","02","00","02"]
["02-02-01-01",3,null,6,2,2,1,1,"02","02","01","01"]
["02-02-02-00",3,null,6,2,2,2,0,"02","02","02","00"]
["02-03-00-01",2,null,6,2,3,0,1,"02","03","00","01"]
["02-03-01-00",2,null,6,2,3,1,0,"02","03","01","00"]
["02-04-00-00",2,null,6,2,4,0,0,"02","04","00","00"]
["03-00-00-03",4,null,6,3,0,0,3,"03","00","00","03"]
["03-00-01-02",4,null,6,3,0,1,2,"03","00","01","02"]
["03-00-02-01",3,null,6,3,0,2,1,"03","00","02","01"]
["03-00-03-00",3,null,6,3,0,3,0,"03","00","03","00"]
["03-01-00-02",3,null,6,3,1,0,2,"03","01","00","02"]
["03-01-01-01",3,null,6,3,1,1,1,"03","01","01","01"]
["03-01-02-00",3,null,6,3,1,2,0,"03","01","02","00"]
[{"$f":"I199&\"-\"&J199&\"-\"&K199&\"-\"&L199","v":"03-02-00-01"},2,null,6,3,2,0,1,"03","02","00","01"]
["03-02-01-00",2,null,6,3,2,1,0,{"$f":"IF(LEN(E200)=1,0&E200,IF(LEN(E200)=0,\"00\",RIGHT(E200,2)))","v":"03"},{"$f":"IF(LEN(F200)=1,0&F200,IF(LEN(F200)=0,\"00\",RIGHT(F200,2)))","v":"02"},{"$f":"IF(LEN(G200)=1,0&G200,IF(LEN(G200)=0,\"00\",RIGHT(G200,2)))","v":"01"},{"$f":"IF(LEN(H200)=1,0&H200,IF(LEN(H200)=0,\"00\",RIGHT(H200,2)))","v":"00"}]
["03-03-00-00",2,null,6,3,3,0,0,"03","03","00","00"]
["04-00-00-02",3,null,6,4,0,0,2,"04","00","00","02"]
["04-00-01-01",3,null,6,4,0,1,1,"04","00","01","01"]
["04-00-02-00",3,null,6,4,0,2,0,"04","00","02","00"]
["04-01-00-01",2,null,6,4,1,0,1,"04","01","00","01"]
["04-01-01-00",2,null,6,4,1,1,0,"04","01","01","00"]
["04-02-00-00",2,null,6,4,2,0,0,"04","02","00","00"]
["05-00-00-01",2,null,6,5,0,0,1,"05","00","00","01"]
["05-00-01-00",2,null,6,5,0,1,0,"05","00","01","00"]
["05-01-00-00",2,null,6,5,1,0,0,"05","01","00","00"]
["06-00-00-00",1,null,6,6,0,0,0,"06","00","00","00"]
["00-00-00-07",7,null,7,0,0,0,7,"00","00","00","07"]
["00-00-01-06",6,null,7,0,0,1,6,"00","00","01","06"]
["00-00-02-05",6,null,7,0,0,2,5,"00","00","02","05"]
["00-00-03-04",6,null,7,0,0,3,4,"00","00","03","04"]
["00-00-04-03",5,null,7,0,0,4,3,"00","00","04","03"]
["00-00-05-02",5,null,7,0,0,5,2,"00","00","05","02"]
["00-00-06-01",4,null,7,0,0,6,1,"00","00","06","01"]
["00-00-07-00",4,null,7,0,0,7,0,"00","00","07","00"]
["00-01-00-06",5,null,7,0,1,0,6,"00","01","00","06"]
["00-01-01-05",5,null,7,0,1,1,5,"00","01","01","05"]
["00-01-02-04",5,null,7,0,1,2,4,"00","01","02","04"]
["00-01-03-03",5,null,7,0,1,3,3,"00","01","03","03"]
["00-01-04-02",5,null,7,0,1,4,2,"00","01","04","02"]
["00-01-05-01",4,null,7,0,1,5,1,"00","01","05","01"]
["00-01-06-00",4,null,7,0,1,6,0,"00","01","06","00"]
["00-02-00-05",5,null,7,0,2,0,5,"00","02","00","05"]
["00-02-01-04",5,null,7,0,2,1,4,"00","02","01","04"]
["00-02-02-03",5,null,7,0,2,2,3,"00","02","02","03"]
["00-02-03-02",5,null,7,0,2,3,2,"00","02","03","02"]
["00-02-04-01",4,null,7,0,2,4,1,"00","02","04","01"]
["00-02-05-00",4,null,7,0,2,5,0,"00","02","05","00"]
["00-03-00-04",5,null,7,0,3,0,4,"00","03","00","04"]
["00-03-01-03",5,null,7,0,3,1,3,"00","03","01","03"]
["00-03-02-02",4,null,7,0,3,2,2,"00","03","02","02"]
["00-03-03-01",4,null,7,0,3,3,1,"00","03","03","01"]
["00-03-04-00",4,null,7,0,3,4,0,"00","03","04","00"]
["00-04-00-03",3,null,7,0,4,0,3,"00","04","00","03"]
["00-04-01-02",3,null,7,0,4,1,2,"00","04","01","02"]
["00-04-02-01",3,null,7,0,4,2,1,"00","04","02","01"]
["00-04-03-00",3,null,7,0,4,3,0,"00","04","03","00"]
["00-05-00-02",3,null,7,0,5,0,2,"00","05","00","02"]
["00-05-01-01",3,null,7,0,5,1,1,"00","05","01","01"]
["00-05-02-00",3,null,7,0,5,2,0,"00","05","02","00"]
["00-06-00-01",3,null,7,0,6,0,1,"00","06","00","01"]
["00-06-01-00",2,null,7,0,6,1,0,"00","06","01","00"]
["00-07-00-00",2,null,7,0,7,0,0,"00","07","00","00"]
["01-00-00-06",5,null,7,1,0,0,6,"01","00","00","06"]
["01-00-01-05",5,null,7,1,0,1,5,"01","00","01","05"]
["01-00-02-04",5,null,7,1,0,2,4,"01","00","02","04"]
["01-00-03-03",5,null,7,1,0,3,3,"01","00","03","03"]
["01-00-04-02",5,null,7,1,0,4,2,"01","00","04","02"]
["01-00-05-01",4,null,7,1,0,5,1,"01","00","05","01"]
["01-00-06-00",4,null,7,1,0,6,0,"01","00","06","00"]
["01-01-00-05",5,null,7,1,1,0,5,"01","01","00","05"]
["01-01-01-04",5,null,7,1,1,1,4,"01","01","01","04"]
["01-01-02-03",5,null,7,1,1,2,3,"01","01","02","03"]
["01-01-03-02",4,null,7,1,1,3,2,"01","01","03","02"]
["01-01-04-01",4,null,7,1,1,4,1,"01","01","04","01"]
["01-01-05-00",4,null,7,1,1,5,0,"01","01","05","00"]
["01-02-00-04",4,null,7,1,2,0,4,"01","02","00","04"]
["01-02-01-03",4,null,7,1,2,1,3,"01","02","01","03"]
[{"$f":"I263&\"-\"&J263&\"-\"&K263&\"-\"&L263","v":"01-02-02-02"},4,null,7,1,2,2,2,"01","02","02","02"]
["01-02-03-01",4,null,7,1,2,3,1,{"$f":"IF(LEN(E264)=1,0&E264,IF(LEN(E264)=0,\"00\",RIGHT(E264,2)))","v":"01"},{"$f":"IF(LEN(F264)=1,0&F264,IF(LEN(F264)=0,\"00\",RIGHT(F264,2)))","v":"02"},{"$f":"IF(LEN(G264)=1,0&G264,IF(LEN(G264)=0,\"00\",RIGHT(G264,2)))","v":"03"},{"$f":"IF(LEN(H264)=1,0&H264,IF(LEN(H264)=0,\"00\",RIGHT(H264,2)))","v":"01"}]
["01-02-04-00",4,null,7,1,2,4,0,"01","02","04","00"]
["01-03-00-03",3,null,7,1,3,0,3,"01","03","00","03"]
["01-03-01-02",3,null,7,1,3,1,2,"01","03","01","02"]
["01-03-02-01",3,null,7,1,3,2,1,"01","03","02","01"]
["01-03-03-00",3,null,7,1,3,3,0,"01","03","03","00"]
["01-04-00-02",3,null,7,1,4,0,2,"01","04","00","02"]
["01-04-01-01",3,null,7,1,4,1,1,"01","04","01","01"]
["01-04-02-00",3,null,7,1,4,2,0,"01","04","02","00"]
["01-05-00-01",2,null,7,1,5,0,1,"01","05","00","01"]
["01-05-01-00",2,null,7,1,5,1,0,"01","05","01","00"]
["01-06-00-00",2,null,7,1,6,0,0,"01","06","00","00"]
["02-00-00-05",5,null,7,2,0,0,5,"02","00","00","05"]
["02-00-01-04",4,null,7,2,0,1,4,"02","00","01","04"]
["02-00-02-03",4,null,7,2,0,2,3,"02","00","02","03"]
["02-00-03-02",4,null,7,2,0,3,2,"02","00","03","02"]
["02-00-04-01",4,null,7,2,0,4,1,"02","00","04","01"]
["02-00-05-00",4,null,7,2,0,5,0,"02","00","05","00"]
["02-01-00-04",4,null,7,2,1,0,4,"02","01","00","04"]
["02-01-01-03",4,null,7,2,1,1,3,"02","01","01","03"]
["02-01-02-02",4,null,7,2,1,2,2,"02","01","02","02"]
["02-01-03-01",4,null,7,2,1,3,1,"02","01","03","01"]
["02-01-04-00",4,null,7,2,1,4,0,"02","01","04","00"]
["02-02-00-03",3,null,7,2,2,0,3,"02","02","00","03"]
["02-02-01-02",3,null,7,2,2,1,2,"02","02","01","02"]
["02-02-02-01",3,null,7,2,2,2,1,"02","02","02","01"]
["02-02-03-00",3,null,7,2,2,3,0,"02","02","03","00"]
["02-03-00-02",3,null,7,2,3,0,2,"02","03","00","02"]
["02-03-01-01",3,null,7,2,3,1,1,"02","03","01","01"]
["02-03-02-00",3,null,7,2,3,2,0,"02","03","02","00"]
["02-04-00-01",2,null,7,2,4,0,1,"02","04","00","01"]
["02-04-01-00",2,null,7,2,4,1,0,"02","04","01","00"]
["02-05-00-00",2,null,7,2,5,0,0,"02","05","00","00"]
["03-00-00-04",4,null,7,3,0,0,4,"03","00","00","04"]
["03-00-01-03",4,null,7,3,0,1,3,"03","00","01","03"]
["03-00-02-02",4,null,7,3,0,2,2,"03","00","02","02"]
["03-00-03-01",4,null,7,3,0,3,1,"03","00","03","01"]
["03-00-04-00",3,null,7,3,0,4,0,"03","00","04","00"]
["03-01-00-03",3,null,7,3,1,0,3,"03","01","00","03"]
["03-01-01-02",3,null,7,3,1,1,2,"03","01","01","02"]
["03-01-02-01",3,null,7,3,1,2,1,"03","01","02","01"]
["03-01-03-00",3,null,7,3,1,3,0,"03","01","03","00"]
["03-02-00-02",3,null,7,3,2,0,2,"03","02","00","02"]
["03-02-01-01",3,null,7,3,2,1,1,"03","02","01","01"]
["03-02-02-00",3,null,7,3,2,2,0,"03","02","02","00"]
["03-03-00-01",2,null,7,3,3,0,1,"03","03","00","01"]
["03-03-01-00",2,null,7,3,3,1,0,"03","03","01","00"]
["03-04-00-00",2,null,7,3,4,0,0,"03","04","00","00"]
["04-00-00-03",3,null,7,4,0,0,3,"04","00","00","03"]
["04-00-01-02",3,null,7,4,0,1,2,"04","00","01","02"]
["04-00-02-01",3,null,7,4,0,2,1,"04","00","02","01"]
["04-00-03-00",3,null,7,4,0,3,0,"04","00","03","00"]
["04-01-00-02",3,null,7,4,1,0,2,"04","01","00","02"]
["04-01-01-01",3,null,7,4,1,1,1,"04","01","01","01"]
["04-01-02-00",3,null,7,4,1,2,0,"04","01","02","00"]
["04-02-00-01",2,null,7,4,2,0,1,"04","02","00","01"]
["04-02-01-00",2,null,7,4,2,1,0,"04","02","01","00"]
["04-03-00-00",2,null,7,4,3,0,0,"04","03","00","00"]
["05-00-00-02",3,null,7,5,0,0,2,"05","00","00","02"]
["05-00-01-01",3,null,7,5,0,1,1,"05","00","01","01"]
["05-00-02-00",3,null,7,5,0,2,0,"05","00","02","00"]
["05-01-00-01",2,null,7,5,1,0,1,"05","01","00","01"]
["05-01-01-00",2,null,7,5,1,1,0,"05","01","01","00"]
[{"$f":"I327&\"-\"&J327&\"-\"&K327&\"-\"&L327","v":"05-02-00-00"},2,null,7,5,2,0,0,"05","02","00","00"]
["06-00-00-01",2,null,7,6,0,0,1,{"$f":"IF(LEN(E328)=1,0&E328,IF(LEN(E328)=0,\"00\",RIGHT(E328,2)))","v":"06"},{"$f":"IF(LEN(F328)=1,0&F328,IF(LEN(F328)=0,\"00\",RIGHT(F328,2)))","v":"00"},{"$f":"IF(LEN(G328)=1,0&G328,IF(LEN(G328)=0,\"00\",RIGHT(G328,2)))","v":"00"},{"$f":"IF(LEN(H328)=1,0&H328,IF(LEN(H328)=0,\"00\",RIGHT(H328,2)))","v":"01"}]
["06-00-01-00",2,null,7,6,0,1,0,"06","00","01","00"]
["06-01-00-00",2,null,7,6,1,0,0,"06","01","00","00"]
["07-00-00-00",1,null,7,7,0,0,0,"07","00","00","00"]
["00-00-00-08",7,null,8,0,0,0,8,"00","00","00","08"]
["00-00-01-07",6,null,8,0,0,1,7,"00","00","01","07"]
["00-00-02-06",6,null,8,0,0,2,6,"00","00","02","06"]
["00-00-03-05",6,null,8,0,0,3,5,"00","00","03","05"]
["00-00-04-04",6,null,8,0,0,4,4,"00","00","04","04"]
["00-00-05-03",5,null,8,0,0,5,3,"00","00","05","03"]
["00-00-06-02",5,null,8,0,0,6,2,"00","00","06","02"]
["00-00-07-01",4,null,8,0,0,7,1,"00","00","07","01"]
["00-00-08-00",4,null,8,0,0,8,0,"00","00","08","00"]
["00-01-00-07",5,null,8,0,1,0,7,"00","01","00","07"]
["00-01-01-06",5,null,8,0,1,1,6,"00","01","01","06"]
["00-01-02-05",5,null,8,0,1,2,5,"00","01","02","05"]
["00-01-03-04",5,null,8,0,1,3,4,"00","01","03","04"]
["00-01-04-03",5,null,8,0,1,4,3,"00","01","04","03"]
["00-01-05-02",5,null,8,0,1,5,2,"00","01","05","02"]
["00-01-06-01",4,null,8,0,1,6,1,"00","01","06","01"]
["00-01-07-00",4,null,8,0,1,7,0,"00","01","07","00"]
["00-02-00-06",5,null,8,0,2,0,6,"00","02","00","06"]
["00-02-01-05",5,null,8,0,2,1,5,"00","02","01","05"]
["00-02-02-04",5,null,8,0,2,2,4,"00","02","02","04"]
["00-02-03-03",5,null,8,0,2,3,3,"00","02","03","03"]
["00-02-04-02",5,null,8,0,2,4,2,"00","02","04","02"]
["00-02-05-01",4,null,8,0,2,5,1,"00","02","05","01"]
["00-02-06-00",4,null,8,0,2,6,0,"00","02","06","00"]
["00-03-00-05",5,null,8,0,3,0,5,"00","03","00","05"]
["00-03-01-04",5,null,8,0,3,1,4,"00","03","01","04"]
["00-03-02-03",5,null,8,0,3,2,3,"00","03","02","03"]
["00-03-03-02",4,null,8,0,3,3,2,"00","03","03","02"]
["00-03-04-01",4,null,8,0,3,4,1,"00","03","04","01"]
["00-03-05-00",4,null,8,0,3,5,0,"00","03","05","00"]
["00-04-00-04",4,null,8,0,4,0,4,"00","04","00","04"]
["00-04-01-03",4,null,8,0,4,1,3,"00","04","01","03"]
["00-04-02-02",4,null,8,0,4,2,2,"00","04","02","02"]
["00-04-03-01",4,null,8,0,4,3,1,"00","04","03","01"]
["00-04-04-00",4,null,8,0,4,4,0,"00","04","04","00"]
["00-05-00-03",3,null,8,0,5,0,3,"00","05","00","03"]
["00-05-01-02",3,null,8,0,5,1,2,"00","05","01","02"]
["00-05-02-01",3,null,8,0,5,2,1,"00","05","02","01"]
["00-05-03-00",3,null,8,0,5,3,0,"00","05","03","00"]
["00-06-00-02",3,null,8,0,6,0,2,"00","06","00","02"]
["00-06-01-01",3,null,8,0,6,1,1,"00","06","01","01"]
["00-06-02-00",3,null,8,0,6,2,0,"00","06","02","00"]
["00-07-00-01",3,null,8,0,7,0,1,"00","07","00","01"]
["00-07-01-00",2,null,8,0,7,1,0,"00","07","01","00"]
["00-08-00-00",2,null,8,0,8,0,0,"00","08","00","00"]
["01-00-00-07",5,null,8,1,0,0,7,"01","00","00","07"]
["01-00-01-06",5,null,8,1,0,1,6,"01","00","01","06"]
["01-00-02-05",5,null,8,1,0,2,5,"01","00","02","05"]
["01-00-03-04",5,null,8,1,0,3,4,"01","00","03","04"]
["01-00-04-03",5,null,8,1,0,4,3,"01","00","04","03"]
["01-00-05-02",5,null,8,1,0,5,2,"01","00","05","02"]
["01-00-06-01",4,null,8,1,0,6,1,"01","00","06","01"]
["01-00-07-00",4,null,8,1,0,7,0,"01","00","07","00"]
["01-01-00-06",5,null,8,1,1,0,6,"01","01","00","06"]
["01-01-01-05",5,null,8,1,1,1,5,"01","01","01","05"]
["01-01-02-04",5,null,8,1,1,2,4,"01","01","02","04"]
["01-01-03-03",5,null,8,1,1,3,3,"01","01","03","03"]
["01-01-04-02",4,null,8,1,1,4,2,"01","01","04","02"]
["01-01-05-01",4,null,8,1,1,5,1,"01","01","05","01"]
[{"$f":"I391&\"-\"&J391&\"-\"&K391&\"-\"&L391","v":"01-01-06-00"},4,null,8,1,1,6,0,"01","01","06","00"]
["01-02-00-05",5,null,8,1,2,0,5,{"$f":"IF(LEN(E392)=1,0&E392,IF(LEN(E392)=0,\"00\",RIGHT(E392,2)))","v":"01"},{"$f":"IF(LEN(F392)=1,0&F392,IF(LEN(F392)=0,\"00\",RIGHT(F392,2)))","v":"02"},{"$f":"IF(LEN(G392)=1,0&G392,IF(LEN(G392)=0,\"00\",RIGHT(G392,2)))","v":"00"},{"$f":"IF(LEN(H392)=1,0&H392,IF(LEN(H392)=0,\"00\",RIGHT(H392,2)))","v":"05"}]
["01-02-01-04",4,null,8,1,2,1,4,"01","02","01","04"]
["01-02-02-03",4,null,8,1,2,2,3,"01","02","02","03"]
["01-02-03-02",4,null,8,1,2,3,2,"01","02","03","02"]
["01-02-04-01",4,null,8,1,2,4,1,"01","02","04","01"]
["01-02-05-00",4,null,8,1,2,5,0,"01","02","05","00"]
["01-03-00-04",4,null,8,1,3,0,4,"01","03","00","04"]
["01-03-01-03",4,null,8,1,3,1,3,"01","03","01","03"]
["01-03-02-02",4,null,8,1,3,2,2,"01","03","02","02"]
["01-03-03-01",4,null,8,1,3,3,1,"01","03","03","01"]
["01-03-04-00",4,null,8,1,3,4,0,"01","03","04","00"]
["01-04-00-03",3,null,8,1,4,0,3,"01","04","00","03"]
["01-04-01-02",3,null,8,1,4,1,2,"01","04","01","02"]
["01-04-02-01",3,null,8,1,4,2,1,"01","04","02","01"]
["01-04-03-00",3,null,8,1,4,3,0,"01","04","03","00"]
["01-05-00-02",3,null,8,1,5,0,2,"01","05","00","02"]
["01-05-01-01",3,null,8,1,5,1,1,"01","05","01","01"]
["01-05-02-00",2,null,8,1,5,2,0,"01","05","02","00"]
["01-06-00-01",2,null,8,1,6,0,1,"01","06","00","01"]
["01-06-01-00",2,null,8,1,6,1,0,"01","06","01","00"]
["01-07-00-00",2,null,8,1,7,0,0,"01","07","00","00"]
["02-00-00-06",5,null,8,2,0,0,6,"02","00","00","06"]
["02-00-01-05",5,null,8,2,0,1,5,"02","00","01","05"]
["02-00-02-04",4,null,8,2,0,2,4,"02","00","02","04"]
["02-00-03-03",4,null,8,2,0,3,3,"02","00","03","03"]
["02-00-04-02",4,null,8,2,0,4,2,"02","00","04","02"]
["02-00-05-01",4,null,8,2,0,5,1,"02","00","05","01"]
["02-00-06-00",4,null,8,2,0,6,0,"02","00","06","00"]
["02-01-00-05",4,null,8,2,1,0,5,"02","01","00","05"]
["02-01-01-04",4,null,8,2,1,1,4,"02","01","01","04"]
["02-01-02-03",4,null,8,2,1,2,3,"02","01","02","03"]
["02-01-03-02",4,null,8,2,1,3,2,"02","01","03","02"]
["02-01-04-01",4,null,8,2,1,4,1,"02","01","04","01"]
["02-01-05-00",4,null,8,2,1,5,0,"02","01","05","00"]
["02-02-00-04",4,null,8,2,2,0,4,"02","02","00","04"]
["02-02-01-03",4,null,8,2,2,1,3,"02","02","01","03"]
["02-02-02-02",4,null,8,2,2,2,2,"02","02","02","02"]
["02-02-03-01",4,null,8,2,2,3,1,"02","02","03","01"]
["02-02-04-00",4,null,8,2,2,4,0,"02","02","04","00"]
["02-03-00-03",3,null,8,2,3,0,3,"02","03","00","03"]
["02-03-01-02",3,null,8,2,3,1,2,"02","03","01","02"]
["02-03-02-01",3,null,8,2,3,2,1,"02","03","02","01"]
["02-03-03-00",3,null,8,2,3,3,0,"02","03","03","00"]
["02-04-00-02",3,null,8,2,4,0,2,"02","04","00","02"]
["02-04-01-01",3,null,8,2,4,1,1,"02","04","01","01"]
["02-04-02-00",2,null,8,2,4,2,0,"02","04","02","00"]
["02-05-00-01",2,null,8,2,5,0,1,"02","05","00","01"]
["02-05-01-00",2,null,8,2,5,1,0,"02","05","01","00"]
["02-06-00-00",2,null,8,2,6,0,0,"02","06","00","00"]
["03-00-00-05",4,null,8,3,0,0,5,"03","00","00","05"]
["03-00-01-04",4,null,8,3,0,1,4,"03","00","01","04"]
["03-00-02-03",4,null,8,3,0,2,3,"03","00","02","03"]
["03-00-03-02",4,null,8,3,0,3,2,"03","00","03","02"]
["03-00-04-01",4,null,8,3,0,4,1,"03","00","04","01"]
["03-00-05-00",4,null,8,3,0,5,0,"03","00","05","00"]
["03-01-00-04",4,null,8,3,1,0,4,"03","01","00","04"]
["03-01-01-03",4,null,8,3,1,1,3,"03","01","01","03"]
["03-01-02-02",4,null,8,3,1,2,2,"03","01","02","02"]
["03-01-03-01",4,null,8,3,1,3,1,"03","01","03","01"]
["03-01-04-00",3,null,8,3,1,4,0,"03","01","04","00"]
["03-02-00-03",3,null,8,3,2,0,3,"03","02","00","03"]
["03-02-01-02",3,null,8,3,2,1,2,"03","02","01","02"]
["03-02-02-01",3,null,8,3,2,2,1,"03","02","02","01"]
[{"$f":"I455&\"-\"&J455&\"-\"&K455&\"-\"&L455","v":"03-02-03-00"},3,null,8,3,2,3,0,"03","02","03","00"]
["03-03-00-02",3,null,8,3,3,0,2,{"$f":"IF(LEN(E456)=1,0&E456,IF(LEN(E456)=0,\"00\",RIGHT(E456,2)))","v":"03"},{"$f":"IF(LEN(F456)=1,0&F456,IF(LEN(F456)=0,\"00\",RIGHT(F456,2)))","v":"03"},{"$f":"IF(LEN(G456)=1,0&G456,IF(LEN(G456)=0,\"00\",RIGHT(G456,2)))","v":"00"},{"$f":"IF(LEN(H456)=1,0&H456,IF(LEN(H456)=0,\"00\",RIGHT(H456,2)))","v":"02"}]
["03-03-01-01",2,null,8,3,3,1,1,"03","03","01","01"]
["03-03-02-00",2,null,8,3,3,2,0,"03","03","02","00"]
["03-04-00-01",2,null,8,3,4,0,1,"03","04","00","01"]
["03-04-01-00",2,null,8,3,4,1,0,"03","04","01","00"]
["03-05-00-00",2,null,8,3,5,0,0,"03","05","00","00"]
["04-00-00-04",4,null,8,4,0,0,4,"04","00","00","04"]
["04-00-01-03",4,null,8,4,0,1,3,"04","00","01","03"]
["04-00-02-02",3,null,8,4,0,2,2,"04","00","02","02"]
["04-00-03-01",3,null,8,4,0,3,1,"04","00","03","01"]
["04-00-04-00",3,null,8,4,0,4,0,"04","00","04","00"]
["04-01-00-03",3,null,8,4,1,0,3,"04","01","00","03"]
["04-01-01-02",3,null,8,4,1,1,2,"04","01","01","02"]
["04-01-02-01",3,null,8,4,1,2,1,"04","01","02","01"]
["04-01-03-00",3,null,8,4,1,3,0,"04","01","03","00"]
["04-02-00-02",3,null,8,4,2,0,2,"04","02","00","02"]
["04-02-01-01",2,null,8,4,2,1,1,"04","02","01","01"]
["04-02-02-00",2,null,8,4,2,2,0,"04","02","02","00"]
["04-03-00-01",2,null,8,4,3,0,1,"04","03","00","01"]
["04-03-01-00",2,null,8,4,3,1,0,"04","03","01","00"]
["04-04-00-00",2,null,8,4,4,0,0,"04","04","00","00"]
["05-00-00-03",3,null,8,5,0,0,3,"05","00","00","03"]
["05-00-01-02",3,null,8,5,0,1,2,"05","00","01","02"]
["05-00-02-01",3,null,8,5,0,2,1,"05","00","02","01"]
["05-00-03-00",3,null,8,5,0,3,0,"05","00","03","00"]
["05-01-00-02",3,null,8,5,1,0,2,"05","01","00","02"]
["05-01-01-01",2,null,8,5,1,1,1,"05","01","01","01"]
["05-01-02-00",2,null,8,5,1,2,0,"05","01","02","00"]
["05-02-00-01",2,null,8,5,2,0,1,"05","02","00","01"]
["05-02-01-00",2,null,8,5,2,1,0,"05","02","01","00"]
["05-03-00-00",2,null,8,5,3,0,0,"05","03","00","00"]
["06-00-00-02",3,null,8,6,0,0,2,"06","00","00","02"]
["06-00-01-01",2,null,8,6,0,1,1,"06","00","01","01"]
["06-00-02-00",2,null,8,6,0,2,0,"06","00","02","00"]
["06-01-00-01",2,null,8,6,1,0,1,"06","01","00","01"]
["06-01-01-00",2,null,8,6,1,1,0,"06","01","01","00"]
["06-02-00-00",2,null,8,6,2,0,0,"06","02","00","00"]
["07-00-00-01",2,null,8,7,0,0,1,"07","00","00","01"]
["07-00-01-00",2,null,8,7,0,1,0,"07","00","01","00"]
["07-01-00-00",2,null,8,7,1,0,0,"07","01","00","00"]
["08-00-00-00",1,null,8,8,0,0,0,"08","00","00","00"]
["00-00-00-09",7,null,9,0,0,0,9,"00","00","00","09"]
["00-00-01-08",6,null,9,0,0,1,8,"00","00","01","08"]
["00-00-02-07",6,null,9,0,0,2,7,"00","00","02","07"]
["00-00-03-06",6,null,9,0,0,3,6,"00","00","03","06"]
["00-00-04-05",6,null,9,0,0,4,5,"00","00","04","05"]
["00-00-05-04",5,null,9,0,0,5,4,"00","00","05","04"]
["00-00-06-03",5,null,9,0,0,6,3,"00","00","06","03"]
["00-00-07-02",5,null,9,0,0,7,2,"00","00","07","02"]
["00-00-08-01",4,null,9,0,0,8,1,"00","00","08","01"]
["00-00-09-00",4,null,9,0,0,9,0,"00","00","09","00"]
["00-01-00-08",5,null,9,0,1,0,8,"00","01","00","08"]
["00-01-01-07",5,null,9,0,1,1,7,"00","01","01","07"]
["00-01-02-06",5,null,9,0,1,2,6,"00","01","02","06"]
["00-01-03-05",5,null,9,0,1,3,5,"00","01","03","05"]
["00-01-04-04",5,null,9,0,1,4,4,"00","01","04","04"]
["00-01-05-03",5,null,9,0,1,5,3,"00","01","05","03"]
["00-01-06-02",5,null,9,0,1,6,2,"00","01","06","02"]
["00-01-07-01",4,null,9,0,1,7,1,"00","01","07","01"]
["00-01-08-00",4,null,9,0,1,8,0,"00","01","08","00"]
["00-02-00-07",5,null,9,0,2,0,7,"00","02","00","07"]
["00-02-01-06",5,null,9,0,2,1,6,"00","02","01","06"]
["00-02-02-05",5,null,9,0,2,2,5,"00","02","02","05"]
[{"$f":"I519&\"-\"&J519&\"-\"&K519&\"-\"&L519","v":"00-02-03-04"},5,null,9,0,2,3,4,"00","02","03","04"]
["00-02-04-03",5,null,9,0,2,4,3,{"$f":"IF(LEN(E520)=1,0&E520,IF(LEN(E520)=0,\"00\",RIGHT(E520,2)))","v":"00"},{"$f":"IF(LEN(F520)=1,0&F520,IF(LEN(F520)=0,\"00\",RIGHT(F520,2)))","v":"02"},{"$f":"IF(LEN(G520)=1,0&G520,IF(LEN(G520)=0,\"00\",RIGHT(G520,2)))","v":"04"},{"$f":"IF(LEN(H520)=1,0&H520,IF(LEN(H520)=0,\"00\",RIGHT(H520,2)))","v":"03"}]
["00-02-05-02",5,null,9,0,2,5,2,"00","02","05","02"]
["00-02-06-01",4,null,9,0,2,6,1,"00","02","06","01"]
["00-02-07-00",4,null,9,0,2,7,0,"00","02","07","00"]
["00-03-00-06",5,null,9,0,3,0,6,"00","03","00","06"]
["00-03-01-05",5,null,9,0,3,1,5,"00","03","01","05"]
["00-03-02-04",5,null,9,0,3,2,4,"00","03","02","04"]
["00-03-03-03",5,null,9,0,3,3,3,"00","03","03","03"]
["00-03-04-02",4,null,9,0,3,4,2,"00","03","04","02"]
["00-03-05-01",4,null,9,0,3,5,1,"00","03","05","01"]
["00-03-06-00",4,null,9,0,3,6,0,"00","03","06","00"]
["00-04-00-05",5,null,9,0,4,0,5,"00","04","00","05"]
["00-04-01-04",4,null,9,0,4,1,4,"00","04","01","04"]
["00-04-02-03",4,null,9,0,4,2,3,"00","04","02","03"]
["00-04-03-02",4,null,9,0,4,3,2,"00","04","03","02"]
["00-04-04-01",4,null,9,0,4,4,1,"00","04","04","01"]
["00-04-05-00",4,null,9,0,4,5,0,"00","04","05","00"]
["00-05-00-04",3,null,9,0,5,0,4,"00","05","00","04"]
["00-05-01-03",3,null,9,0,5,1,3,"00","05","01","03"]
["00-05-02-02",3,null,9,0,5,2,2,"00","05","02","02"]
["00-05-03-01",3,null,9,0,5,3,1,"00","05","03","01"]
["00-05-04-00",3,null,9,0,5,4,0,"00","05","04","00"]
["00-06-00-03",3,null,9,0,6,0,3,"00","06","00","03"]
["00-06-01-02",3,null,9,0,6,1,2,"00","06","01","02"]
["00-06-02-01",3,null,9,0,6,2,1,"00","06","02","01"]
["00-06-03-00",3,null,9,0,6,3,0,"00","06","03","00"]
["00-07-00-02",3,null,9,0,7,0,2,"00","07","00","02"]
["00-07-01-01",3,null,9,0,7,1,1,"00","07","01","01"]
["00-07-02-00",3,null,9,0,7,2,0,"00","07","02","00"]
["00-08-00-01",2,null,9,0,8,0,1,"00","08","00","01"]
["00-08-01-00",2,null,9,0,8,1,0,"00","08","01","00"]
["00-09-00-00",2,null,9,0,9,0,0,"00","09","00","00"]
["01-00-00-08",5,null,9,1,0,0,8,"01","00","00","08"]
["01-00-01-07",5,null,9,1,0,1,7,"01","00","01","07"]
["01-00-02-06",5,null,9,1,0,2,6,"01","00","02","06"]
["01-00-03-05",5,null,9,1,0,3,5,"01","00","03","05"]
["01-00-04-04",5,null,9,1,0,4,4,"01","00","04","04"]
["01-00-05-03",5,null,9,1,0,5,3,"01","00","05","03"]
["01-00-06-02",5,null,9,1,0,6,2,"01","00","06","02"]
["01-00-07-01",4,null,9,1,0,7,1,"01","00","07","01"]
["01-00-08-00",4,null,9,1,0,8,0,"01","00","08","00"]
["01-01-00-07",5,null,9,1,1,0,7,"01","01","00","07"]
["01-01-01-06",5,null,9,1,1,1,6,"01","01","01","06"]
["01-01-02-05",5,null,9,1,1,2,5,"01","01","02","05"]
["01-01-03-04",5,null,9,1,1,3,4,"01","01","03","04"]
["01-01-04-03",5,null,9,1,1,4,3,"01","01","04","03"]
["01-01-05-02",4,null,9,1,1,5,2,"01","01","05","02"]
["01-01-06-01",4,null,9,1,1,6,1,"01","01","06","01"]
["01-01-07-00",4,null,9,1,1,7,0,"01","01","07","00"]
["01-02-00-06",5,null,9,1,2,0,6,"01","02","00","06"]
["01-02-01-05",5,null,9,1,2,1,5,"01","02","01","05"]
["01-02-02-04",4,null,9,1,2,2,4,"01","02","02","04"]
["01-02-03-03",4,null,9,1,2,3,3,"01","02","03","03"]
["01-02-04-02",4,null,9,1,2,4,2,"01","02","04","02"]
["01-02-05-01",4,null,9,1,2,5,1,"01","02","05","01"]
["01-02-06-00",4,null,9,1,2,6,0,"01","02","06","00"]
["01-03-00-05",4,null,9,1,3,0,5,"01","03","00","05"]
["01-03-01-04",4,null,9,1,3,1,4,"01","03","01","04"]
["01-03-02-03",4,null,9,1,3,2,3,"01","03","02","03"]
["01-03-03-02",4,null,9,1,3,3,2,"01","03","03","02"]
["01-03-04-01",4,null,9,1,3,4,1,"01","03","04","01"]
["01-03-05-00",4,null,9,1,3,5,0,"01","03","05","00"]
["01-04-00-04",3,null,9,1,4,0,4,"01","04","00","04"]
[{"$f":"I583&\"-\"&J583&\"-\"&K583&\"-\"&L583","v":"01-04-01-03"},3,null,9,1,4,1,3,"01","04","01","03"]
["01-04-02-02",3,null,9,1,4,2,2,{"$f":"IF(LEN(E584)=1,0&E584,IF(LEN(E584)=0,\"00\",RIGHT(E584,2)))","v":"01"},{"$f":"IF(LEN(F584)=1,0&F584,IF(LEN(F584)=0,\"00\",RIGHT(F584,2)))","v":"04"},{"$f":"IF(LEN(G584)=1,0&G584,IF(LEN(G584)=0,\"00\",RIGHT(G584,2)))","v":"02"},{"$f":"IF(LEN(H584)=1,0&H584,IF(LEN(H584)=0,\"00\",RIGHT(H584,2)))","v":"02"}]
["01-04-03-01",3,null,9,1,4,3,1,"01","04","03","01"]
["01-04-04-00",3,null,9,1,4,4,0,"01","04","04","00"]
["01-05-00-03",3,null,9,1,5,0,3,"01","05","00","03"]
["01-05-01-02",3,null,9,1,5,1,2,"01","05","01","02"]
["01-05-02-01",3,null,9,1,5,2,1,"01","05","02","01"]
["01-05-03-00",3,null,9,1,5,3,0,"01","05","03","00"]
["01-06-00-02",3,null,9,1,6,0,2,"01","06","00","02"]
["01-06-01-01",2,null,9,1,6,1,1,"01","06","01","01"]
["01-06-02-00",2,null,9,1,6,2,0,"01","06","02","00"]
["01-07-00-01",2,null,9,1,7,0,1,"01","07","00","01"]
["01-07-01-00",2,null,9,1,7,1,0,"01","07","01","00"]
["01-08-00-00",2,null,9,1,8,0,0,"01","08","00","00"]
["02-00-00-07",5,null,9,2,0,0,7,"02","00","00","07"]
["02-00-01-06",5,null,9,2,0,1,6,"02","00","01","06"]
["02-00-02-05",5,null,9,2,0,2,5,"02","00","02","05"]
["02-00-03-04",4,null,9,2,0,3,4,"02","00","03","04"]
["02-00-04-03",4,null,9,2,0,4,3,"02","00","04","03"]
["02-00-05-02",4,null,9,2,0,5,2,"02","00","05","02"]
["02-00-06-01",4,null,9,2,0,6,1,"02","00","06","01"]
["02-00-07-00",4,null,9,2,0,7,0,"02","00","07","00"]
["02-01-00-06",5,null,9,2,1,0,6,"02","01","00","06"]
["02-01-01-05",4,null,9,2,1,1,5,"02","01","01","05"]
["02-01-02-04",4,null,9,2,1,2,4,"02","01","02","04"]
["02-01-03-03",4,null,9,2,1,3,3,"02","01","03","03"]
["02-01-04-02",4,null,9,2,1,4,2,"02","01","04","02"]
["02-01-05-01",4,null,9,2,1,5,1,"02","01","05","01"]
["02-01-06-00",4,null,9,2,1,6,0,"02","01","06","00"]
["02-02-00-05",4,null,9,2,2,0,5,"02","02","00","05"]
["02-02-01-04",4,null,9,2,2,1,4,"02","02","01","04"]
["02-02-02-03",4,null,9,2,2,2,3,"02","02","02","03"]
["02-02-03-02",4,null,9,2,2,3,2,"02","02","03","02"]
["02-02-04-01",4,null,9,2,2,4,1,"02","02","04","01"]
["02-02-05-00",4,null,9,2,2,5,0,"02","02","05","00"]
["02-03-00-04",3,null,9,2,3,0,4,"02","03","00","04"]
["02-03-01-03",3,null,9,2,3,1,3,"02","03","01","03"]
["02-03-02-02",3,null,9,2,3,2,2,"02","03","02","02"]
["02-03-03-01",3,null,9,2,3,3,1,"02","03","03","01"]
["02-03-04-00",3,null,9,2,3,4,0,"02","03","04","00"]
["02-04-00-03",3,null,9,2,4,0,3,"02","04","00","03"]
["02-04-01-02",3,null,9,2,4,1,2,"02","04","01","02"]
["02-04-02-01",3,null,9,2,4,2,1,"02","04","02","01"]
["02-04-03-00",3,null,9,2,4,3,0,"02","04","03","00"]
["02-05-00-02",3,null,9,2,5,0,2,"02","05","00","02"]
["02-05-01-01",2,null,9,2,5,1,1,"02","05","01","01"]
["02-05-02-00",2,null,9,2,5,2,0,"02","05","02","00"]
["02-06-00-01",2,null,9,2,6,0,1,"02","06","00","01"]
["02-06-01-00",2,null,9,2,6,1,0,"02","06","01","00"]
["02-07-00-00",2,null,9,2,7,0,0,"02","07","00","00"]
["03-00-00-06",4,null,9,3,0,0,6,"03","00","00","06"]
["03-00-01-05",4,null,9,3,0,1,5,"03","00","01","05"]
["03-00-02-04",4,null,9,3,0,2,4,"03","00","02","04"]
["03-00-03-03",4,null,9,3,0,3,3,"03","00","03","03"]
["03-00-04-02",4,null,9,3,0,4,2,"03","00","04","02"]
["03-00-05-01",4,null,9,3,0,5,1,"03","00","05","01"]
["03-00-06-00",4,null,9,3,0,6,0,"03","00","06","00"]
["03-01-00-05",4,null,9,3,1,0,5,"03","01","00","05"]
["03-01-01-04",4,null,9,3,1,1,4,"03","01","01","04"]
["03-01-02-03",4,null,9,3,1,2,3,"03","01","02","03"]
["03-01-03-02",4,null,9,3,1,3,2,"03","01","03","02"]
["03-01-04-01",4,null,9,3,1,4,1,"03","01","04","01"]
["03-01-05-00",4,null,9,3,1,5,0,"03","01","05","00"]
["03-02-00-04",3,null,9,3,2,0,4,"03","02","00","04"]
[{"$f":"I647&\"-\"&J647&\"-\"&K647&\"-\"&L647","v":"03-02-01-03"},3,null,9,3,2,1,3,"03","02","01","03"]
["03-02-02-02",3,null,9,3,2,2,2,{"$f":"IF(LEN(E648)=1,0&E648,IF(LEN(E648)=0,\"00\",RIGHT(E648,2)))","v":"03"},{"$f":"IF(LEN(F648)=1,0&F648,IF(LEN(F648)=0,\"00\",RIGHT(F648,2)))","v":"02"},{"$f":"IF(LEN(G648)=1,0&G648,IF(LEN(G648)=0,\"00\",RIGHT(G648,2)))","v":"02"},{"$f":"IF(LEN(H648)=1,0&H648,IF(LEN(H648)=0,\"00\",RIGHT(H648,2)))","v":"02"}]
["03-02-03-01",3,null,9,3,2,3,1,"03","02","03","01"]
["03-02-04-00",3,null,9,3,2,4,0,"03","02","04","00"]
["03-03-00-03",3,null,9,3,3,0,3,"03","03","00","03"]
["03-03-01-02",3,null,9,3,3,1,2,"03","03","01","02"]
["03-03-02-01",3,null,9,3,3,2,1,"03","03","02","01"]
["03-03-03-00",3,null,9,3,3,3,0,"03","03","03","00"]
["03-04-00-02",3,null,9,3,4,0,2,"03","04","00","02"]
["03-04-01-01",2,null,9,3,4,1,1,"03","04","01","01"]
["03-04-02-00",2,null,9,3,4,2,0,"03","04","02","00"]
["03-05-00-01",2,null,9,3,5,0,1,"03","05","00","01"]
["03-05-01-00",2,null,9,3,5,1,0,"03","05","01","00"]
["03-06-00-00",2,null,9,3,6,0,0,"03","06","00","00"]
["04-00-00-05",4,null,9,4,0,0,5,"04","00","00","05"]
["04-00-01-04",4,null,9,4,0,1,4,"04","00","01","04"]
["04-00-02-03",4,null,9,4,0,2,3,"04","00","02","03"]
["04-00-03-02",4,null,9,4,0,3,2,"04","00","03","02"]
["04-00-04-01",3,null,9,4,0,4,1,"04","00","04","01"]
["04-00-05-00",3,null,9,4,0,5,0,"04","00","05","00"]
["04-01-00-04",3,null,9,4,1,0,4,"04","01","00","04"]
["04-01-01-03",3,null,9,4,1,1,3,"04","01","01","03"]
["04-01-02-02",3,null,9,4,1,2,2,"04","01","02","02"]
["04-01-03-01",3,null,9,4,1,3,1,"04","01","03","01"]
["04-01-04-00",3,null,9,4,1,4,0,"04","01","04","00"]
["04-02-00-03",3,null,9,4,2,0,3,"04","02","00","03"]
["04-02-01-02",3,null,9,4,2,1,2,"04","02","01","02"]
["04-02-02-01",3,null,9,4,2,2,1,"04","02","02","01"]
["04-02-03-00",3,null,9,4,2,3,0,"04","02","03","00"]
["04-03-00-02",3,null,9,4,3,0,2,"04","03","00","02"]
["04-03-01-01",2,null,9,4,3,1,1,"04","03","01","01"]
["04-03-02-00",2,null,9,4,3,2,0,"04","03","02","00"]
["04-04-00-01",2,null,9,4,4,0,1,"04","04","00","01"]
["04-04-01-00",2,null,9,4,4,1,0,"04","04","01","00"]
["04-05-00-00",2,null,9,4,5,0,0,"04","05","00","00"]
["05-00-00-04",3,null,9,5,0,0,4,"05","00","00","04"]
["05-00-01-03",3,null,9,5,0,1,3,"05","00","01","03"]
["05-00-02-02",3,null,9,5,0,2,2,"05","00","02","02"]
["05-00-03-01",3,null,9,5,0,3,1,"05","00","03","01"]
["05-00-04-00",3,null,9,5,0,4,0,"05","00","04","00"]
["05-01-00-03",3,null,9,5,1,0,3,"05","01","00","03"]
["05-01-01-02",3,null,9,5,1,1,2,"05","01","01","02"]
["05-01-02-01",3,null,9,5,1,2,1,"05","01","02","01"]
["05-01-03-00",3,null,9,5,1,3,0,"05","01","03","00"]
["05-02-00-02",3,null,9,5,2,0,2,"05","02","00","02"]
["05-02-01-01",2,null,9,5,2,1,1,"05","02","01","01"]
["05-02-02-00",2,null,9,5,2,2,0,"05","02","02","00"]
["05-03-00-01",2,null,9,5,3,0,1,"05","03","00","01"]
["05-03-01-00",2,null,9,5,3,1,0,"05","03","01","00"]
["05-04-00-00",2,null,9,5,4,0,0,"05","04","00","00"]
["06-00-00-03",3,null,9,6,0,0,3,"06","00","00","03"]
["06-00-01-02",3,null,9,6,0,1,2,"06","00","01","02"]
["06-00-02-01",3,null,9,6,0,2,1,"06","00","02","01"]
["06-00-03-00",3,null,9,6,0,3,0,"06","00","03","00"]
["06-01-00-02",3,null,9,6,1,0,2,"06","01","00","02"]
["06-01-01-01",2,null,9,6,1,1,1,"06","01","01","01"]
["06-01-02-00",2,null,9,6,1,2,0,"06","01","02","00"]
["06-02-00-01",2,null,9,6,2,0,1,"06","02","00","01"]
["06-02-01-00",2,null,9,6,2,1,0,"06","02","01","00"]
["06-03-00-00",2,null,9,6,3,0,0,"06","03","00","00"]
["07-00-00-02",3,null,9,7,0,0,2,"07","00","00","02"]
["07-00-01-01",2,null,9,7,0,1,1,"07","00","01","01"]
["07-00-02-00",2,null,9,7,0,2,0,"07","00","02","00"]
["07-01-00-01",2,null,9,7,1,0,1,"07","01","00","01"]
[{"$f":"I711&\"-\"&J711&\"-\"&K711&\"-\"&L711","v":"07-01-01-00"},2,null,9,7,1,1,0,"07","01","01","00"]
["07-02-00-00",2,null,9,7,2,0,0,{"$f":"IF(LEN(E712)=1,0&E712,IF(LEN(E712)=0,\"00\",RIGHT(E712,2)))","v":"07"},{"$f":"IF(LEN(F712)=1,0&F712,IF(LEN(F712)=0,\"00\",RIGHT(F712,2)))","v":"02"},{"$f":"IF(LEN(G712)=1,0&G712,IF(LEN(G712)=0,\"00\",RIGHT(G712,2)))","v":"00"},{"$f":"IF(LEN(H712)=1,0&H712,IF(LEN(H712)=0,\"00\",RIGHT(H712,2)))","v":"00"}]
["08-00-00-01",2,null,9,8,0,0,1,"08","00","00","01"]
["08-00-01-00",2,null,9,8,0,1,0,"08","00","01","00"]
["08-01-00-00",2,null,9,8,1,0,0,"08","01","00","00"]
["09-00-00-00",1,null,9,9,0,0,0,"09","00","00","00"]
["00-00-00-10",7,null,10,0,0,0,10,"00","00","00","10"]
["00-00-01-09",6,null,10,0,0,1,9,"00","00","01","09"]
["00-00-02-08",6,null,10,0,0,2,8,"00","00","02","08"]
["00-00-03-07",6,null,10,0,0,3,7,"00","00","03","07"]
["00-00-04-06",6,null,10,0,0,4,6,"00","00","04","06"]
["00-00-05-05",6,null,10,0,0,5,5,"00","00","05","05"]
["00-00-06-04",5,null,10,0,0,6,4,"00","00","06","04"]
["00-00-07-03",5,null,10,0,0,7,3,"00","00","07","03"]
["00-00-08-02",5,null,10,0,0,8,2,"00","00","08","02"]
["00-00-09-01",4,null,10,0,0,9,1,"00","00","09","01"]
["00-00-10-00",4,null,10,0,0,10,0,"00","00","10","00"]
["00-01-00-09",5,null,10,0,1,0,9,"00","01","00","09"]
["00-01-01-08",5,null,10,0,1,1,8,"00","01","01","08"]
["00-01-02-07",5,null,10,0,1,2,7,"00","01","02","07"]
["00-01-03-06",5,null,10,0,1,3,6,"00","01","03","06"]
["00-01-04-05",5,null,10,0,1,4,5,"00","01","04","05"]
["00-01-05-04",5,null,10,0,1,5,4,"00","01","05","04"]
["00-01-06-03",5,null,10,0,1,6,3,"00","01","06","03"]
["00-01-07-02",5,null,10,0,1,7,2,"00","01","07","02"]
["00-01-08-01",4,null,10,0,1,8,1,"00","01","08","01"]
["00-01-09-00",4,null,10,0,1,9,0,"00","01","09","00"]
["00-02-00-08",5,null,10,0,2,0,8,"00","02","00","08"]
["00-02-01-07",5,null,10,0,2,1,7,"00","02","01","07"]
["00-02-02-06",5,null,10,0,2,2,6,"00","02","02","06"]
["00-02-03-05",5,null,10,0,2,3,5,"00","02","03","05"]
["00-02-04-04",5,null,10,0,2,4,4,"00","02","04","04"]
["00-02-05-03",5,null,10,0,2,5,3,"00","02","05","03"]
["00-02-06-02",5,null,10,0,2,6,2,"00","02","06","02"]
["00-02-07-01",4,null,10,0,2,7,1,"00","02","07","01"]
["00-02-08-00",4,null,10,0,2,8,0,"00","02","08","00"]
["00-03-00-07",5,null,10,0,3,0,7,"00","03","00","07"]
["00-03-01-06",5,null,10,0,3,1,6,"00","03","01","06"]
["00-03-02-05",5,null,10,0,3,2,5,"00","03","02","05"]
["00-03-03-04",5,null,10,0,3,3,4,"00","03","03","04"]
["00-03-04-03",5,null,10,0,3,4,3,"00","03","04","03"]
["00-03-05-02",4,null,10,0,3,5,2,"00","03","05","02"]
["00-03-06-01",4,null,10,0,3,6,1,"00","03","06","01"]
["00-03-07-00",4,null,10,0,3,7,0,"00","03","07","00"]
["00-04-00-06",5,null,10,0,4,0,6,"00","04","00","06"]
["00-04-01-05",5,null,10,0,4,1,5,"00","04","01","05"]
["00-04-02-04",5,null,10,0,4,2,4,"00","04","02","04"]
["00-04-03-03",4,null,10,0,4,3,3,"00","04","03","03"]
["00-04-04-02",4,null,10,0,4,4,2,"00","04","04","02"]
["00-04-05-01",4,null,10,0,4,5,1,"00","04","05","01"]
["00-04-06-00",4,null,10,0,4,6,0,"00","04","06","00"]
["00-05-00-05",4,null,10,0,5,0,5,"00","05","00","05"]
["00-05-01-04",4,null,10,0,5,1,4,"00","05","01","04"]
["00-05-02-03",4,null,10,0,5,2,3,"00","05","02","03"]
["00-05-03-02",4,null,10,0,5,3,2,"00","05","03","02"]
["00-05-04-01",4,null,10,0,5,4,1,"00","05","04","01"]
["00-05-05-00",4,null,10,0,5,5,0,"00","05","05","00"]
["00-06-00-04",3,null,10,0,6,0,4,"00","06","00","04"]
["00-06-01-03",3,null,10,0,6,1,3,"00","06","01","03"]
["00-06-02-02",3,null,10,0,6,2,2,"00","06","02","02"]
["00-06-03-01",3,null,10,0,6,3,1,"00","06","03","01"]
["00-06-04-00",3,null,10,0,6,4,0,"00","06","04","00"]
["00-07-00-03",3,null,10,0,7,0,3,"00","07","00","03"]
["00-07-01-02",3,null,10,0,7,1,2,"00","07","01","02"]
[{"$f":"I775&\"-\"&J775&\"-\"&K775&\"-\"&L775","v":"00-07-02-01"},3,null,10,0,7,2,1,"00","07","02","01"]
["00-07-03-00",3,null,10,0,7,3,0,{"$f":"IF(LEN(E776)=1,0&E776,IF(LEN(E776)=0,\"00\",RIGHT(E776,2)))","v":"00"},{"$f":"IF(LEN(F776)=1,0&F776,IF(LEN(F776)=0,\"00\",RIGHT(F776,2)))","v":"07"},{"$f":"IF(LEN(G776)=1,0&G776,IF(LEN(G776)=0,\"00\",RIGHT(G776,2)))","v":"03"},{"$f":"IF(LEN(H776)=1,0&H776,IF(LEN(H776)=0,\"00\",RIGHT(H776,2)))","v":"00"}]
["00-08-00-02",3,null,10,0,8,0,2,"00","08","00","02"]
["00-08-01-01",3,null,10,0,8,1,1,"00","08","01","01"]
["00-08-02-00",3,null,10,0,8,2,0,"00","08","02","00"]
["00-09-00-01",2,null,10,0,9,0,1,"00","09","00","01"]
["00-09-01-00",2,null,10,0,9,1,0,"00","09","01","00"]
["00-10-00-00",2,null,10,0,10,0,0,"00","10","00","00"]
["01-00-00-09",5,null,10,1,0,0,9,"01","00","00","09"]
["01-00-01-08",5,null,10,1,0,1,8,"01","00","01","08"]
["01-00-02-07",5,null,10,1,0,2,7,"01","00","02","07"]
["01-00-03-06",5,null,10,1,0,3,6,"01","00","03","06"]
["01-00-04-05",5,null,10,1,0,4,5,"01","00","04","05"]
["01-00-05-04",5,null,10,1,0,5,4,"01","00","05","04"]
["01-00-06-03",5,null,10,1,0,6,3,"01","00","06","03"]
["01-00-07-02",5,null,10,1,0,7,2,"01","00","07","02"]
["01-00-08-01",4,null,10,1,0,8,1,"01","00","08","01"]
["01-00-09-00",4,null,10,1,0,9,0,"01","00","09","00"]
["01-01-00-08",5,null,10,1,1,0,8,"01","01","00","08"]
["01-01-01-07",5,null,10,1,1,1,7,"01","01","01","07"]
["01-01-02-06",5,null,10,1,1,2,6,"01","01","02","06"]
["01-01-03-05",5,null,10,1,1,3,5,"01","01","03","05"]
["01-01-04-04",5,null,10,1,1,4,4,"01","01","04","04"]
["01-01-05-03",5,null,10,1,1,5,3,"01","01","05","03"]
["01-01-06-02",4,null,10,1,1,6,2,"01","01","06","02"]
["01-01-07-01",4,null,10,1,1,7,1,"01","01","07","01"]
["01-01-08-00",4,null,10,1,1,8,0,"01","01","08","00"]
["01-02-00-07",5,null,10,1,2,0,7,"01","02","00","07"]
["01-02-01-06",5,null,10,1,2,1,6,"01","02","01","06"]
["01-02-02-05",5,null,10,1,2,2,5,"01","02","02","05"]
["01-02-03-04",5,null,10,1,2,3,4,"01","02","03","04"]
["01-02-04-03",4,null,10,1,2,4,3,"01","02","04","03"]
["01-02-05-02",4,null,10,1,2,5,2,"01","02","05","02"]
["01-02-06-01",4,null,10,1,2,6,1,"01","02","06","01"]
["01-02-07-00",4,null,10,1,2,7,0,"01","02","07","00"]
["01-03-00-06",5,null,10,1,3,0,6,"01","03","00","06"]
["01-03-01-05",4,null,10,1,3,1,5,"01","03","01","05"]
["01-03-02-04",4,null,10,1,3,2,4,"01","03","02","04"]
["01-03-03-03",4,null,10,1,3,3,3,"01","03","03","03"]
["01-03-04-02",4,null,10,1,3,4,2,"01","03","04","02"]
["01-03-05-01",4,null,10,1,3,5,1,"01","03","05","01"]
["01-03-06-00",4,null,10,1,3,6,0,"01","03","06","00"]
["01-04-00-05",4,null,10,1,4,0,5,"01","04","00","05"]
["01-04-01-04",4,null,10,1,4,1,4,"01","04","01","04"]
["01-04-02-03",4,null,10,1,4,2,3,"01","04","02","03"]
["01-04-03-02",4,null,10,1,4,3,2,"01","04","03","02"]
["01-04-04-01",4,null,10,1,4,4,1,"01","04","04","01"]
["01-04-05-00",4,null,10,1,4,5,0,"01","04","05","00"]
["01-05-00-04",3,null,10,1,5,0,4,"01","05","00","04"]
["01-05-01-03",3,null,10,1,5,1,3,"01","05","01","03"]
["01-05-02-02",3,null,10,1,5,2,2,"01","05","02","02"]
["01-05-03-01",3,null,10,1,5,3,1,"01","05","03","01"]
["01-05-04-00",3,null,10,1,5,4,0,"01","05","04","00"]
["01-06-00-03",3,null,10,1,6,0,3,"01","06","00","03"]
["01-06-01-02",3,null,10,1,6,1,2,"01","06","01","02"]
["01-06-02-01",3,null,10,1,6,2,1,"01","06","02","01"]
["01-06-03-00",3,null,10,1,6,3,0,"01","06","03","00"]
["01-07-00-02",3,null,10,1,7,0,2,"01","07","00","02"]
["01-07-01-01",2,null,10,1,7,1,1,"01","07","01","01"]
["01-07-02-00",2,null,10,1,7,2,0,"01","07","02","00"]
["01-08-00-01",2,null,10,1,8,0,1,"01","08","00","01"]
["01-08-01-00",2,null,10,1,8,1,0,"01","08","01","00"]
["01-09-00-00",2,null,10,1,9,0,0,"01","09","00","00"]
["02-00-00-08",5,null,10,2,0,0,8,"02","00","00","08"]
[{"$f":"I839&\"-\"&J839&\"-\"&K839&\"-\"&L839","v":"02-00-01-07"},5,null,10,2,0,1,7,"02","00","01","07"]
["02-00-02-06",5,null,10,2,0,2,6,{"$f":"IF(LEN(E840)=1,0&E840,IF(LEN(E840)=0,\"00\",RIGHT(E840,2)))","v":"02"},{"$f":"IF(LEN(F840)=1,0&F840,IF(LEN(F840)=0,\"00\",RIGHT(F840,2)))","v":"00"},{"$f":"IF(LEN(G840)=1,0&G840,IF(LEN(G840)=0,\"00\",RIGHT(G840,2)))","v":"02"},{"$f":"IF(LEN(H840)=1,0&H840,IF(LEN(H840)=0,\"00\",RIGHT(H840,2)))","v":"06"}]
["02-00-03-05",5,null,10,2,0,3,5,"02","00","03","05"]
["02-00-04-04",5,null,10,2,0,4,4,"02","00","04","04"]
["02-00-05-03",4,null,10,2,0,5,3,"02","00","05","03"]
["02-00-06-02",4,null,10,2,0,6,2,"02","00","06","02"]
["02-00-07-01",4,null,10,2,0,7,1,"02","00","07","01"]
["02-00-08-00",4,null,10,2,0,8,0,"02","00","08","00"]
["02-01-00-07",5,null,10,2,1,0,7,"02","01","00","07"]
["02-01-01-06",5,null,10,2,1,1,6,"02","01","01","06"]
["02-01-02-05",4,null,10,2,1,2,5,"02","01","02","05"]
["02-01-03-04",4,null,10,2,1,3,4,"02","01","03","04"]
["02-01-04-03",4,null,10,2,1,4,3,"02","01","04","03"]
["02-01-05-02",4,null,10,2,1,5,2,"02","01","05","02"]
["02-01-06-01",4,null,10,2,1,6,1,"02","01","06","01"]
["02-01-07-00",4,null,10,2,1,7,0,"02","01","07","00"]
["02-02-00-06",4,null,10,2,2,0,6,"02","02","00","06"]
["02-02-01-05",4,null,10,2,2,1,5,"02","02","01","05"]
["02-02-02-04",4,null,10,2,2,2,4,"02","02","02","04"]
["02-02-03-03",4,null,10,2,2,3,3,"02","02","03","03"]
["02-02-04-02",4,null,10,2,2,4,2,"02","02","04","02"]
["02-02-05-01",4,null,10,2,2,5,1,"02","02","05","01"]
["02-02-06-00",4,null,10,2,2,6,0,"02","02","06","00"]
["02-03-00-05",4,null,10,2,3,0,5,"02","03","00","05"]
["02-03-01-04",4,null,10,2,3,1,4,"02","03","01","04"]
["02-03-02-03",4,null,10,2,3,2,3,"02","03","02","03"]
["02-03-03-02",4,null,10,2,3,3,2,"02","03","03","02"]
["02-03-04-01",4,null,10,2,3,4,1,"02","03","04","01"]
["02-03-05-00",4,null,10,2,3,5,0,"02","03","05","00"]
["02-04-00-04",3,null,10,2,4,0,4,"02","04","00","04"]
["02-04-01-03",3,null,10,2,4,1,3,"02","04","01","03"]
["02-04-02-02",3,null,10,2,4,2,2,"02","04","02","02"]
["02-04-03-01",3,null,10,2,4,3,1,"02","04","03","01"]
["02-04-04-00",3,null,10,2,4,4,0,"02","04","04","00"]
["02-05-00-03",3,null,10,2,5,0,3,"02","05","00","03"]
["02-05-01-02",3,null,10,2,5,1,2,"02","05","01","02"]
["02-05-02-01",3,null,10,2,5,2,1,"02","05","02","01"]
["02-05-03-00",3,null,10,2,5,3,0,"02","05","03","00"]
["02-06-00-02",3,null,10,2,6,0,2,"02","06","00","02"]
["02-06-01-01",2,null,10,2,6,1,1,"02","06","01","01"]
["02-06-02-00",2,null,10,2,6,2,0,"02","06","02","00"]
["02-07-00-01",2,null,10,2,7,0,1,"02","07","00","01"]
["02-07-01-00",2,null,10,2,7,1,0,"02","07","01","00"]
["02-08-00-00",2,null,10,2,8,0,0,"02","08","00","00"]
["03-00-00-07",5,null,10,3,0,0,7,"03","00","00","07"]
["03-00-01-06",4,null,10,3,0,1,6,"03","00","01","06"]
["03-00-02-05",4,null,10,3,0,2,5,"03","00","02","05"]
["03-00-03-04",4,null,10,3,0,3,4,"03","00","03","04"]
["03-00-04-03",4,null,10,3,0,4,3,"03","00","04","03"]
["03-00-05-02",4,null,10,3,0,5,2,"03","00","05","02"]
["03-00-06-01",4,null,10,3,0,6,1,"03","00","06","01"]
["03-00-07-00",4,null,10,3,0,7,0,"03","00","07","00"]
["03-01-00-06",4,null,10,3,1,0,6,"03","01","00","06"]
["03-01-01-05",4,null,10,3,1,1,5,"03","01","01","05"]
["03-01-02-04",4,null,10,3,1,2,4,"03","01","02","04"]
["03-01-03-03",4,null,10,3,1,3,3,"03","01","03","03"]
["03-01-04-02",4,null,10,3,1,4,2,"03","01","04","02"]
["03-01-05-01",4,null,10,3,1,5,1,"03","01","05","01"]
["03-01-06-00",4,null,10,3,1,6,0,"03","01","06","00"]
["03-02-00-05",4,null,10,3,2,0,5,"03","02","00","05"]
["03-02-01-04",4,null,10,3,2,1,4,"03","02","01","04"]
["03-02-02-03",4,null,10,3,2,2,3,"03","02","02","03"]
["03-02-03-02",4,null,10,3,2,3,2,"03","02","03","02"]
["03-02-04-01",4,null,10,3,2,4,1,"03","02","04","01"]
[{"$f":"I903&\"-\"&J903&\"-\"&K903&\"-\"&L903","v":"03-02-05-00"},4,null,10,3,2,5,0,"03","02","05","00"]
["03-03-00-04",3,null,10,3,3,0,4,{"$f":"IF(LEN(E904)=1,0&E904,IF(LEN(E904)=0,\"00\",RIGHT(E904,2)))","v":"03"},{"$f":"IF(LEN(F904)=1,0&F904,IF(LEN(F904)=0,\"00\",RIGHT(F904,2)))","v":"03"},{"$f":"IF(LEN(G904)=1,0&G904,IF(LEN(G904)=0,\"00\",RIGHT(G904,2)))","v":"00"},{"$f":"IF(LEN(H904)=1,0&H904,IF(LEN(H904)=0,\"00\",RIGHT(H904,2)))","v":"04"}]
["03-03-01-03",3,null,10,3,3,1,3,"03","03","01","03"]
["03-03-02-02",3,null,10,3,3,2,2,"03","03","02","02"]
["03-03-03-01",3,null,10,3,3,3,1,"03","03","03","01"]
["03-03-04-00",3,null,10,3,3,4,0,"03","03","04","00"]
["03-04-00-03",3,null,10,3,4,0,3,"03","04","00","03"]
["03-04-01-02",3,null,10,3,4,1,2,"03","04","01","02"]
["03-04-02-01",3,null,10,3,4,2,1,"03","04","02","01"]
["03-04-03-00",3,null,10,3,4,3,0,"03","04","03","00"]
["03-05-00-02",3,null,10,3,5,0,2,"03","05","00","02"]
["03-05-01-01",2,null,10,3,5,1,1,"03","05","01","01"]
["03-05-02-00",2,null,10,3,5,2,0,"03","05","02","00"]
["03-06-00-01",2,null,10,3,6,0,1,"03","06","00","01"]
["03-06-01-00",2,null,10,3,6,1,0,"03","06","01","00"]
["03-07-00-00",2,null,10,3,7,0,0,"03","07","00","00"]
["04-00-00-06",4,null,10,4,0,0,6,"04","00","00","06"]
["04-00-01-05",4,null,10,4,0,1,5,"04","00","01","05"]
["04-00-02-04",4,null,10,4,0,2,4,"04","00","02","04"]
["04-00-03-03",4,null,10,4,0,3,3,"04","00","03","03"]
["04-00-04-02",4,null,10,4,0,4,2,"04","00","04","02"]
["04-00-05-01",4,null,10,4,0,5,1,"04","00","05","01"]
["04-00-06-00",4,null,10,4,0,6,0,"04","00","06","00"]
["04-01-00-05",4,null,10,4,1,0,5,"04","01","00","05"]
["04-01-01-04",4,null,10,4,1,1,4,"04","01","01","04"]
["04-01-02-03",4,null,10,4,1,2,3,"04","01","02","03"]
["04-01-03-02",4,null,10,4,1,3,2,"04","01","03","02"]
["04-01-04-01",3,null,10,4,1,4,1,"04","01","04","01"]
["04-01-05-00",3,null,10,4,1,5,0,"04","01","05","00"]
["04-02-00-04",3,null,10,4,2,0,4,"04","02","00","04"]
["04-02-01-03",3,null,10,4,2,1,3,"04","02","01","03"]
["04-02-02-02",3,null,10,4,2,2,2,"04","02","02","02"]
["04-02-03-01",3,null,10,4,2,3,1,"04","02","03","01"]
["04-02-04-00",3,null,10,4,2,4,0,"04","02","04","00"]
["04-03-00-03",3,null,10,4,3,0,3,"04","03","00","03"]
["04-03-01-02",3,null,10,4,3,1,2,"04","03","01","02"]
["04-03-02-01",3,null,10,4,3,2,1,"04","03","02","01"]
["04-03-03-00",3,null,10,4,3,3,0,"04","03","03","00"]
["04-04-00-02",3,null,10,4,4,0,2,"04","04","00","02"]
["04-04-01-01",2,null,10,4,4,1,1,"04","04","01","01"]
["04-04-02-00",2,null,10,4,4,2,0,"04","04","02","00"]
["04-05-00-01",2,null,10,4,5,0,1,"04","05","00","01"]
["04-05-01-00",2,null,10,4,5,1,0,"04","05","01","00"]
["04-06-00-00",2,null,10,4,6,0,0,"04","06","00","00"]
["05-00-00-05",4,null,10,5,0,0,5,"05","00","00","05"]
["05-00-01-04",4,null,10,5,0,1,4,"05","00","01","04"]
["05-00-02-03",4,null,10,5,0,2,3,"05","00","02","03"]
["05-00-03-02",3,null,10,5,0,3,2,"05","00","03","02"]
["05-00-04-01",3,null,10,5,0,4,1,"05","00","04","01"]
["05-00-05-00",3,null,10,5,0,5,0,"05","00","05","00"]
["05-01-00-04",3,null,10,5,1,0,4,"05","01","00","04"]
["05-01-01-03",3,null,10,5,1,1,3,"05","01","01","03"]
["05-01-02-02",3,null,10,5,1,2,2,"05","01","02","02"]
["05-01-03-01",3,null,10,5,1,3,1,"05","01","03","01"]
["05-01-04-00",3,null,10,5,1,4,0,"05","01","04","00"]
["05-02-00-03",3,null,10,5,2,0,3,"05","02","00","03"]
["05-02-01-02",3,null,10,5,2,1,2,"05","02","01","02"]
["05-02-02-01",3,null,10,5,2,2,1,"05","02","02","01"]
["05-02-03-00",3,null,10,5,2,3,0,"05","02","03","00"]
["05-03-00-02",3,null,10,5,3,0,2,"05","03","00","02"]
["05-03-01-01",2,null,10,5,3,1,1,"05","03","01","01"]
["05-03-02-00",2,null,10,5,3,2,0,"05","03","02","00"]
["05-04-00-01",2,null,10,5,4,0,1,"05","04","00","01"]
["05-04-01-00",2,null,10,5,4,1,0,"05","04","01","00"]
[{"$f":"I967&\"-\"&J967&\"-\"&K967&\"-\"&L967","v":"05-05-00-00"},2,null,10,5,5,0,0,"05","05","00","00"]
["06-00-00-04",3,null,10,6,0,0,4,{"$f":"IF(LEN(E968)=1,0&E968,IF(LEN(E968)=0,\"00\",RIGHT(E968,2)))","v":"06"},{"$f":"IF(LEN(F968)=1,0&F968,IF(LEN(F968)=0,\"00\",RIGHT(F968,2)))","v":"00"},{"$f":"IF(LEN(G968)=1,0&G968,IF(LEN(G968)=0,\"00\",RIGHT(G968,2)))","v":"00"},{"$f":"IF(LEN(H968)=1,0&H968,IF(LEN(H968)=0,\"00\",RIGHT(H968,2)))","v":"04"}]
["06-00-01-03",3,null,10,6,0,1,3,"06","00","01","03"]
["06-00-02-02",3,null,10,6,0,2,2,"06","00","02","02"]
["06-00-03-01",3,null,10,6,0,3,1,"06","00","03","01"]
["06-00-04-00",3,null,10,6,0,4,0,"06","00","04","00"]
["06-01-00-03",3,null,10,6,1,0,3,"06","01","00","03"]
["06-01-01-02",3,null,10,6,1,1,2,"06","01","01","02"]
["06-01-02-01",3,null,10,6,1,2,1,"06","01","02","01"]
["06-01-03-00",3,null,10,6,1,3,0,"06","01","03","00"]
["06-02-00-02",3,null,10,6,2,0,2,"06","02","00","02"]
["06-02-01-01",2,null,10,6,2,1,1,"06","02","01","01"]
["06-02-02-00",2,null,10,6,2,2,0,"06","02","02","00"]
["06-03-00-01",2,null,10,6,3,0,1,"06","03","00","01"]
["06-03-01-00",2,null,10,6,3,1,0,"06","03","01","00"]
["06-04-00-00",2,null,10,6,4,0,0,"06","04","00","00"]
["07-00-00-03",3,null,10,7,0,0,3,"07","00","00","03"]
["07-00-01-02",3,null,10,7,0,1,2,"07","00","01","02"]
["07-00-02-01",3,null,10,7,0,2,1,"07","00","02","01"]
["07-00-03-00",3,null,10,7,0,3,0,"07","00","03","00"]
["07-01-00-02",3,null,10,7,1,0,2,"07","01","00","02"]
["07-01-01-01",2,null,10,7,1,1,1,"07","01","01","01"]
["07-01-02-00",2,null,10,7,1,2,0,"07","01","02","00"]
["07-02-00-01",2,null,10,7,2,0,1,"07","02","00","01"]
["07-02-01-00",2,null,10,7,2,1,0,"07","02","01","00"]
["07-03-00-00",2,null,10,7,3,0,0,"07","03","00","00"]
["08-00-00-02",3,null,10,8,0,0,2,"08","00","00","02"]
["08-00-01-01",2,null,10,8,0,1,1,"08","00","01","01"]
["08-00-02-00",2,null,10,8,0,2,0,"08","00","02","00"]
["08-01-00-01",2,null,10,8,1,0,1,"08","01","00","01"]
["08-01-01-00",2,null,10,8,1,1,0,"08","01","01","00"]
["08-02-00-00",2,null,10,8,2,0,0,"08","02","00","00"]
["09-00-00-01",2,null,10,9,0,0,1,"09","00","00","01"]
["09-00-01-00",2,null,10,9,0,1,0,"09","00","01","00"]
["09-01-00-00",2,null,10,9,1,0,0,"09","01","00","00"]
["10-00-00-00",1,null,10,10,0,0,0,"10","00","00","00"]
["00-00-00-11",7,null,11,0,0,0,11,"00","00","00","11"]
["00-00-01-10",6,null,11,0,0,1,10,"00","00","01","10"]
["00-00-02-09",6,null,11,0,0,2,9,"00","00","02","09"]
["00-00-03-08",6,null,11,0,0,3,8,"00","00","03","08"]
["00-00-04-07",6,null,11,0,0,4,7,"00","00","04","07"]
["00-00-05-06",6,null,11,0,0,5,6,"00","00","05","06"]
["00-00-06-05",5,null,11,0,0,6,5,"00","00","06","05"]
["00-00-07-04",5,null,11,0,0,7,4,"00","00","07","04"]
["00-00-08-03",5,null,11,0,0,8,3,"00","00","08","03"]
["00-00-09-02",4,null,11,0,0,9,2,"00","00","09","02"]
["00-00-10-01",4,null,11,0,0,10,1,"00","00","10","01"]
["00-00-11-00",4,null,11,0,0,11,0,"00","00","11","00"]
["00-01-00-10",5,null,11,0,1,0,10,"00","01","00","10"]
["00-01-01-09",5,null,11,0,1,1,9,"00","01","01","09"]
["00-01-02-08",5,null,11,0,1,2,8,"00","01","02","08"]
["00-01-03-07",5,null,11,0,1,3,7,"00","01","03","07"]
["00-01-04-06",5,null,11,0,1,4,6,"00","01","04","06"]
["00-01-05-05",5,null,11,0,1,5,5,"00","01","05","05"]
["00-01-06-04",5,null,11,0,1,6,4,"00","01","06","04"]
["00-01-07-03",5,null,11,0,1,7,3,"00","01","07","03"]
["00-01-08-02",4,null,11,0,1,8,2,"00","01","08","02"]
["00-01-09-01",4,null,11,0,1,9,1,"00","01","09","01"]
["00-01-10-00",4,null,11,0,1,10,0,"00","01","10","00"]
["00-02-00-09",5,null,11,0,2,0,9,"00","02","00","09"]
["00-02-01-08",5,null,11,0,2,1,8,"00","02","01","08"]
["00-02-02-07",5,null,11,0,2,2,7,"00","02","02","07"]
["00-02-03-06",5,null,11,0,2,3,6,"00","02","03","06"]
["00-02-04-05",5,null,11,0,2,4,5,"00","02","04","05"]
[{"$f":"I1031&\"-\"&J1031&\"-\"&K1031&\"-\"&L1031","v":"00-02-05-04"},5,null,11,0,2,5,4,"00","02","05","04"]
["00-02-06-03",5,null,11,0,2,6,3,{"$f":"IF(LEN(E1032)=1,0&E1032,IF(LEN(E1032)=0,\"00\",RIGHT(E1032,2)))","v":"00"},{"$f":"IF(LEN(F1032)=1,0&F1032,IF(LEN(F1032)=0,\"00\",RIGHT(F1032,2)))","v":"02"},{"$f":"IF(LEN(G1032)=1,0&G1032,IF(LEN(G1032)=0,\"00\",RIGHT(G1032,2)))","v":"06"},{"$f":"IF(LEN(H1032)=1,0&H1032,IF(LEN(H1032)=0,\"00\",RIGHT(H1032,2)))","v":"03"}]
["00-02-07-02",4,null,11,0,2,7,2,"00","02","07","02"]
["00-02-08-01",4,null,11,0,2,8,1,"00","02","08","01"]
["00-02-09-00",4,null,11,0,2,9,0,"00","02","09","00"]
["00-03-00-08",5,null,11,0,3,0,8,"00","03","00","08"]
["00-03-01-07",5,null,11,0,3,1,7,"00","03","01","07"]
["00-03-02-06",5,null,11,0,3,2,6,"00","03","02","06"]
["00-03-03-05",5,null,11,0,3,3,5,"00","03","03","05"]
["00-03-04-04",5,null,11,0,3,4,4,"00","03","04","04"]
["00-03-05-03",5,null,11,0,3,5,3,"00","03","05","03"]
["00-03-06-02",4,null,11,0,3,6,2,"00","03","06","02"]
["00-03-07-01",4,null,11,0,3,7,1,"00","03","07","01"]
["00-03-08-00",4,null,11,0,3,8,0,"00","03","08","00"]
["00-04-00-07",5,null,11,0,4,0,7,"00","04","00","07"]
["00-04-01-06",5,null,11,0,4,1,6,"00","04","01","06"]
["00-04-02-05",5,null,11,0,4,2,5,"00","04","02","05"]
["00-04-03-04",5,null,11,0,4,3,4,"00","04","03","04"]
["00-04-04-03",4,null,11,0,4,4,3,"00","04","04","03"]
["00-04-05-02",4,null,11,0,4,5,2,"00","04","05","02"]
["00-04-06-01",4,null,11,0,4,6,1,"00","04","06","01"]
["00-04-07-00",4,null,11,0,4,7,0,"00","04","07","00"]
["00-05-00-06",5,null,11,0,5,0,6,"00","05","00","06"]
["00-05-01-05",4,null,11,0,5,1,5,"00","05","01","05"]
["00-05-02-04",4,null,11,0,5,2,4,"00","05","02","04"]
["00-05-03-03",4,null,11,0,5,3,3,"00","05","03","03"]
["00-05-04-02",4,null,11,0,5,4,2,"00","05","04","02"]
["00-05-05-01",4,null,11,0,5,5,1,"00","05","05","01"]
["00-05-06-00",4,null,11,0,5,6,0,"00","05","06","00"]
["00-06-00-05",3,null,11,0,6,0,5,"00","06","00","05"]
["00-06-01-04",3,null,11,0,6,1,4,"00","06","01","04"]
["00-06-02-03",3,null,11,0,6,2,3,"00","06","02","03"]
["00-06-03-02",3,null,11,0,6,3,2,"00","06","03","02"]
["00-06-04-01",3,null,11,0,6,4,1,"00","06","04","01"]
["00-06-05-00",3,null,11,0,6,5,0,"00","06","05","00"]
["00-07-00-04",3,null,11,0,7,0,4,"00","07","00","04"]
["00-07-01-03",3,null,11,0,7,1,3,"00","07","01","03"]
["00-07-02-02",3,null,11,0,7,2,2,"00","07","02","02"]
["00-07-03-01",3,null,11,0,7,3,1,"00","07","03","01"]
["00-07-04-00",3,null,11,0,7,4,0,"00","07","04","00"]
["00-08-00-03",3,null,11,0,8,0,3,"00","08","00","03"]
["00-08-01-02",3,null,11,0,8,1,2,"00","08","01","02"]
["00-08-02-01",3,null,11,0,8,2,1,"00","08","02","01"]
["00-08-03-00",3,null,11,0,8,3,0,"00","08","03","00"]
["00-09-00-02",3,null,11,0,9,0,2,"00","09","00","02"]
["00-09-01-01",3,null,11,0,9,1,1,"00","09","01","01"]
["00-09-02-00",2,null,11,0,9,2,0,"00","09","02","00"]
["00-10-00-01",2,null,11,0,10,0,1,"00","10","00","01"]
["00-10-01-00",2,null,11,0,10,1,0,"00","10","01","00"]
["00-11-00-00",2,null,11,0,11,0,0,"00","11","00","00"]
["01-00-00-10",5,null,11,1,0,0,10,"01","00","00","10"]
["01-00-01-09",5,null,11,1,0,1,9,"01","00","01","09"]
["01-00-02-08",5,null,11,1,0,2,8,"01","00","02","08"]
["01-00-03-07",5,null,11,1,0,3,7,"01","00","03","07"]
["01-00-04-06",5,null,11,1,0,4,6,"01","00","04","06"]
["01-00-05-05",5,null,11,1,0,5,5,"01","00","05","05"]
["01-00-06-04",5,null,11,1,0,6,4,"01","00","06","04"]
["01-00-07-03",5,null,11,1,0,7,3,"01","00","07","03"]
["01-00-08-02",4,null,11,1,0,8,2,"01","00","08","02"]
["01-00-09-01",4,null,11,1,0,9,1,"01","00","09","01"]
["01-00-10-00",4,null,11,1,0,10,0,"01","00","10","00"]
["01-01-00-09",5,null,11,1,1,0,9,"01","01","00","09"]
["01-01-01-08",5,null,11,1,1,1,8,"01","01","01","08"]
["01-01-02-07",5,null,11,1,1,2,7,"01","01","02","07"]
[{"$f":"I1095&\"-\"&J1095&\"-\"&K1095&\"-\"&L1095","v":"01-01-03-06"},5,null,11,1,1,3,6,"01","01","03","06"]
["01-01-04-05",5,null,11,1,1,4,5,{"$f":"IF(LEN(E1096)=1,0&E1096,IF(LEN(E1096)=0,\"00\",RIGHT(E1096,2)))","v":"01"},{"$f":"IF(LEN(F1096)=1,0&F1096,IF(LEN(F1096)=0,\"00\",RIGHT(F1096,2)))","v":"01"},{"$f":"IF(LEN(G1096)=1,0&G1096,IF(LEN(G1096)=0,\"00\",RIGHT(G1096,2)))","v":"04"},{"$f":"IF(LEN(H1096)=1,0&H1096,IF(LEN(H1096)=0,\"00\",RIGHT(H1096,2)))","v":"05"}]
["01-01-05-04",5,null,11,1,1,5,4,"01","01","05","04"]
["01-01-06-03",5,null,11,1,1,6,3,"01","01","06","03"]
["01-01-07-02",4,null,11,1,1,7,2,"01","01","07","02"]
["01-01-08-01",4,null,11,1,1,8,1,"01","01","08","01"]
["01-01-09-00",4,null,11,1,1,9,0,"01","01","09","00"]
["01-02-00-08",5,null,11,1,2,0,8,"01","02","00","08"]
["01-02-01-07",5,null,11,1,2,1,7,"01","02","01","07"]
["01-02-02-06",5,null,11,1,2,2,6,"01","02","02","06"]
["01-02-03-05",5,null,11,1,2,3,5,"01","02","03","05"]
["01-02-04-04",5,null,11,1,2,4,4,"01","02","04","04"]
["01-02-05-03",4,null,11,1,2,5,3,"01","02","05","03"]
["01-02-06-02",4,null,11,1,2,6,2,"01","02","06","02"]
["01-02-07-01",4,null,11,1,2,7,1,"01","02","07","01"]
["01-02-08-00",4,null,11,1,2,8,0,"01","02","08","00"]
["01-03-00-07",5,null,11,1,3,0,7,"01","03","00","07"]
["01-03-01-06",5,null,11,1,3,1,6,"01","03","01","06"]
["01-03-02-05",4,null,11,1,3,2,5,"01","03","02","05"]
["01-03-03-04",4,null,11,1,3,3,4,"01","03","03","04"]
["01-03-04-03",4,null,11,1,3,4,3,"01","03","04","03"]
["01-03-05-02",4,null,11,1,3,5,2,"01","03","05","02"]
["01-03-06-01",4,null,11,1,3,6,1,"01","03","06","01"]
["01-03-07-00",4,null,11,1,3,7,0,"01","03","07","00"]
["01-04-00-06",4,null,11,1,4,0,6,"01","04","00","06"]
["01-04-01-05",4,null,11,1,4,1,5,"01","04","01","05"]
["01-04-02-04",4,null,11,1,4,2,4,"01","04","02","04"]
["01-04-03-03",4,null,11,1,4,3,3,"01","04","03","03"]
["01-04-04-02",4,null,11,1,4,4,2,"01","04","04","02"]
["01-04-05-01",4,null,11,1,4,5,1,"01","04","05","01"]
["01-04-06-00",4,null,11,1,4,6,0,"01","04","06","00"]
["01-05-00-05",3,null,11,1,5,0,5,"01","05","00","05"]
["01-05-01-04",3,null,11,1,5,1,4,"01","05","01","04"]
["01-05-02-03",3,null,11,1,5,2,3,"01","05","02","03"]
["01-05-03-02",3,null,11,1,5,3,2,"01","05","03","02"]
["01-05-04-01",3,null,11,1,5,4,1,"01","05","04","01"]
["01-05-05-00",3,null,11,1,5,5,0,"01","05","05","00"]
["01-06-00-04",3,null,11,1,6,0,4,"01","06","00","04"]
["01-06-01-03",3,null,11,1,6,1,3,"01","06","01","03"]
["01-06-02-02",3,null,11,1,6,2,2,"01","06","02","02"]
["01-06-03-01",3,null,11,1,6,3,1,"01","06","03","01"]
["01-06-04-00",3,null,11,1,6,4,0,"01","06","04","00"]
["01-07-00-03",3,null,11,1,7,0,3,"01","07","00","03"]
["01-07-01-02",3,null,11,1,7,1,2,"01","07","01","02"]
["01-07-02-01",3,null,11,1,7,2,1,"01","07","02","01"]
["01-07-03-00",3,null,11,1,7,3,0,"01","07","03","00"]
["01-08-00-02",3,null,11,1,8,0,2,"01","08","00","02"]
["01-08-01-01",2,null,11,1,8,1,1,"01","08","01","01"]
["01-08-02-00",2,null,11,1,8,2,0,"01","08","02","00"]
["01-09-00-01",2,null,11,1,9,0,1,"01","09","00","01"]
["01-09-01-00",2,null,11,1,9,1,0,"01","09","01","00"]
["01-10-00-00",2,null,11,1,10,0,0,"01","10","00","00"]
["02-00-00-09",5,null,11,2,0,0,9,"02","00","00","09"]
["02-00-01-08",5,null,11,2,0,1,8,"02","00","01","08"]
["02-00-02-07",5,null,11,2,0,2,7,"02","00","02","07"]
["02-00-03-06",5,null,11,2,0,3,6,"02","00","03","06"]
["02-00-04-05",5,null,11,2,0,4,5,"02","00","04","05"]
["02-00-05-04",5,null,11,2,0,5,4,"02","00","05","04"]
["02-00-06-03",4,null,11,2,0,6,3,"02","00","06","03"]
["02-00-07-02",4,null,11,2,0,7,2,"02","00","07","02"]
["02-00-08-01",4,null,11,2,0,8,1,"02","00","08","01"]
["02-00-09-00",4,null,11,2,0,9,0,"02","00","09","00"]
["02-01-00-08",5,null,11,2,1,0,8,"02","01","00","08"]
["02-01-01-07",5,null,11,2,1,1,7,"02","01","01","07"]
[{"$f":"I1159&\"-\"&J1159&\"-\"&K1159&\"-\"&L1159","v":"02-01-02-06"},5,null,11,2,1,2,6,"02","01","02","06"]
["02-01-03-05",4,null,11,2,1,3,5,{"$f":"IF(LEN(E1160)=1,0&E1160,IF(LEN(E1160)=0,\"00\",RIGHT(E1160,2)))","v":"02"},{"$f":"IF(LEN(F1160)=1,0&F1160,IF(LEN(F1160)=0,\"00\",RIGHT(F1160,2)))","v":"01"},{"$f":"IF(LEN(G1160)=1,0&G1160,IF(LEN(G1160)=0,\"00\",RIGHT(G1160,2)))","v":"03"},{"$f":"IF(LEN(H1160)=1,0&H1160,IF(LEN(H1160)=0,\"00\",RIGHT(H1160,2)))","v":"05"}]
["02-01-04-04",4,null,11,2,1,4,4,"02","01","04","04"]
["02-01-05-03",4,null,11,2,1,5,3,"02","01","05","03"]
["02-01-06-02",4,null,11,2,1,6,2,"02","01","06","02"]
["02-01-07-01",4,null,11,2,1,7,1,"02","01","07","01"]
["02-01-08-00",4,null,11,2,1,8,0,"02","01","08","00"]
["02-02-00-07",5,null,11,2,2,0,7,"02","02","00","07"]
["02-02-01-06",4,null,11,2,2,1,6,"02","02","01","06"]
["02-02-02-05",4,null,11,2,2,2,5,"02","02","02","05"]
["02-02-03-04",4,null,11,2,2,3,4,"02","02","03","04"]
["02-02-04-03",4,null,11,2,2,4,3,"02","02","04","03"]
["02-02-05-02",4,null,11,2,2,5,2,"02","02","05","02"]
["02-02-06-01",4,null,11,2,2,6,1,"02","02","06","01"]
["02-02-07-00",4,null,11,2,2,7,0,"02","02","07","00"]
["02-03-00-06",4,null,11,2,3,0,6,"02","03","00","06"]
["02-03-01-05",4,null,11,2,3,1,5,"02","03","01","05"]
["02-03-02-04",4,null,11,2,3,2,4,"02","03","02","04"]
["02-03-03-03",4,null,11,2,3,3,3,"02","03","03","03"]
["02-03-04-02",4,null,11,2,3,4,2,"02","03","04","02"]
["02-03-05-01",4,null,11,2,3,5,1,"02","03","05","01"]
["02-03-06-00",4,null,11,2,3,6,0,"02","03","06","00"]
["02-04-00-05",3,null,11,2,4,0,5,"02","04","00","05"]
["02-04-01-04",3,null,11,2,4,1,4,"02","04","01","04"]
["02-04-02-03",3,null,11,2,4,2,3,"02","04","02","03"]
["02-04-03-02",3,null,11,2,4,3,2,"02","04","03","02"]
["02-04-04-01",3,null,11,2,4,4,1,"02","04","04","01"]
["02-04-05-00",3,null,11,2,4,5,0,"02","04","05","00"]
["02-05-00-04",3,null,11,2,5,0,4,"02","05","00","04"]
["02-05-01-03",3,null,11,2,5,1,3,"02","05","01","03"]
["02-05-02-02",3,null,11,2,5,2,2,"02","05","02","02"]
["02-05-03-01",3,null,11,2,5,3,1,"02","05","03","01"]
["02-05-04-00",3,null,11,2,5,4,0,"02","05","04","00"]
["02-06-00-03",3,null,11,2,6,0,3,"02","06","00","03"]
["02-06-01-02",3,null,11,2,6,1,2,"02","06","01","02"]
["02-06-02-01",3,null,11,2,6,2,1,"02","06","02","01"]
["02-06-03-00",3,null,11,2,6,3,0,"02","06","03","00"]
["02-07-00-02",2,null,11,2,7,0,2,"02","07","00","02"]
["02-07-01-01",2,null,11,2,7,1,1,"02","07","01","01"]
["02-07-02-00",2,null,11,2,7,2,0,"02","07","02","00"]
["02-08-00-01",2,null,11,2,8,0,1,"02","08","00","01"]
["02-08-01-00",2,null,11,2,8,1,0,"02","08","01","00"]
["02-09-00-00",2,null,11,2,9,0,0,"02","09","00","00"]
["03-00-00-08",5,null,11,3,0,0,8,"03","00","00","08"]
["03-00-01-07",5,null,11,3,0,1,7,"03","00","01","07"]
["03-00-02-06",4,null,11,3,0,2,6,"03","00","02","06"]
["03-00-03-05",4,null,11,3,0,3,5,"03","00","03","05"]
["03-00-04-04",4,null,11,3,0,4,4,"03","00","04","04"]
["03-00-05-03",4,null,11,3,0,5,3,"03","00","05","03"]
["03-00-06-02",4,null,11,3,0,6,2,"03","00","06","02"]
["03-00-07-01",4,null,11,3,0,7,1,"03","00","07","01"]
["03-00-08-00",4,null,11,3,0,8,0,"03","00","08","00"]
["03-01-00-07",4,null,11,3,1,0,7,"03","01","00","07"]
["03-01-01-06",4,null,11,3,1,1,6,"03","01","01","06"]
["03-01-02-05",4,null,11,3,1,2,5,"03","01","02","05"]
["03-01-03-04",4,null,11,3,1,3,4,"03","01","03","04"]
["03-01-04-03",4,null,11,3,1,4,3,"03","01","04","03"]
["03-01-05-02",4,null,11,3,1,5,2,"03","01","05","02"]
["03-01-06-01",4,null,11,3,1,6,1,"03","01","06","01"]
["03-01-07-00",4,null,11,3,1,7,0,"03","01","07","00"]
["03-02-00-06",4,null,11,3,2,0,6,"03","02","00","06"]
["03-02-01-05",4,null,11,3,2,1,5,"03","02","01","05"]
["03-02-02-04",4,null,11,3,2,2,4,"03","02","02","04"]
["03-02-03-03",4,null,11,3,2,3,3,"03","02","03","03"]
[{"$f":"I1223&\"-\"&J1223&\"-\"&K1223&\"-\"&L1223","v":"03-02-04-02"},4,null,11,3,2,4,2,"03","02","04","02"]
["03-02-05-01",4,null,11,3,2,5,1,{"$f":"IF(LEN(E1224)=1,0&E1224,IF(LEN(E1224)=0,\"00\",RIGHT(E1224,2)))","v":"03"},{"$f":"IF(LEN(F1224)=1,0&F1224,IF(LEN(F1224)=0,\"00\",RIGHT(F1224,2)))","v":"02"},{"$f":"IF(LEN(G1224)=1,0&G1224,IF(LEN(G1224)=0,\"00\",RIGHT(G1224,2)))","v":"05"},{"$f":"IF(LEN(H1224)=1,0&H1224,IF(LEN(H1224)=0,\"00\",RIGHT(H1224,2)))","v":"01"}]
["03-02-06-00",4,null,11,3,2,6,0,"03","02","06","00"]
["03-03-00-05",3,null,11,3,3,0,5,"03","03","00","05"]
["03-03-01-04",3,null,11,3,3,1,4,"03","03","01","04"]
["03-03-02-03",3,null,11,3,3,2,3,"03","03","02","03"]
["03-03-03-02",3,null,11,3,3,3,2,"03","03","03","02"]
["03-03-04-01",3,null,11,3,3,4,1,"03","03","04","01"]
["03-03-05-00",3,null,11,3,3,5,0,"03","03","05","00"]
["03-04-00-04",3,null,11,3,4,0,4,"03","04","00","04"]
["03-04-01-03",3,null,11,3,4,1,3,"03","04","01","03"]
["03-04-02-02",3,null,11,3,4,2,2,"03","04","02","02"]
["03-04-03-01",3,null,11,3,4,3,1,"03","04","03","01"]
["03-04-04-00",3,null,11,3,4,4,0,"03","04","04","00"]
["03-05-00-03",3,null,11,3,5,0,3,"03","05","00","03"]
["03-05-01-02",3,null,11,3,5,1,2,"03","05","01","02"]
["03-05-02-01",3,null,11,3,5,2,1,"03","05","02","01"]
["03-05-03-00",3,null,11,3,5,3,0,"03","05","03","00"]
["03-06-00-02",2,null,11,3,6,0,2,"03","06","00","02"]
["03-06-01-01",2,null,11,3,6,1,1,"03","06","01","01"]
["03-06-02-00",2,null,11,3,6,2,0,"03","06","02","00"]
["03-07-00-01",2,null,11,3,7,0,1,"03","07","00","01"]
["03-07-01-00",2,null,11,3,7,1,0,"03","07","01","00"]
["03-08-00-00",2,null,11,3,8,0,0,"03","08","00","00"]
["04-00-00-07",4,null,11,4,0,0,7,"04","00","00","07"]
["04-00-01-06",4,null,11,4,0,1,6,"04","00","01","06"]
["04-00-02-05",4,null,11,4,0,2,5,"04","00","02","05"]
["04-00-03-04",4,null,11,4,0,3,4,"04","00","03","04"]
["04-00-04-03",4,null,11,4,0,4,3,"04","00","04","03"]
["04-00-05-02",4,null,11,4,0,5,2,"04","00","05","02"]
["04-00-06-01",4,null,11,4,0,6,1,"04","00","06","01"]
["04-00-07-00",4,null,11,4,0,7,0,"04","00","07","00"]
["04-01-00-06",4,null,11,4,1,0,6,"04","01","00","06"]
["04-01-01-05",4,null,11,4,1,1,5,"04","01","01","05"]
["04-01-02-04",4,null,11,4,1,2,4,"04","01","02","04"]
["04-01-03-03",4,null,11,4,1,3,3,"04","01","03","03"]
["04-01-04-02",4,null,11,4,1,4,2,"04","01","04","02"]
["04-01-05-01",4,null,11,4,1,5,1,"04","01","05","01"]
["04-01-06-00",3,null,11,4,1,6,0,"04","01","06","00"]
["04-02-00-05",3,null,11,4,2,0,5,"04","02","00","05"]
["04-02-01-04",3,null,11,4,2,1,4,"04","02","01","04"]
["04-02-02-03",3,null,11,4,2,2,3,"04","02","02","03"]
["04-02-03-02",3,null,11,4,2,3,2,"04","02","03","02"]
["04-02-04-01",3,null,11,4,2,4,1,"04","02","04","01"]
["04-02-05-00",3,null,11,4,2,5,0,"04","02","05","00"]
["04-03-00-04",3,null,11,4,3,0,4,"04","03","00","04"]
["04-03-01-03",3,null,11,4,3,1,3,"04","03","01","03"]
["04-03-02-02",3,null,11,4,3,2,2,"04","03","02","02"]
["04-03-03-01",3,null,11,4,3,3,1,"04","03","03","01"]
["04-03-04-00",3,null,11,4,3,4,0,"04","03","04","00"]
["04-04-00-03",3,null,11,4,4,0,3,"04","04","00","03"]
["04-04-01-02",3,null,11,4,4,1,2,"04","04","01","02"]
["04-04-02-01",3,null,11,4,4,2,1,"04","04","02","01"]
["04-04-03-00",3,null,11,4,4,3,0,"04","04","03","00"]
["04-05-00-02",2,null,11,4,5,0,2,"04","05","00","02"]
["04-05-01-01",2,null,11,4,5,1,1,"04","05","01","01"]
["04-05-02-00",2,null,11,4,5,2,0,"04","05","02","00"]
["04-06-00-01",2,null,11,4,6,0,1,"04","06","00","01"]
["04-06-01-00",2,null,11,4,6,1,0,"04","06","01","00"]
["04-07-00-00",2,null,11,4,7,0,0,"04","07","00","00"]
["05-00-00-06",4,null,11,5,0,0,6,"05","00","00","06"]
["05-00-01-05",4,null,11,5,0,1,5,"05","00","01","05"]
["05-00-02-04",4,null,11,5,0,2,4,"05","00","02","04"]
["05-00-03-03",4,null,11,5,0,3,3,"05","00","03","03"]
[{"$f":"I1287&\"-\"&J1287&\"-\"&K1287&\"-\"&L1287","v":"05-00-04-02"},4,null,11,5,0,4,2,"05","00","04","02"]
["05-00-05-01",3,null,11,5,0,5,1,{"$f":"IF(LEN(E1288)=1,0&E1288,IF(LEN(E1288)=0,\"00\",RIGHT(E1288,2)))","v":"05"},{"$f":"IF(LEN(F1288)=1,0&F1288,IF(LEN(F1288)=0,\"00\",RIGHT(F1288,2)))","v":"00"},{"$f":"IF(LEN(G1288)=1,0&G1288,IF(LEN(G1288)=0,\"00\",RIGHT(G1288,2)))","v":"05"},{"$f":"IF(LEN(H1288)=1,0&H1288,IF(LEN(H1288)=0,\"00\",RIGHT(H1288,2)))","v":"01"}]
["05-00-06-00",3,null,11,5,0,6,0,"05","00","06","00"]
["05-01-00-05",3,null,11,5,1,0,5,"05","01","00","05"]
["05-01-01-04",3,null,11,5,1,1,4,"05","01","01","04"]
["05-01-02-03",3,null,11,5,1,2,3,"05","01","02","03"]
["05-01-03-02",3,null,11,5,1,3,2,"05","01","03","02"]
["05-01-04-01",3,null,11,5,1,4,1,"05","01","04","01"]
["05-01-05-00",3,null,11,5,1,5,0,"05","01","05","00"]
["05-02-00-04",3,null,11,5,2,0,4,"05","02","00","04"]
["05-02-01-03",3,null,11,5,2,1,3,"05","02","01","03"]
["05-02-02-02",3,null,11,5,2,2,2,"05","02","02","02"]
["05-02-03-01",3,null,11,5,2,3,1,"05","02","03","01"]
["05-02-04-00",3,null,11,5,2,4,0,"05","02","04","00"]
["05-03-00-03",3,null,11,5,3,0,3,"05","03","00","03"]
["05-03-01-02",3,null,11,5,3,1,2,"05","03","01","02"]
["05-03-02-01",3,null,11,5,3,2,1,"05","03","02","01"]
["05-03-03-00",3,null,11,5,3,3,0,"05","03","03","00"]
["05-04-00-02",2,null,11,5,4,0,2,"05","04","00","02"]
["05-04-01-01",2,null,11,5,4,1,1,"05","04","01","01"]
["05-04-02-00",2,null,11,5,4,2,0,"05","04","02","00"]
["05-05-00-01",2,null,11,5,5,0,1,"05","05","00","01"]
["05-05-01-00",2,null,11,5,5,1,0,"05","05","01","00"]
["05-06-00-00",2,null,11,5,6,0,0,"05","06","00","00"]
["06-00-00-05",3,null,11,6,0,0,5,"06","00","00","05"]
["06-00-01-04",3,null,11,6,0,1,4,"06","00","01","04"]
["06-00-02-03",3,null,11,6,0,2,3,"06","00","02","03"]
["06-00-03-02",3,null,11,6,0,3,2,"06","00","03","02"]
["06-00-04-01",3,null,11,6,0,4,1,"06","00","04","01"]
["06-00-05-00",3,null,11,6,0,5,0,"06","00","05","00"]
["06-01-00-04",3,null,11,6,1,0,4,"06","01","00","04"]
["06-01-01-03",3,null,11,6,1,1,3,"06","01","01","03"]
["06-01-02-02",3,null,11,6,1,2,2,"06","01","02","02"]
["06-01-03-01",3,null,11,6,1,3,1,"06","01","03","01"]
["06-01-04-00",3,null,11,6,1,4,0,"06","01","04","00"]
["06-02-00-03",3,null,11,6,2,0,3,"06","02","00","03"]
["06-02-01-02",3,null,11,6,2,1,2,"06","02","01","02"]
["06-02-02-01",3,null,11,6,2,2,1,"06","02","02","01"]
["06-02-03-00",3,null,11,6,2,3,0,"06","02","03","00"]
["06-03-00-02",2,null,11,6,3,0,2,"06","03","00","02"]
["06-03-01-01",2,null,11,6,3,1,1,"06","03","01","01"]
["06-03-02-00",2,null,11,6,3,2,0,"06","03","02","00"]
["06-04-00-01",2,null,11,6,4,0,1,"06","04","00","01"]
["06-04-01-00",2,null,11,6,4,1,0,"06","04","01","00"]
["06-05-00-00",2,null,11,6,5,0,0,"06","05","00","00"]
["07-00-00-04",3,null,11,7,0,0,4,"07","00","00","04"]
["07-00-01-03",3,null,11,7,0,1,3,"07","00","01","03"]
["07-00-02-02",3,null,11,7,0,2,2,"07","00","02","02"]
["07-00-03-01",3,null,11,7,0,3,1,"07","00","03","01"]
["07-00-04-00",3,null,11,7,0,4,0,"07","00","04","00"]
["07-01-00-03",3,null,11,7,1,0,3,"07","01","00","03"]
["07-01-01-02",3,null,11,7,1,1,2,"07","01","01","02"]
["07-01-02-01",3,null,11,7,1,2,1,"07","01","02","01"]
["07-01-03-00",3,null,11,7,1,3,0,"07","01","03","00"]
["07-02-00-02",2,null,11,7,2,0,2,"07","02","00","02"]
["07-02-01-01",2,null,11,7,2,1,1,"07","02","01","01"]
["07-02-02-00",2,null,11,7,2,2,0,"07","02","02","00"]
["07-03-00-01",2,null,11,7,3,0,1,"07","03","00","01"]
["07-03-01-00",2,null,11,7,3,1,0,"07","03","01","00"]
["07-04-00-00",2,null,11,7,4,0,0,"07","04","00","00"]
["08-00-00-03",3,null,11,8,0,0,3,"08","00","00","03"]
["08-00-01-02",3,null,11,8,0,1,2,"08","00","01","02"]
["08-00-02-01",3,null,11,8,0,2,1,"08","00","02","01"]
["08-00-03-00",3,null,11,8,0,3,0,"08","00","03","00"]
[{"$f":"I1351&\"-\"&J1351&\"-\"&K1351&\"-\"&L1351","v":"08-01-00-02"},2,null,11,8,1,0,2,"08","01","00","02"]
["08-01-01-01",2,null,11,8,1,1,1,{"$f":"IF(LEN(E1352)=1,0&E1352,IF(LEN(E1352)=0,\"00\",RIGHT(E1352,2)))","v":"08"},{"$f":"IF(LEN(F1352)=1,0&F1352,IF(LEN(F1352)=0,\"00\",RIGHT(F1352,2)))","v":"01"},{"$f":"IF(LEN(G1352)=1,0&G1352,IF(LEN(G1352)=0,\"00\",RIGHT(G1352,2)))","v":"01"},{"$f":"IF(LEN(H1352)=1,0&H1352,IF(LEN(H1352)=0,\"00\",RIGHT(H1352,2)))","v":"01"}]
["08-01-02-00",2,null,11,8,1,2,0,"08","01","02","00"]
["08-02-00-01",2,null,11,8,2,0,1,"08","02","00","01"]
["08-02-01-00",2,null,11,8,2,1,0,"08","02","01","00"]
["08-03-00-00",2,null,11,8,3,0,0,"08","03","00","00"]
["09-00-00-02",2,null,11,9,0,0,2,"09","00","00","02"]
["09-00-01-01",2,null,11,9,0,1,1,"09","00","01","01"]
["09-00-02-00",2,null,11,9,0,2,0,"09","00","02","00"]
["09-01-00-01",2,null,11,9,1,0,1,"09","01","00","01"]
["09-01-01-00",2,null,11,9,1,1,0,"09","01","01","00"]
["09-02-00-00",2,null,11,9,2,0,0,"09","02","00","00"]
["10-00-00-01",2,null,11,10,0,0,1,"10","00","00","01"]
["10-00-01-00",2,null,11,10,0,1,0,"10","00","01","00"]
["10-01-00-00",2,null,11,10,1,0,0,"10","01","00","00"]
["11-00-00-00",1,null,11,11,0,0,0,"11","00","00","00"]
["00-00-00-12",7,null,12,0,0,0,12,"00","00","00","12"]
["00-00-01-11",6,null,12,0,0,1,11,"00","00","01","11"]
["00-00-02-10",6,null,12,0,0,2,10,"00","00","02","10"]
["00-00-03-09",6,null,12,0,0,3,9,"00","00","03","09"]
["00-00-04-08",6,null,12,0,0,4,8,"00","00","04","08"]
["00-00-05-07",6,null,12,0,0,5,7,"00","00","05","07"]
["00-00-06-06",6,null,12,0,0,6,6,"00","00","06","06"]
["00-00-07-05",5,null,12,0,0,7,5,"00","00","07","05"]
["00-00-08-04",5,null,12,0,0,8,4,"00","00","08","04"]
["00-00-09-03",5,null,12,0,0,9,3,"00","00","09","03"]
["00-00-10-02",4,null,12,0,0,10,2,"00","00","10","02"]
["00-00-11-01",4,null,12,0,0,11,1,"00","00","11","01"]
["00-00-12-00",4,null,12,0,0,12,0,"00","00","12","00"]
["00-01-00-11",5,null,12,0,1,0,11,"00","01","00","11"]
["00-01-01-10",5,null,12,0,1,1,10,"00","01","01","10"]
["00-01-02-09",5,null,12,0,1,2,9,"00","01","02","09"]
["00-01-03-08",5,null,12,0,1,3,8,"00","01","03","08"]
["00-01-04-07",5,null,12,0,1,4,7,"00","01","04","07"]
["00-01-05-06",5,null,12,0,1,5,6,"00","01","05","06"]
["00-01-06-05",5,null,12,0,1,6,5,"00","01","06","05"]
["00-01-07-04",5,null,12,0,1,7,4,"00","01","07","04"]
["00-01-08-03",5,null,12,0,1,8,3,"00","01","08","03"]
["00-01-09-02",4,null,12,0,1,9,2,"00","01","09","02"]
["00-01-10-01",4,null,12,0,1,10,1,"00","01","10","01"]
["00-01-11-00",4,null,12,0,1,11,0,"00","01","11","00"]
["00-02-00-10",5,null,12,0,2,0,10,"00","02","00","10"]
["00-02-01-09",5,null,12,0,2,1,9,"00","02","01","09"]
["00-02-02-08",5,null,12,0,2,2,8,"00","02","02","08"]
["00-02-03-07",5,null,12,0,2,3,7,"00","02","03","07"]
["00-02-04-06",5,null,12,0,2,4,6,"00","02","04","06"]
["00-02-05-05",5,null,12,0,2,5,5,"00","02","05","05"]
["00-02-06-04",5,null,12,0,2,6,4,"00","02","06","04"]
["00-02-07-03",5,null,12,0,2,7,3,"00","02","07","03"]
["00-02-08-02",4,null,12,0,2,8,2,"00","02","08","02"]
["00-02-09-01",4,null,12,0,2,9,1,"00","02","09","01"]
["00-02-10-00",4,null,12,0,2,10,0,"00","02","10","00"]
["00-03-00-09",5,null,12,0,3,0,9,"00","03","00","09"]
["00-03-01-08",5,null,12,0,3,1,8,"00","03","01","08"]
["00-03-02-07",5,null,12,0,3,2,7,"00","03","02","07"]
["00-03-03-06",5,null,12,0,3,3,6,"00","03","03","06"]
["00-03-04-05",5,null,12,0,3,4,5,"00","03","04","05"]
["00-03-05-04",5,null,12,0,3,5,4,"00","03","05","04"]
["00-03-06-03",5,null,12,0,3,6,3,"00","03","06","03"]
["00-03-07-02",4,null,12,0,3,7,2,"00","03","07","02"]
["00-03-08-01",4,null,12,0,3,8,1,"00","03","08","01"]
["00-03-09-00",4,null,12,0,3,9,0,"00","03","09","00"]
["00-04-00-08",5,null,12,0,4,0,8,"00","04","00","08"]
["00-04-01-07",5,null,12,0,4,1,7,"00","04","01","07"]
[{"$f":"I1415&\"-\"&J1415&\"-\"&K1415&\"-\"&L1415","v":"00-04-02-06"},5,null,12,0,4,2,6,"00","04","02","06"]
["00-04-03-05",5,null,12,0,4,3,5,{"$f":"IF(LEN(E1416)=1,0&E1416,IF(LEN(E1416)=0,\"00\",RIGHT(E1416,2)))","v":"00"},{"$f":"IF(LEN(F1416)=1,0&F1416,IF(LEN(F1416)=0,\"00\",RIGHT(F1416,2)))","v":"04"},{"$f":"IF(LEN(G1416)=1,0&G1416,IF(LEN(G1416)=0,\"00\",RIGHT(G1416,2)))","v":"03"},{"$f":"IF(LEN(H1416)=1,0&H1416,IF(LEN(H1416)=0,\"00\",RIGHT(H1416,2)))","v":"05"}]
["00-04-04-04",5,null,12,0,4,4,4,"00","04","04","04"]
["00-04-05-03",4,null,12,0,4,5,3,"00","04","05","03"]
["00-04-06-02",4,null,12,0,4,6,2,"00","04","06","02"]
["00-04-07-01",4,null,12,0,4,7,1,"00","04","07","01"]
["00-04-08-00",4,null,12,0,4,8,0,"00","04","08","00"]
["00-05-00-07",5,null,12,0,5,0,7,"00","05","00","07"]
["00-05-01-06",5,null,12,0,5,1,6,"00","05","01","06"]
["00-05-02-05",5,null,12,0,5,2,5,"00","05","02","05"]
["00-05-03-04",4,null,12,0,5,3,4,"00","05","03","04"]
["00-05-04-03",4,null,12,0,5,4,3,"00","05","04","03"]
["00-05-05-02",4,null,12,0,5,5,2,"00","05","05","02"]
["00-05-06-01",4,null,12,0,5,6,1,"00","05","06","01"]
["00-05-07-00",4,null,12,0,5,7,0,"00","05","07","00"]
["00-06-00-06",4,null,12,0,6,0,6,"00","06","00","06"]
["00-06-01-05",4,null,12,0,6,1,5,"00","06","01","05"]
["00-06-02-04",4,null,12,0,6,2,4,"00","06","02","04"]
["00-06-03-03",4,null,12,0,6,3,3,"00","06","03","03"]
["00-06-04-02",4,null,12,0,6,4,2,"00","06","04","02"]
["00-06-05-01",4,null,12,0,6,5,1,"00","06","05","01"]
["00-06-06-00",4,null,12,0,6,6,0,"00","06","06","00"]
["00-07-00-05",3,null,12,0,7,0,5,"00","07","00","05"]
["00-07-01-04",3,null,12,0,7,1,4,"00","07","01","04"]
["00-07-02-03",3,null,12,0,7,2,3,"00","07","02","03"]
["00-07-03-02",3,null,12,0,7,3,2,"00","07","03","02"]
["00-07-04-01",3,null,12,0,7,4,1,"00","07","04","01"]
["00-07-05-00",3,null,12,0,7,5,0,"00","07","05","00"]
["00-08-00-04",3,null,12,0,8,0,4,"00","08","00","04"]
["00-08-01-03",3,null,12,0,8,1,3,"00","08","01","03"]
["00-08-02-02",3,null,12,0,8,2,2,"00","08","02","02"]
["00-08-03-01",3,null,12,0,8,3,1,"00","08","03","01"]
["00-08-04-00",3,null,12,0,8,4,0,"00","08","04","00"]
["00-09-00-03",3,null,12,0,9,0,3,"00","09","00","03"]
["00-09-01-02",3,null,12,0,9,1,2,"00","09","01","02"]
["00-09-02-01",3,null,12,0,9,2,1,"00","09","02","01"]
["00-09-03-00",3,null,12,0,9,3,0,"00","09","03","00"]
["00-10-00-02",3,null,12,0,10,0,2,"00","10","00","02"]
["00-10-01-01",3,null,12,0,10,1,1,"00","10","01","01"]
["00-10-02-00",2,null,12,0,10,2,0,"00","10","02","00"]
["00-11-00-01",2,null,12,0,11,0,1,"00","11","00","01"]
["00-11-01-00",2,null,12,0,11,1,0,"00","11","01","00"]
["00-12-00-00",2,null,12,0,12,0,0,"00","12","00","00"]
["01-00-00-11",5,null,12,1,0,0,11,"01","00","00","11"]
["01-00-01-10",5,null,12,1,0,1,10,"01","00","01","10"]
["01-00-02-09",5,null,12,1,0,2,9,"01","00","02","09"]
["01-00-03-08",5,null,12,1,0,3,8,"01","00","03","08"]
["01-00-04-07",5,null,12,1,0,4,7,"01","00","04","07"]
["01-00-05-06",5,null,12,1,0,5,6,"01","00","05","06"]
["01-00-06-05",5,null,12,1,0,6,5,"01","00","06","05"]
["01-00-07-04",5,null,12,1,0,7,4,"01","00","07","04"]
["01-00-08-03",5,null,12,1,0,8,3,"01","00","08","03"]
["01-00-09-02",4,null,12,1,0,9,2,"01","00","09","02"]
["01-00-10-01",4,null,12,1,0,10,1,"01","00","10","01"]
["01-00-11-00",4,null,12,1,0,11,0,"01","00","11","00"]
["01-01-00-10",5,null,12,1,1,0,10,"01","01","00","10"]
["01-01-01-09",5,null,12,1,1,1,9,"01","01","01","09"]
["01-01-02-08",5,null,12,1,1,2,8,"01","01","02","08"]
["01-01-03-07",5,null,12,1,1,3,7,"01","01","03","07"]
["01-01-04-06",5,null,12,1,1,4,6,"01","01","04","06"]
["01-01-05-05",5,null,12,1,1,5,5,"01","01","05","05"]
["01-01-06-04",5,null,12,1,1,6,4,"01","01","06","04"]
["01-01-07-03",5,null,12,1,1,7,3,"01","01","07","03"]
["01-01-08-02",4,null,12,1,1,8,2,"01","01","08","02"]
[{"$f":"I1479&\"-\"&J1479&\"-\"&K1479&\"-\"&L1479","v":"01-01-09-01"},4,null,12,1,1,9,1,"01","01","09","01"]
["01-01-10-00",4,null,12,1,1,10,0,{"$f":"IF(LEN(E1480)=1,0&E1480,IF(LEN(E1480)=0,\"00\",RIGHT(E1480,2)))","v":"01"},{"$f":"IF(LEN(F1480)=1,0&F1480,IF(LEN(F1480)=0,\"00\",RIGHT(F1480,2)))","v":"01"},{"$f":"IF(LEN(G1480)=1,0&G1480,IF(LEN(G1480)=0,\"00\",RIGHT(G1480,2)))","v":"10"},{"$f":"IF(LEN(H1480)=1,0&H1480,IF(LEN(H1480)=0,\"00\",RIGHT(H1480,2)))","v":"00"}]
["01-02-00-09",5,null,12,1,2,0,9,"01","02","00","09"]
["01-02-01-08",5,null,12,1,2,1,8,"01","02","01","08"]
["01-02-02-07",5,null,12,1,2,2,7,"01","02","02","07"]
["01-02-03-06",5,null,12,1,2,3,6,"01","02","03","06"]
["01-02-04-05",5,null,12,1,2,4,5,"01","02","04","05"]
["01-02-05-04",5,null,12,1,2,5,4,"01","02","05","04"]
["01-02-06-03",4,null,12,1,2,6,3,"01","02","06","03"]
["01-02-07-02",4,null,12,1,2,7,2,"01","02","07","02"]
["01-02-08-01",4,null,12,1,2,8,1,"01","02","08","01"]
["01-02-09-00",4,null,12,1,2,9,0,"01","02","09","00"]
["01-03-00-08",5,null,12,1,3,0,8,"01","03","00","08"]
["01-03-01-07",5,null,12,1,3,1,7,"01","03","01","07"]
["01-03-02-06",5,null,12,1,3,2,6,"01","03","02","06"]
["01-03-03-05",5,null,12,1,3,3,5,"01","03","03","05"]
["01-03-04-04",4,null,12,1,3,4,4,"01","03","04","04"]
["01-03-05-03",4,null,12,1,3,5,3,"01","03","05","03"]
["01-03-06-02",4,null,12,1,3,6,2,"01","03","06","02"]
["01-03-07-01",4,null,12,1,3,7,1,"01","03","07","01"]
["01-03-08-00",4,null,12,1,3,8,0,"01","03","08","00"]
["01-04-00-07",5,null,12,1,4,0,7,"01","04","00","07"]
["01-04-01-06",4,null,12,1,4,1,6,"01","04","01","06"]
["01-04-02-05",4,null,12,1,4,2,5,"01","04","02","05"]
["01-04-03-04",4,null,12,1,4,3,4,"01","04","03","04"]
["01-04-04-03",4,null,12,1,4,4,3,"01","04","04","03"]
["01-04-05-02",4,null,12,1,4,5,2,"01","04","05","02"]
["01-04-06-01",4,null,12,1,4,6,1,"01","04","06","01"]
["01-04-07-00",4,null,12,1,4,7,0,"01","04","07","00"]
["01-05-00-06",4,null,12,1,5,0,6,"01","05","00","06"]
["01-05-01-05",4,null,12,1,5,1,5,"01","05","01","05"]
["01-05-02-04",4,null,12,1,5,2,4,"01","05","02","04"]
["01-05-03-03",4,null,12,1,5,3,3,"01","05","03","03"]
["01-05-04-02",4,null,12,1,5,4,2,"01","05","04","02"]
["01-05-05-01",4,null,12,1,5,5,1,"01","05","05","01"]
["01-05-06-00",4,null,12,1,5,6,0,"01","05","06","00"]
["01-06-00-05",3,null,12,1,6,0,5,"01","06","00","05"]
["01-06-01-04",3,null,12,1,6,1,4,"01","06","01","04"]
["01-06-02-03",3,null,12,1,6,2,3,"01","06","02","03"]
["01-06-03-02",3,null,12,1,6,3,2,"01","06","03","02"]
["01-06-04-01",3,null,12,1,6,4,1,"01","06","04","01"]
["01-06-05-00",3,null,12,1,6,5,0,"01","06","05","00"]
["01-07-00-04",3,null,12,1,7,0,4,"01","07","00","04"]
["01-07-01-03",3,null,12,1,7,1,3,"01","07","01","03"]
["01-07-02-02",3,null,12,1,7,2,2,"01","07","02","02"]
["01-07-03-01",3,null,12,1,7,3,1,"01","07","03","01"]
["01-07-04-00",3,null,12,1,7,4,0,"01","07","04","00"]
["01-08-00-03",3,null,12,1,8,0,3,"01","08","00","03"]
["01-08-01-02",3,null,12,1,8,1,2,"01","08","01","02"]
["01-08-02-01",3,null,12,1,8,2,1,"01","08","02","01"]
["01-08-03-00",3,null,12,1,8,3,0,"01","08","03","00"]
["01-09-00-02",3,null,12,1,9,0,2,"01","09","00","02"]
["01-09-01-01",2,null,12,1,9,1,1,"01","09","01","01"]
["01-09-02-00",2,null,12,1,9,2,0,"01","09","02","00"]
["01-10-00-01",2,null,12,1,10,0,1,"01","10","00","01"]
["01-10-01-00",2,null,12,1,10,1,0,"01","10","01","00"]
["01-11-00-00",2,null,12,1,11,0,0,"01","11","00","00"]
["02-00-00-10",5,null,12,2,0,0,10,"02","00","00","10"]
["02-00-01-09",5,null,12,2,0,1,9,"02","00","01","09"]
["02-00-02-08",5,null,12,2,0,2,8,"02","00","02","08"]
["02-00-03-07",5,null,12,2,0,3,7,"02","00","03","07"]
["02-00-04-06",5,null,12,2,0,4,6,"02","00","04","06"]
["02-00-05-05",5,null,12,2,0,5,5,"02","00","05","05"]
["02-00-06-04",5,null,12,2,0,6,4,"02","00","06","04"]
[{"$f":"I1543&\"-\"&J1543&\"-\"&K1543&\"-\"&L1543","v":"02-00-07-03"},4,null,12,2,0,7,3,"02","00","07","03"]
["02-00-08-02",4,null,12,2,0,8,2,{"$f":"IF(LEN(E1544)=1,0&E1544,IF(LEN(E1544)=0,\"00\",RIGHT(E1544,2)))","v":"02"},{"$f":"IF(LEN(F1544)=1,0&F1544,IF(LEN(F1544)=0,\"00\",RIGHT(F1544,2)))","v":"00"},{"$f":"IF(LEN(G1544)=1,0&G1544,IF(LEN(G1544)=0,\"00\",RIGHT(G1544,2)))","v":"08"},{"$f":"IF(LEN(H1544)=1,0&H1544,IF(LEN(H1544)=0,\"00\",RIGHT(H1544,2)))","v":"02"}]
["02-00-09-01",4,null,12,2,0,9,1,"02","00","09","01"]
["02-00-10-00",4,null,12,2,0,10,0,"02","00","10","00"]
["02-01-00-09",5,null,12,2,1,0,9,"02","01","00","09"]
["02-01-01-08",5,null,12,2,1,1,8,"02","01","01","08"]
["02-01-02-07",5,null,12,2,1,2,7,"02","01","02","07"]
["02-01-03-06",5,null,12,2,1,3,6,"02","01","03","06"]
["02-01-04-05",5,null,12,2,1,4,5,"02","01","04","05"]
["02-01-05-04",4,null,12,2,1,5,4,"02","01","05","04"]
["02-01-06-03",4,null,12,2,1,6,3,"02","01","06","03"]
["02-01-07-02",4,null,12,2,1,7,2,"02","01","07","02"]
["02-01-08-01",4,null,12,2,1,8,1,"02","01","08","01"]
["02-01-09-00",4,null,12,2,1,9,0,"02","01","09","00"]
["02-02-00-08",5,null,12,2,2,0,8,"02","02","00","08"]
["02-02-01-07",5,null,12,2,2,1,7,"02","02","01","07"]
["02-02-02-06",4,null,12,2,2,2,6,"02","02","02","06"]
["02-02-03-05",4,null,12,2,2,3,5,"02","02","03","05"]
["02-02-04-04",4,null,12,2,2,4,4,"02","02","04","04"]
["02-02-05-03",4,null,12,2,2,5,3,"02","02","05","03"]
["02-02-06-02",4,null,12,2,2,6,2,"02","02","06","02"]
["02-02-07-01",4,null,12,2,2,7,1,"02","02","07","01"]
["02-02-08-00",4,null,12,2,2,8,0,"02","02","08","00"]
["02-03-00-07",4,null,12,2,3,0,7,"02","03","00","07"]
["02-03-01-06",4,null,12,2,3,1,6,"02","03","01","06"]
["02-03-02-05",4,null,12,2,3,2,5,"02","03","02","05"]
["02-03-03-04",4,null,12,2,3,3,4,"02","03","03","04"]
["02-03-04-03",4,null,12,2,3,4,3,"02","03","04","03"]
["02-03-05-02",4,null,12,2,3,5,2,"02","03","05","02"]
["02-03-06-01",4,null,12,2,3,6,1,"02","03","06","01"]
["02-03-07-00",4,null,12,2,3,7,0,"02","03","07","00"]
["02-04-00-06",4,null,12,2,4,0,6,"02","04","00","06"]
["02-04-01-05",4,null,12,2,4,1,5,"02","04","01","05"]
["02-04-02-04",4,null,12,2,4,2,4,"02","04","02","04"]
["02-04-03-03",4,null,12,2,4,3,3,"02","04","03","03"]
["02-04-04-02",4,null,12,2,4,4,2,"02","04","04","02"]
["02-04-05-01",4,null,12,2,4,5,1,"02","04","05","01"]
["02-04-06-00",4,null,12,2,4,6,0,"02","04","06","00"]
["02-05-00-05",3,null,12,2,5,0,5,"02","05","00","05"]
["02-05-01-04",3,null,12,2,5,1,4,"02","05","01","04"]
["02-05-02-03",3,null,12,2,5,2,3,"02","05","02","03"]
["02-05-03-02",3,null,12,2,5,3,2,"02","05","03","02"]
["02-05-04-01",3,null,12,2,5,4,1,"02","05","04","01"]
["02-05-05-00",3,null,12,2,5,5,0,"02","05","05","00"]
["02-06-00-04",3,null,12,2,6,0,4,"02","06","00","04"]
["02-06-01-03",3,null,12,2,6,1,3,"02","06","01","03"]
["02-06-02-02",3,null,12,2,6,2,2,"02","06","02","02"]
["02-06-03-01",3,null,12,2,6,3,1,"02","06","03","01"]
["02-06-04-00",3,null,12,2,6,4,0,"02","06","04","00"]
["02-07-00-03",3,null,12,2,7,0,3,"02","07","00","03"]
["02-07-01-02",3,null,12,2,7,1,2,"02","07","01","02"]
["02-07-02-01",2,null,12,2,7,2,1,"02","07","02","01"]
["02-07-03-00",2,null,12,2,7,3,0,"02","07","03","00"]
["02-08-00-02",2,null,12,2,8,0,2,"02","08","00","02"]
["02-08-01-01",2,null,12,2,8,1,1,"02","08","01","01"]
["02-08-02-00",2,null,12,2,8,2,0,"02","08","02","00"]
["02-09-00-01",2,null,12,2,9,0,1,"02","09","00","01"]
["02-09-01-00",2,null,12,2,9,1,0,"02","09","01","00"]
["02-10-00-00",2,null,12,2,10,0,0,"02","10","00","00"]
["03-00-00-09",5,null,12,3,0,0,9,"03","00","00","09"]
["03-00-01-08",5,null,12,3,0,1,8,"03","00","01","08"]
["03-00-02-07",5,null,12,3,0,2,7,"03","00","02","07"]
["03-00-03-06",4,null,12,3,0,3,6,"03","00","03","06"]
["03-00-04-05",4,null,12,3,0,4,5,"03","00","04","05"]
[{"$f":"I1607&\"-\"&J1607&\"-\"&K1607&\"-\"&L1607","v":"03-00-05-04"},4,null,12,3,0,5,4,"03","00","05","04"]
["03-00-06-03",4,null,12,3,0,6,3,{"$f":"IF(LEN(E1608)=1,0&E1608,IF(LEN(E1608)=0,\"00\",RIGHT(E1608,2)))","v":"03"},{"$f":"IF(LEN(F1608)=1,0&F1608,IF(LEN(F1608)=0,\"00\",RIGHT(F1608,2)))","v":"00"},{"$f":"IF(LEN(G1608)=1,0&G1608,IF(LEN(G1608)=0,\"00\",RIGHT(G1608,2)))","v":"06"},{"$f":"IF(LEN(H1608)=1,0&H1608,IF(LEN(H1608)=0,\"00\",RIGHT(H1608,2)))","v":"03"}]
["03-00-07-02",4,null,12,3,0,7,2,"03","00","07","02"]
["03-00-08-01",4,null,12,3,0,8,1,"03","00","08","01"]
["03-00-09-00",4,null,12,3,0,9,0,"03","00","09","00"]
["03-01-00-08",5,null,12,3,1,0,8,"03","01","00","08"]
["03-01-01-07",4,null,12,3,1,1,7,"03","01","01","07"]
["03-01-02-06",4,null,12,3,1,2,6,"03","01","02","06"]
["03-01-03-05",4,null,12,3,1,3,5,"03","01","03","05"]
["03-01-04-04",4,null,12,3,1,4,4,"03","01","04","04"]
["03-01-05-03",4,null,12,3,1,5,3,"03","01","05","03"]
["03-01-06-02",4,null,12,3,1,6,2,"03","01","06","02"]
["03-01-07-01",4,null,12,3,1,7,1,"03","01","07","01"]
["03-01-08-00",4,null,12,3,1,8,0,"03","01","08","00"]
["03-02-00-07",4,null,12,3,2,0,7,"03","02","00","07"]
["03-02-01-06",4,null,12,3,2,1,6,"03","02","01","06"]
["03-02-02-05",4,null,12,3,2,2,5,"03","02","02","05"]
["03-02-03-04",4,null,12,3,2,3,4,"03","02","03","04"]
["03-02-04-03",4,null,12,3,2,4,3,"03","02","04","03"]
["03-02-05-02",4,null,12,3,2,5,2,"03","02","05","02"]
["03-02-06-01",4,null,12,3,2,6,1,"03","02","06","01"]
["03-02-07-00",4,null,12,3,2,7,0,"03","02","07","00"]
["03-03-00-06",4,null,12,3,3,0,6,"03","03","00","06"]
["03-03-01-05",4,null,12,3,3,1,5,"03","03","01","05"]
["03-03-02-04",4,null,12,3,3,2,4,"03","03","02","04"]
["03-03-03-03",4,null,12,3,3,3,3,"03","03","03","03"]
["03-03-04-02",4,null,12,3,3,4,2,"03","03","04","02"]
["03-03-05-01",4,null,12,3,3,5,1,"03","03","05","01"]
["03-03-06-00",4,null,12,3,3,6,0,"03","03","06","00"]
["03-04-00-05",3,null,12,3,4,0,5,"03","04","00","05"]
["03-04-01-04",3,null,12,3,4,1,4,"03","04","01","04"]
["03-04-02-03",3,null,12,3,4,2,3,"03","04","02","03"]
["03-04-03-02",3,null,12,3,4,3,2,"03","04","03","02"]
["03-04-04-01",3,null,12,3,4,4,1,"03","04","04","01"]
["03-04-05-00",3,null,12,3,4,5,0,"03","04","05","00"]
["03-05-00-04",3,null,12,3,5,0,4,"03","05","00","04"]
["03-05-01-03",3,null,12,3,5,1,3,"03","05","01","03"]
["03-05-02-02",3,null,12,3,5,2,2,"03","05","02","02"]
["03-05-03-01",3,null,12,3,5,3,1,"03","05","03","01"]
["03-05-04-00",3,null,12,3,5,4,0,"03","05","04","00"]
["03-06-00-03",3,null,12,3,6,0,3,"03","06","00","03"]
["03-06-01-02",2,null,12,3,6,1,2,"03","06","01","02"]
["03-06-02-01",3,null,12,3,6,2,1,"03","06","02","01"]
["03-06-03-00",2,null,12,3,6,3,0,"03","06","03","00"]
["03-07-00-02",2,null,12,3,7,0,2,"03","07","00","02"]
["03-07-01-01",2,null,12,3,7,1,1,"03","07","01","01"]
["03-07-02-00",2,null,12,3,7,2,0,"03","07","02","00"]
["03-08-00-01",2,null,12,3,8,0,1,"03","08","00","01"]
["03-08-01-00",2,null,12,3,8,1,0,"03","08","01","00"]
["03-09-00-00",2,null,12,3,9,0,0,"03","09","00","00"]
["04-00-00-08",4,null,12,4,0,0,8,"04","00","00","08"]
["04-00-01-07",4,null,12,4,0,1,7,"04","00","01","07"]
["04-00-02-06",4,null,12,4,0,2,6,"04","00","02","06"]
["04-00-03-05",4,null,12,4,0,3,5,"04","00","03","05"]
["04-00-04-04",4,null,12,4,0,4,4,"04","00","04","04"]
["04-00-05-03",4,null,12,4,0,5,3,"04","00","05","03"]
["04-00-06-02",4,null,12,4,0,6,2,"04","00","06","02"]
["04-00-07-01",4,null,12,4,0,7,1,"04","00","07","01"]
["04-00-08-00",4,null,12,4,0,8,0,"04","00","08","00"]
["04-01-00-07",4,null,12,4,1,0,7,"04","01","00","07"]
["04-01-01-06",4,null,12,4,1,1,6,"04","01","01","06"]
["04-01-02-05",4,null,12,4,1,2,5,"04","01","02","05"]
["04-01-03-04",4,null,12,4,1,3,4,"04","01","03","04"]
["04-01-04-03",4,null,12,4,1,4,3,"04","01","04","03"]
[{"$f":"I1671&\"-\"&J1671&\"-\"&K1671&\"-\"&L1671","v":"04-01-05-02"},4,null,12,4,1,5,2,"04","01","05","02"]
["04-01-06-01",4,null,12,4,1,6,1,{"$f":"IF(LEN(E1672)=1,0&E1672,IF(LEN(E1672)=0,\"00\",RIGHT(E1672,2)))","v":"04"},{"$f":"IF(LEN(F1672)=1,0&F1672,IF(LEN(F1672)=0,\"00\",RIGHT(F1672,2)))","v":"01"},{"$f":"IF(LEN(G1672)=1,0&G1672,IF(LEN(G1672)=0,\"00\",RIGHT(G1672,2)))","v":"06"},{"$f":"IF(LEN(H1672)=1,0&H1672,IF(LEN(H1672)=0,\"00\",RIGHT(H1672,2)))","v":"01"}]
["04-01-07-00",4,null,12,4,1,7,0,"04","01","07","00"]
["04-02-00-06",4,null,12,4,2,0,6,"04","02","00","06"]
["04-02-01-05",4,null,12,4,2,1,5,"04","02","01","05"]
["04-02-02-04",4,null,12,4,2,2,4,"04","02","02","04"]
["04-02-03-03",4,null,12,4,2,3,3,"04","02","03","03"]
["04-02-04-02",4,null,12,4,2,4,2,"04","02","04","02"]
["04-02-05-01",4,null,12,4,2,5,1,"04","02","05","01"]
["04-02-06-00",3,null,12,4,2,6,0,"04","02","06","00"]
["04-03-00-05",3,null,12,4,3,0,5,"04","03","00","05"]
["04-03-01-04",3,null,12,4,3,1,4,"04","03","01","04"]
["04-03-02-03",3,null,12,4,3,2,3,"04","03","02","03"]
["04-03-03-02",3,null,12,4,3,3,2,"04","03","03","02"]
["04-03-04-01",3,null,12,4,3,4,1,"04","03","04","01"]
["04-03-05-00",3,null,12,4,3,5,0,"04","03","05","00"]
["04-04-00-04",3,null,12,4,4,0,4,"04","04","00","04"]
["04-04-01-03",3,null,12,4,4,1,3,"04","04","01","03"]
["04-04-02-02",3,null,12,4,4,2,2,"04","04","02","02"]
["04-04-03-01",3,null,12,4,4,3,1,"04","04","03","01"]
["04-04-04-00",3,null,12,4,4,4,0,"04","04","04","00"]
["04-05-00-03",3,null,12,4,5,0,3,"04","05","00","03"]
["04-05-01-02",2,null,12,4,5,1,2,"04","05","01","02"]
["04-05-02-01",2,null,12,4,5,2,1,"04","05","02","01"]
["04-05-03-00",2,null,12,4,5,3,0,"04","05","03","00"]
["04-06-00-02",2,null,12,4,6,0,2,"04","06","00","02"]
["04-06-01-01",2,null,12,4,6,1,1,"04","06","01","01"]
["04-06-02-00",2,null,12,4,6,2,0,"04","06","02","00"]
["04-07-00-01",2,null,12,4,7,0,1,"04","07","00","01"]
["04-07-01-00",2,null,12,4,7,1,0,"04","07","01","00"]
["04-08-00-00",2,null,12,4,8,0,0,"04","08","00","00"]
["05-00-00-07",4,null,12,5,0,0,7,"05","00","00","07"]
["05-00-01-06",4,null,12,5,0,1,6,"05","00","01","06"]
["05-00-02-05",4,null,12,5,0,2,5,"05","00","02","05"]
["05-00-03-04",4,null,12,5,0,3,4,"05","00","03","04"]
["05-00-04-03",4,null,12,5,0,4,3,"05","00","04","03"]
["05-00-05-02",4,null,12,5,0,5,2,"05","00","05","02"]
["05-00-06-01",4,null,12,5,0,6,1,"05","00","06","01"]
["05-00-07-00",3,null,12,5,0,7,0,"05","00","07","00"]
["05-01-00-06",4,null,12,5,1,0,6,"05","01","00","06"]
["05-01-01-05",4,null,12,5,1,1,5,"05","01","01","05"]
["05-01-02-04",4,null,12,5,1,2,4,"05","01","02","04"]
["05-01-03-03",4,null,12,5,1,3,3,"05","01","03","03"]
["05-01-04-02",4,null,12,5,1,4,2,"05","01","04","02"]
["05-01-05-01",3,null,12,5,1,5,1,"05","01","05","01"]
["05-01-06-00",3,null,12,5,1,6,0,"05","01","06","00"]
["05-02-00-05",3,null,12,5,2,0,5,"05","02","00","05"]
["05-02-01-04",3,null,12,5,2,1,4,"05","02","01","04"]
["05-02-02-03",3,null,12,5,2,2,3,"05","02","02","03"]
["05-02-03-02",3,null,12,5,2,3,2,"05","02","03","02"]
["05-02-04-01",3,null,12,5,2,4,1,"05","02","04","01"]
["05-02-05-00",3,null,12,5,2,5,0,"05","02","05","00"]
["05-03-00-04",3,null,12,5,3,0,4,"05","03","00","04"]
["05-03-01-03",3,null,12,5,3,1,3,"05","03","01","03"]
["05-03-02-02",3,null,12,5,3,2,2,"05","03","02","02"]
["05-03-03-01",3,null,12,5,3,3,1,"05","03","03","01"]
["05-03-04-00",3,null,12,5,3,4,0,"05","03","04","00"]
["05-04-00-03",3,null,12,5,4,0,3,"05","04","00","03"]
["05-04-01-02",2,null,12,5,4,1,2,"05","04","01","02"]
["05-04-02-01",2,null,12,5,4,2,1,"05","04","02","01"]
["05-04-03-00",2,null,12,5,4,3,0,"05","04","03","00"]
["05-05-00-02",2,null,12,5,5,0,2,"05","05","00","02"]
["05-05-01-01",2,null,12,5,5,1,1,"05","05","01","01"]
["05-05-02-00",2,null,12,5,5,2,0,"05","05","02","00"]
[{"$f":"I1735&\"-\"&J1735&\"-\"&K1735&\"-\"&L1735","v":"05-06-00-01"},2,null,12,5,6,0,1,"05","06","00","01"]
["05-06-01-00",2,null,12,5,6,1,0,{"$f":"IF(LEN(E1736)=1,0&E1736,IF(LEN(E1736)=0,\"00\",RIGHT(E1736,2)))","v":"05"},{"$f":"IF(LEN(F1736)=1,0&F1736,IF(LEN(F1736)=0,\"00\",RIGHT(F1736,2)))","v":"06"},{"$f":"IF(LEN(G1736)=1,0&G1736,IF(LEN(G1736)=0,\"00\",RIGHT(G1736,2)))","v":"01"},{"$f":"IF(LEN(H1736)=1,0&H1736,IF(LEN(H1736)=0,\"00\",RIGHT(H1736,2)))","v":"00"}]
["05-07-00-00",2,null,12,5,7,0,0,"05","07","00","00"]
["06-00-00-06",4,null,12,6,0,0,6,"06","00","00","06"]
["06-00-01-05",4,null,12,6,0,1,5,"06","00","01","05"]
["06-00-02-04",4,null,12,6,0,2,4,"06","00","02","04"]
["06-00-03-03",3,null,12,6,0,3,3,"06","00","03","03"]
["06-00-04-02",3,null,12,6,0,4,2,"06","00","04","02"]
["06-00-05-01",3,null,12,6,0,5,1,"06","00","05","01"]
["06-00-06-00",3,null,12,6,0,6,0,"06","00","06","00"]
["06-01-00-05",3,null,12,6,1,0,5,"06","01","00","05"]
["06-01-01-04",3,null,12,6,1,1,4,"06","01","01","04"]
["06-01-02-03",3,null,12,6,1,2,3,"06","01","02","03"]
["06-01-03-02",3,null,12,6,1,3,2,"06","01","03","02"]
["06-01-04-01",3,null,12,6,1,4,1,"06","01","04","01"]
["06-01-05-00",3,null,12,6,1,5,0,"06","01","05","00"]
["06-02-00-04",3,null,12,6,2,0,4,"06","02","00","04"]
["06-02-01-03",3,null,12,6,2,1,3,"06","02","01","03"]
["06-02-02-02",3,null,12,6,2,2,2,"06","02","02","02"]
["06-02-03-01",3,null,12,6,2,3,1,"06","02","03","01"]
["06-02-04-00",3,null,12,6,2,4,0,"06","02","04","00"]
["06-03-00-03",3,null,12,6,3,0,3,"06","03","00","03"]
["06-03-01-02",2,null,12,6,3,1,2,"06","03","01","02"]
["06-03-02-01",2,null,12,6,3,2,1,"06","03","02","01"]
["06-03-03-00",2,null,12,6,3,3,0,"06","03","03","00"]
["06-04-00-02",2,null,12,6,4,0,2,"06","04","00","02"]
["06-04-01-01",2,null,12,6,4,1,1,"06","04","01","01"]
["06-04-02-00",2,null,12,6,4,2,0,"06","04","02","00"]
["06-05-00-01",2,null,12,6,5,0,1,"06","05","00","01"]
["06-05-01-00",2,null,12,6,5,1,0,"06","05","01","00"]
["06-06-00-00",2,null,12,6,6,0,0,"06","06","00","00"]
["07-00-00-05",3,null,12,7,0,0,5,"07","00","00","05"]
["07-00-01-04",3,null,12,7,0,1,4,"07","00","01","04"]
["07-00-02-03",3,null,12,7,0,2,3,"07","00","02","03"]
["07-00-03-02",3,null,12,7,0,3,2,"07","00","03","02"]
["07-00-04-01",3,null,12,7,0,4,1,"07","00","04","01"]
["07-00-05-00",3,null,12,7,0,5,0,"07","00","05","00"]
["07-01-00-04",3,null,12,7,1,0,4,"07","01","00","04"]
["07-01-01-03",3,null,12,7,1,1,3,"07","01","01","03"]
["07-01-02-02",3,null,12,7,1,2,2,"07","01","02","02"]
["07-01-03-01",3,null,12,7,1,3,1,"07","01","03","01"]
["07-01-04-00",3,null,12,7,1,4,0,"07","01","04","00"]
["07-02-00-03",3,null,12,7,2,0,3,"07","02","00","03"]
["07-02-01-02",2,null,12,7,2,1,2,"07","02","01","02"]
["07-02-02-01",2,null,12,7,2,2,1,"07","02","02","01"]
["07-02-03-00",2,null,12,7,2,3,0,"07","02","03","00"]
["07-03-00-02",2,null,12,7,3,0,2,"07","03","00","02"]
["07-03-01-01",2,null,12,7,3,1,1,"07","03","01","01"]
["07-03-02-00",2,null,12,7,3,2,0,"07","03","02","00"]
["07-04-00-01",2,null,12,7,4,0,1,"07","04","00","01"]
["07-04-01-00",2,null,12,7,4,1,0,"07","04","01","00"]
["07-05-00-00",2,null,12,7,5,0,0,"07","05","00","00"]
["08-00-00-04",3,null,12,8,0,0,4,"08","00","00","04"]
["08-00-01-03",3,null,12,8,0,1,3,"08","00","01","03"]
["08-00-02-02",3,null,12,8,0,2,2,"08","00","02","02"]
["08-00-03-01",3,null,12,8,0,3,1,"08","00","03","01"]
["08-00-04-00",3,null,12,8,0,4,0,"08","00","04","00"]
["08-01-00-03",3,null,12,8,1,0,3,"08","01","00","03"]
["08-01-01-02",2,null,12,8,1,1,2,"08","01","01","02"]
["08-01-02-01",2,null,12,8,1,2,1,"08","01","02","01"]
["08-01-03-00",2,null,12,8,1,3,0,"08","01","03","00"]
["08-02-00-02",2,null,12,8,2,0,2,"08","02","00","02"]
["08-02-01-01",2,null,12,8,2,1,1,"08","02","01","01"]
["08-02-02-00",2,null,12,8,2,2,0,"08","02","02","00"]
[{"$f":"I1799&\"-\"&J1799&\"-\"&K1799&\"-\"&L1799","v":"08-03-00-01"},2,null,12,8,3,0,1,"08","03","00","01"]
["08-03-01-00",2,null,12,8,3,1,0,{"$f":"IF(LEN(E1800)=1,0&E1800,IF(LEN(E1800)=0,\"00\",RIGHT(E1800,2)))","v":"08"},{"$f":"IF(LEN(F1800)=1,0&F1800,IF(LEN(F1800)=0,\"00\",RIGHT(F1800,2)))","v":"03"},{"$f":"IF(LEN(G1800)=1,0&G1800,IF(LEN(G1800)=0,\"00\",RIGHT(G1800,2)))","v":"01"},{"$f":"IF(LEN(H1800)=1,0&H1800,IF(LEN(H1800)=0,\"00\",RIGHT(H1800,2)))","v":"00"}]
["08-04-00-00",2,null,12,8,4,0,0,"08","04","00","00"]
["09-00-00-03",3,null,12,9,0,0,3,"09","00","00","03"]
["09-00-01-02",2,null,12,9,0,1,2,"09","00","01","02"]
["09-00-02-01",2,null,12,9,0,2,1,"09","00","02","01"]
["09-00-03-00",2,null,12,9,0,3,0,"09","00","03","00"]
["09-01-00-02",2,null,12,9,1,0,2,"09","01","00","02"]
["09-01-01-01",2,null,12,9,1,1,1,"09","01","01","01"]
["09-01-02-00",2,null,12,9,1,2,0,"09","01","02","00"]
["09-02-00-01",2,null,12,9,2,0,1,"09","02","00","01"]
["09-02-01-00",2,null,12,9,2,1,0,"09","02","01","00"]
["09-03-00-00",2,null,12,9,3,0,0,"09","03","00","00"]
["10-00-00-02",2,null,12,10,0,0,2,"10","00","00","02"]
["10-00-01-01",2,null,12,10,0,1,1,"10","00","01","01"]
["10-00-02-00",2,null,12,10,0,2,0,"10","00","02","00"]
["10-01-00-01",2,null,12,10,1,0,1,"10","01","00","01"]
["10-01-01-00",2,null,12,10,1,1,0,"10","01","01","00"]
["10-02-00-00",2,null,12,10,2,0,0,"10","02","00","00"]
["11-00-00-01",2,null,12,11,0,0,1,"11","00","00","01"]
["11-00-01-00",2,null,12,11,0,1,0,"11","00","01","00"]
["11-01-00-00",2,null,12,11,1,0,0,"11","01","00","00"]
["12-00-00-00",1,null,12,12,0,0,0,"12","00","00","00"]
["00-00-00-13",7,null,13,0,0,0,13,"00","00","00","13"]
["00-00-01-12",6,null,13,0,0,1,12,"00","00","01","12"]
["00-00-02-11",6,null,13,0,0,2,11,"00","00","02","11"]
["00-00-03-10",6,null,13,0,0,3,10,"00","00","03","10"]
["00-00-04-09",6,null,13,0,0,4,9,"00","00","04","09"]
["00-00-05-08",6,null,13,0,0,5,8,"00","00","05","08"]
["00-00-06-07",6,null,13,0,0,6,7,"00","00","06","07"]
["00-00-07-06",5,null,13,0,0,7,6,"00","00","07","06"]
["00-00-08-05",5,null,13,0,0,8,5,"00","00","08","05"]
["00-00-09-04",5,null,13,0,0,9,4,"00","00","09","04"]
["00-00-10-03",5,null,13,0,0,10,3,"00","00","10","03"]
["00-00-11-02",4,null,13,0,0,11,2,"00","00","11","02"]
["00-00-12-01",4,null,13,0,0,12,1,"00","00","12","01"]
["00-00-13-00",4,null,13,0,0,13,0,"00","00","13","00"]
["00-01-00-12",5,null,13,0,1,0,12,"00","01","00","12"]
["00-01-01-11",5,null,13,0,1,1,11,"00","01","01","11"]
["00-01-02-10",5,null,13,0,1,2,10,"00","01","02","10"]
["00-01-03-09",5,null,13,0,1,3,9,"00","01","03","09"]
["00-01-04-08",5,null,13,0,1,4,8,"00","01","04","08"]
["00-01-05-07",5,null,13,0,1,5,7,"00","01","05","07"]
["00-01-06-06",5,null,13,0,1,6,6,"00","01","06","06"]
["00-01-07-05",5,null,13,0,1,7,5,"00","01","07","05"]
["00-01-08-04",5,null,13,0,1,8,4,"00","01","08","04"]
["00-01-09-03",5,null,13,0,1,9,3,"00","01","09","03"]
["00-01-10-02",4,null,13,0,1,10,2,"00","01","10","02"]
["00-01-11-01",4,null,13,0,1,11,1,"00","01","11","01"]
["00-01-12-00",4,null,13,0,1,12,0,"00","01","12","00"]
["00-02-00-11",5,null,13,0,2,0,11,"00","02","00","11"]
["00-02-01-10",5,null,13,0,2,1,10,"00","02","01","10"]
["00-02-02-09",5,null,13,0,2,2,9,"00","02","02","09"]
["00-02-03-08",5,null,13,0,2,3,8,"00","02","03","08"]
["00-02-04-07",5,null,13,0,2,4,7,"00","02","04","07"]
["00-02-05-06",5,null,13,0,2,5,6,"00","02","05","06"]
["00-02-06-05",5,null,13,0,2,6,5,"00","02","06","05"]
["00-02-07-04",5,null,13,0,2,7,4,"00","02","07","04"]
["00-02-08-03",5,null,13,0,2,8,3,"00","02","08","03"]
["00-02-09-02",4,null,13,0,2,9,2,"00","02","09","02"]
["00-02-10-01",4,null,13,0,2,10,1,"00","02","10","01"]
["00-02-11-00",4,null,13,0,2,11,0,"00","02","11","00"]
["00-03-00-10",5,null,13,0,3,0,10,"00","03","00","10"]
["00-03-01-09",5,null,13,0,3,1,9,"00","03","01","09"]
[{"$f":"I1863&\"-\"&J1863&\"-\"&K1863&\"-\"&L1863","v":"00-03-02-08"},5,null,13,0,3,2,8,"00","03","02","08"]
["00-03-03-07",5,null,13,0,3,3,7,{"$f":"IF(LEN(E1864)=1,0&E1864,IF(LEN(E1864)=0,\"00\",RIGHT(E1864,2)))","v":"00"},{"$f":"IF(LEN(F1864)=1,0&F1864,IF(LEN(F1864)=0,\"00\",RIGHT(F1864,2)))","v":"03"},{"$f":"IF(LEN(G1864)=1,0&G1864,IF(LEN(G1864)=0,\"00\",RIGHT(G1864,2)))","v":"03"},{"$f":"IF(LEN(H1864)=1,0&H1864,IF(LEN(H1864)=0,\"00\",RIGHT(H1864,2)))","v":"07"}]
["00-03-04-06",5,null,13,0,3,4,6,"00","03","04","06"]
["00-03-05-05",5,null,13,0,3,5,5,"00","03","05","05"]
["00-03-06-04",5,null,13,0,3,6,4,"00","03","06","04"]
["00-03-07-03",5,null,13,0,3,7,3,"00","03","07","03"]
["00-03-08-02",4,null,13,0,3,8,2,"00","03","08","02"]
["00-03-09-01",4,null,13,0,3,9,1,"00","03","09","01"]
["00-03-10-00",4,null,13,0,3,10,0,"00","03","10","00"]
["00-04-00-09",5,null,13,0,4,0,9,"00","04","00","09"]
["00-04-01-08",5,null,13,0,4,1,8,"00","04","01","08"]
["00-04-02-07",5,null,13,0,4,2,7,"00","04","02","07"]
["00-04-03-06",5,null,13,0,4,3,6,"00","04","03","06"]
["00-04-04-05",5,null,13,0,4,4,5,"00","04","04","05"]
["00-04-05-04",5,null,13,0,4,5,4,"00","04","05","04"]
["00-04-06-03",4,null,13,0,4,6,3,"00","04","06","03"]
["00-04-07-02",4,null,13,0,4,7,2,"00","04","07","02"]
["00-04-08-01",4,null,13,0,4,8,1,"00","04","08","01"]
["00-04-09-00",4,null,13,0,4,9,0,"00","04","09","00"]
["00-05-00-08",5,null,13,0,5,0,8,"00","05","00","08"]
["00-05-01-07",5,null,13,0,5,1,7,"00","05","01","07"]
["00-05-02-06",5,null,13,0,5,2,6,"00","05","02","06"]
["00-05-03-05",5,null,13,0,5,3,5,"00","05","03","05"]
["00-05-04-04",4,null,13,0,5,4,4,"00","05","04","04"]
["00-05-05-03",4,null,13,0,5,5,3,"00","05","05","03"]
["00-05-06-02",4,null,13,0,5,6,2,"00","05","06","02"]
["00-05-07-01",4,null,13,0,5,7,1,"00","05","07","01"]
["00-05-08-00",4,null,13,0,5,8,0,"00","05","08","00"]
["00-06-00-07",5,null,13,0,6,0,7,"00","06","00","07"]
["00-06-01-06",4,null,13,0,6,1,6,"00","06","01","06"]
["00-06-02-05",4,null,13,0,6,2,5,"00","06","02","05"]
["00-06-03-04",4,null,13,0,6,3,4,"00","06","03","04"]
["00-06-04-03",4,null,13,0,6,4,3,"00","06","04","03"]
["00-06-05-02",4,null,13,0,6,5,2,"00","06","05","02"]
["00-06-06-01",4,null,13,0,6,6,1,"00","06","06","01"]
["00-06-07-00",4,null,13,0,6,7,0,"00","06","07","00"]
["00-07-00-06",3,null,13,0,7,0,6,"00","07","00","06"]
["00-07-01-05",3,null,13,0,7,1,5,"00","07","01","05"]
["00-07-02-04",3,null,13,0,7,2,4,"00","07","02","04"]
["00-07-03-03",3,null,13,0,7,3,3,"00","07","03","03"]
["00-07-04-02",3,null,13,0,7,4,2,"00","07","04","02"]
["00-07-05-01",3,null,13,0,7,5,1,"00","07","05","01"]
["00-07-06-00",3,null,13,0,7,6,0,"00","07","06","00"]
["00-08-00-05",3,null,13,0,8,0,5,"00","08","00","05"]
["00-08-01-04",3,null,13,0,8,1,4,"00","08","01","04"]
["00-08-02-03",3,null,13,0,8,2,3,"00","08","02","03"]
["00-08-03-02",3,null,13,0,8,3,2,"00","08","03","02"]
["00-08-04-01",3,null,13,0,8,4,1,"00","08","04","01"]
["00-08-05-00",3,null,13,0,8,5,0,"00","08","05","00"]
["00-09-00-04",3,null,13,0,9,0,4,"00","09","00","04"]
["00-09-01-03",3,null,13,0,9,1,3,"00","09","01","03"]
["00-09-02-02",3,null,13,0,9,2,2,"00","09","02","02"]
["00-09-03-01",3,null,13,0,9,3,1,"00","09","03","01"]
["00-09-04-00",3,null,13,0,9,4,0,"00","09","04","00"]
["00-10-00-03",3,null,13,0,10,0,3,"00","10","00","03"]
["00-10-01-02",3,null,13,0,10,1,2,"00","10","01","02"]
["00-10-02-01",3,null,13,0,10,2,1,"00","10","02","01"]
["00-10-03-00",3,null,13,0,10,3,0,"00","10","03","00"]
["00-11-00-02",3,null,13,0,11,0,2,"00","11","00","02"]
["00-11-01-01",3,null,13,0,11,1,1,"00","11","01","01"]
["00-11-02-00",2,null,13,0,11,2,0,"00","11","02","00"]
["00-12-00-01",2,null,13,0,12,0,1,"00","12","00","01"]
["00-12-01-00",2,null,13,0,12,1,0,"00","12","01","00"]
["00-13-00-00",2,null,13,0,13,0,0,"00","13","00","00"]
[{"$f":"I1927&\"-\"&J1927&\"-\"&K1927&\"-\"&L1927","v":"01-00-00-12"},5,null,13,1,0,0,12,"01","00","00","12"]
["01-00-01-11",5,null,13,1,0,1,11,{"$f":"IF(LEN(E1928)=1,0&E1928,IF(LEN(E1928)=0,\"00\",RIGHT(E1928,2)))","v":"01"},{"$f":"IF(LEN(F1928)=1,0&F1928,IF(LEN(F1928)=0,\"00\",RIGHT(F1928,2)))","v":"00"},{"$f":"IF(LEN(G1928)=1,0&G1928,IF(LEN(G1928)=0,\"00\",RIGHT(G1928,2)))","v":"01"},{"$f":"IF(LEN(H1928)=1,0&H1928,IF(LEN(H1928)=0,\"00\",RIGHT(H1928,2)))","v":"11"}]
["01-00-02-10",5,null,13,1,0,2,10,"01","00","02","10"]
["01-00-03-09",5,null,13,1,0,3,9,"01","00","03","09"]
["01-00-04-08",5,null,13,1,0,4,8,"01","00","04","08"]
["01-00-05-07",5,null,13,1,0,5,7,"01","00","05","07"]
["01-00-06-06",5,null,13,1,0,6,6,"01","00","06","06"]
["01-00-07-05",5,null,13,1,0,7,5,"01","00","07","05"]
["01-00-08-04",5,null,13,1,0,8,4,"01","00","08","04"]
["01-00-09-03",5,null,13,1,0,9,3,"01","00","09","03"]
["01-00-10-02",4,null,13,1,0,10,2,"01","00","10","02"]
["01-00-11-01",4,null,13,1,0,11,1,"01","00","11","01"]
["01-00-12-00",4,null,13,1,0,12,0,"01","00","12","00"]
["01-01-00-11",5,null,13,1,1,0,11,"01","01","00","11"]
["01-01-01-10",5,null,13,1,1,1,10,"01","01","01","10"]
["01-01-02-09",5,null,13,1,1,2,9,"01","01","02","09"]
["01-01-03-08",5,null,13,1,1,3,8,"01","01","03","08"]
["01-01-04-07",5,null,13,1,1,4,7,"01","01","04","07"]
["01-01-05-06",5,null,13,1,1,5,6,"01","01","05","06"]
["01-01-06-05",5,null,13,1,1,6,5,"01","01","06","05"]
["01-01-07-04",5,null,13,1,1,7,4,"01","01","07","04"]
["01-01-08-03",5,null,13,1,1,8,3,"01","01","08","03"]
["01-01-09-02",4,null,13,1,1,9,2,"01","01","09","02"]
["01-01-10-01",4,null,13,1,1,10,1,"01","01","10","01"]
["01-01-11-00",4,null,13,1,1,11,0,"01","01","11","00"]
["01-02-00-10",5,null,13,1,2,0,10,"01","02","00","10"]
["01-02-01-09",5,null,13,1,2,1,9,"01","02","01","09"]
["01-02-02-08",5,null,13,1,2,2,8,"01","02","02","08"]
["01-02-03-07",5,null,13,1,2,3,7,"01","02","03","07"]
["01-02-04-06",5,null,13,1,2,4,6,"01","02","04","06"]
["01-02-05-05",5,null,13,1,2,5,5,"01","02","05","05"]
["01-02-06-04",5,null,13,1,2,6,4,"01","02","06","04"]
["01-02-07-03",4,null,13,1,2,7,3,"01","02","07","03"]
["01-02-08-02",4,null,13,1,2,8,2,"01","02","08","02"]
["01-02-09-01",4,null,13,1,2,9,1,"01","02","09","01"]
["01-02-10-00",4,null,13,1,2,10,0,"01","02","10","00"]
["01-03-00-09",5,null,13,1,3,0,9,"01","03","00","09"]
["01-03-01-08",5,null,13,1,3,1,8,"01","03","01","08"]
["01-03-02-07",5,null,13,1,3,2,7,"01","03","02","07"]
["01-03-03-06",5,null,13,1,3,3,6,"01","03","03","06"]
["01-03-04-05",5,null,13,1,3,4,5,"01","03","04","05"]
["01-03-05-04",4,null,13,1,3,5,4,"01","03","05","04"]
["01-03-06-03",4,null,13,1,3,6,3,"01","03","06","03"]
["01-03-07-02",4,null,13,1,3,7,2,"01","03","07","02"]
["01-03-08-01",4,null,13,1,3,8,1,"01","03","08","01"]
["01-03-09-00",4,null,13,1,3,9,0,"01","03","09","00"]
["01-04-00-08",5,null,13,1,4,0,8,"01","04","00","08"]
["01-04-01-07",5,null,13,1,4,1,7,"01","04","01","07"]
["01-04-02-06",4,null,13,1,4,2,6,"01","04","02","06"]
["01-04-03-05",4,null,13,1,4,3,5,"01","04","03","05"]
["01-04-04-04",4,null,13,1,4,4,4,"01","04","04","04"]
["01-04-05-03",4,null,13,1,4,5,3,"01","04","05","03"]
["01-04-06-02",4,null,13,1,4,6,2,"01","04","06","02"]
["01-04-07-01",4,null,13,1,4,7,1,"01","04","07","01"]
["01-04-08-00",4,null,13,1,4,8,0,"01","04","08","00"]
["01-05-00-07",4,null,13,1,5,0,7,"01","05","00","07"]
["01-05-01-06",4,null,13,1,5,1,6,"01","05","01","06"]
["01-05-02-05",4,null,13,1,5,2,5,"01","05","02","05"]
["01-05-03-04",4,null,13,1,5,3,4,"01","05","03","04"]
["01-05-04-03",4,null,13,1,5,4,3,"01","05","04","03"]
["01-05-05-02",4,null,13,1,5,5,2,"01","05","05","02"]
["01-05-06-01",4,null,13,1,5,6,1,"01","05","06","01"]
["01-05-07-00",4,null,13,1,5,7,0,"01","05","07","00"]
["01-06-00-06",3,null,13,1,6,0,6,"01","06","00","06"]
[{"$f":"I1991&\"-\"&J1991&\"-\"&K1991&\"-\"&L1991","v":"01-06-01-05"},3,null,13,1,6,1,5,"01","06","01","05"]
["01-06-02-04",3,null,13,1,6,2,4,{"$f":"IF(LEN(E1992)=1,0&E1992,IF(LEN(E1992)=0,\"00\",RIGHT(E1992,2)))","v":"01"},{"$f":"IF(LEN(F1992)=1,0&F1992,IF(LEN(F1992)=0,\"00\",RIGHT(F1992,2)))","v":"06"},{"$f":"IF(LEN(G1992)=1,0&G1992,IF(LEN(G1992)=0,\"00\",RIGHT(G1992,2)))","v":"02"},{"$f":"IF(LEN(H1992)=1,0&H1992,IF(LEN(H1992)=0,\"00\",RIGHT(H1992,2)))","v":"04"}]
["01-06-03-03",3,null,13,1,6,3,3,"01","06","03","03"]
["01-06-04-02",3,null,13,1,6,4,2,"01","06","04","02"]
["01-06-05-01",3,null,13,1,6,5,1,"01","06","05","01"]
["01-06-06-00",3,null,13,1,6,6,0,"01","06","06","00"]
["01-07-00-05",3,null,13,1,7,0,5,"01","07","00","05"]
["01-07-01-04",3,null,13,1,7,1,4,"01","07","01","04"]
["01-07-02-03",3,null,13,1,7,2,3,"01","07","02","03"]
["01-07-03-02",3,null,13,1,7,3,2,"01","07","03","02"]
["01-07-04-01",3,null,13,1,7,4,1,"01","07","04","01"]
["01-07-05-00",3,null,13,1,7,5,0,"01","07","05","00"]
["01-08-00-04",3,null,13,1,8,0,4,"01","08","00","04"]
["01-08-01-03",3,null,13,1,8,1,3,"01","08","01","03"]
["01-08-02-02",3,null,13,1,8,2,2,"01","08","02","02"]
["01-08-03-01",3,null,13,1,8,3,1,"01","08","03","01"]
["01-08-04-00",3,null,13,1,8,4,0,"01","08","04","00"]
["01-09-00-03",3,null,13,1,9,0,3,"01","09","00","03"]
["01-09-01-02",3,null,13,1,9,1,2,"01","09","01","02"]
["01-09-02-01",3,null,13,1,9,2,1,"01","09","02","01"]
["01-09-03-00",2,null,13,1,9,3,0,"01","09","03","00"]
["01-10-00-02",2,null,13,1,10,0,2,"01","10","00","02"]
["01-10-01-01",2,null,13,1,10,1,1,"01","10","01","01"]
["01-10-02-00",2,null,13,1,10,2,0,"01","10","02","00"]
["01-11-00-01",2,null,13,1,11,0,1,"01","11","00","01"]
["01-11-01-00",2,null,13,1,11,1,0,"01","11","01","00"]
["01-12-00-00",2,null,13,1,12,0,0,"01","12","00","00"]
["02-00-00-11",5,null,13,2,0,0,11,"02","00","00","11"]
["02-00-01-10",5,null,13,2,0,1,10,"02","00","01","10"]
["02-00-02-09",5,null,13,2,0,2,9,"02","00","02","09"]
["02-00-03-08",5,null,13,2,0,3,8,"02","00","03","08"]
["02-00-04-07",5,null,13,2,0,4,7,"02","00","04","07"]
["02-00-05-06",5,null,13,2,0,5,6,"02","00","05","06"]
["02-00-06-05",5,null,13,2,0,6,5,"02","00","06","05"]
["02-00-07-04",5,null,13,2,0,7,4,"02","00","07","04"]
["02-00-08-03",4,null,13,2,0,8,3,"02","00","08","03"]
["02-00-09-02",4,null,13,2,0,9,2,"02","00","09","02"]
["02-00-10-01",4,null,13,2,0,10,1,"02","00","10","01"]
["02-00-11-00",4,null,13,2,0,11,0,"02","00","11","00"]
["02-01-00-10",5,null,13,2,1,0,10,"02","01","00","10"]
["02-01-01-09",5,null,13,2,1,1,9,"02","01","01","09"]
["02-01-02-08",5,null,13,2,1,2,8,"02","01","02","08"]
["02-01-03-07",5,null,13,2,1,3,7,"02","01","03","07"]
["02-01-04-06",5,null,13,2,1,4,6,"02","01","04","06"]
["02-01-05-05",5,null,13,2,1,5,5,"02","01","05","05"]
["02-01-06-04",4,null,13,2,1,6,4,"02","01","06","04"]
["02-01-07-03",4,null,13,2,1,7,3,"02","01","07","03"]
["02-01-08-02",4,null,13,2,1,8,2,"02","01","08","02"]
["02-01-09-01",4,null,13,2,1,9,1,"02","01","09","01"]
["02-01-10-00",4,null,13,2,1,10,0,"02","01","10","00"]
["02-02-00-09",5,null,13,2,2,0,9,"02","02","00","09"]
["02-02-01-08",5,null,13,2,2,1,8,"02","02","01","08"]
["02-02-02-07",5,null,13,2,2,2,7,"02","02","02","07"]
["02-02-03-06",4,null,13,2,2,3,6,"02","02","03","06"]
["02-02-04-05",4,null,13,2,2,4,5,"02","02","04","05"]
["02-02-05-04",4,null,13,2,2,5,4,"02","02","05","04"]
["02-02-06-03",4,null,13,2,2,6,3,"02","02","06","03"]
["02-02-07-02",4,null,13,2,2,7,2,"02","02","07","02"]
["02-02-08-01",4,null,13,2,2,8,1,"02","02","08","01"]
["02-02-09-00",4,null,13,2,2,9,0,"02","02","09","00"]
["02-03-00-08",5,null,13,2,3,0,8,"02","03","00","08"]
["02-03-01-07",4,null,13,2,3,1,7,"02","03","01","07"]
["02-03-02-06",4,null,13,2,3,2,6,"02","03","02","06"]
["02-03-03-05",4,null,13,2,3,3,5,"02","03","03","05"]
[{"$f":"I2055&\"-\"&J2055&\"-\"&K2055&\"-\"&L2055","v":"02-03-04-04"},4,null,13,2,3,4,4,"02","03","04","04"]
["02-03-05-03",4,null,13,2,3,5,3,{"$f":"IF(LEN(E2056)=1,0&E2056,IF(LEN(E2056)=0,\"00\",RIGHT(E2056,2)))","v":"02"},{"$f":"IF(LEN(F2056)=1,0&F2056,IF(LEN(F2056)=0,\"00\",RIGHT(F2056,2)))","v":"03"},{"$f":"IF(LEN(G2056)=1,0&G2056,IF(LEN(G2056)=0,\"00\",RIGHT(G2056,2)))","v":"05"},{"$f":"IF(LEN(H2056)=1,0&H2056,IF(LEN(H2056)=0,\"00\",RIGHT(H2056,2)))","v":"03"}]
["02-03-06-02",4,null,13,2,3,6,2,"02","03","06","02"]
["02-03-07-01",4,null,13,2,3,7,1,"02","03","07","01"]
["02-03-08-00",4,null,13,2,3,8,0,"02","03","08","00"]
["02-04-00-07",4,null,13,2,4,0,7,"02","04","00","07"]
["02-04-01-06",4,null,13,2,4,1,6,"02","04","01","06"]
["02-04-02-05",4,null,13,2,4,2,5,"02","04","02","05"]
["02-04-03-04",4,null,13,2,4,3,4,"02","04","03","04"]
["02-04-04-03",4,null,13,2,4,4,3,"02","04","04","03"]
["02-04-05-02",4,null,13,2,4,5,2,"02","04","05","02"]
["02-04-06-01",4,null,13,2,4,6,1,"02","04","06","01"]
["02-04-07-00",4,null,13,2,4,7,0,"02","04","07","00"]
["02-05-00-06",3,null,13,2,5,0,6,"02","05","00","06"]
["02-05-01-05",3,null,13,2,5,1,5,"02","05","01","05"]
["02-05-02-04",3,null,13,2,5,2,4,"02","05","02","04"]
["02-05-03-03",3,null,13,2,5,3,3,"02","05","03","03"]
["02-05-04-02",3,null,13,2,5,4,2,"02","05","04","02"]
["02-05-05-01",3,null,13,2,5,5,1,"02","05","05","01"]
["02-05-06-00",3,null,13,2,5,6,0,"02","05","06","00"]
["02-06-00-05",3,null,13,2,6,0,5,"02","06","00","05"]
["02-06-01-04",3,null,13,2,6,1,4,"02","06","01","04"]
["02-06-02-03",3,null,13,2,6,2,3,"02","06","02","03"]
["02-06-03-02",3,null,13,2,6,3,2,"02","06","03","02"]
["02-06-04-01",3,null,13,2,6,4,1,"02","06","04","01"]
["02-06-05-00",3,null,13,2,6,5,0,"02","06","05","00"]
["02-07-00-04",3,null,13,2,7,0,4,"02","07","00","04"]
["02-07-01-03",3,null,13,2,7,1,3,"02","07","01","03"]
["02-07-02-02",3,null,13,2,7,2,2,"02","07","02","02"]
["02-07-03-01",3,null,13,2,7,3,1,"02","07","03","01"]
["02-07-04-00",3,null,13,2,7,4,0,"02","07","04","00"]
["02-08-00-03",3,null,13,2,8,0,3,"02","08","00","03"]
["02-08-01-02",2,null,13,2,8,1,2,"02","08","01","02"]
["02-08-02-01",2,null,13,2,8,2,1,"02","08","02","01"]
["02-08-03-00",2,null,13,2,8,3,0,"02","08","03","00"]
["02-09-00-02",2,null,13,2,9,0,2,"02","09","00","02"]
["02-09-01-01",2,null,13,2,9,1,1,"02","09","01","01"]
["02-09-02-00",2,null,13,2,9,2,0,"02","09","02","00"]
["02-10-00-01",2,null,13,2,10,0,1,"02","10","00","01"]
["02-10-01-00",2,null,13,2,10,1,0,"02","10","01","00"]
["02-11-00-00",2,null,13,2,11,0,0,"02","11","00","00"]
["03-00-00-10",5,null,13,3,0,0,10,"03","00","00","10"]
["03-00-01-09",5,null,13,3,0,1,9,"03","00","01","09"]
["03-00-02-08",5,null,13,3,0,2,8,"03","00","02","08"]
["03-00-03-07",5,null,13,3,0,3,7,"03","00","03","07"]
["03-00-04-06",4,null,13,3,0,4,6,"03","00","04","06"]
["03-00-05-05",4,null,13,3,0,5,5,"03","00","05","05"]
["03-00-06-04",4,null,13,3,0,6,4,"03","00","06","04"]
["03-00-07-03",4,null,13,3,0,7,3,"03","00","07","03"]
["03-00-08-02",4,null,13,3,0,8,2,"03","00","08","02"]
["03-00-09-01",4,null,13,3,0,9,1,"03","00","09","01"]
["03-00-10-00",4,null,13,3,0,10,0,"03","00","10","00"]
["03-01-00-09",5,null,13,3,1,0,9,"03","01","00","09"]
["03-01-01-08",5,null,13,3,1,1,8,"03","01","01","08"]
["03-01-02-07",4,null,13,3,1,2,7,"03","01","02","07"]
["03-01-03-06",4,null,13,3,1,3,6,"03","01","03","06"]
["03-01-04-05",4,null,13,3,1,4,5,"03","01","04","05"]
["03-01-05-04",4,null,13,3,1,5,4,"03","01","05","04"]
["03-01-06-03",4,null,13,3,1,6,3,"03","01","06","03"]
["03-01-07-02",4,null,13,3,1,7,2,"03","01","07","02"]
["03-01-08-01",4,null,13,3,1,8,1,"03","01","08","01"]
["03-01-09-00",4,null,13,3,1,9,0,"03","01","09","00"]
["03-02-00-08",4,null,13,3,2,0,8,"03","02","00","08"]
["03-02-01-07",4,null,13,3,2,1,7,"03","02","01","07"]
[{"$f":"I2119&\"-\"&J2119&\"-\"&K2119&\"-\"&L2119","v":"03-02-02-06"},4,null,13,3,2,2,6,"03","02","02","06"]
["03-02-03-05",4,null,13,3,2,3,5,{"$f":"IF(LEN(E2120)=1,0&E2120,IF(LEN(E2120)=0,\"00\",RIGHT(E2120,2)))","v":"03"},{"$f":"IF(LEN(F2120)=1,0&F2120,IF(LEN(F2120)=0,\"00\",RIGHT(F2120,2)))","v":"02"},{"$f":"IF(LEN(G2120)=1,0&G2120,IF(LEN(G2120)=0,\"00\",RIGHT(G2120,2)))","v":"03"},{"$f":"IF(LEN(H2120)=1,0&H2120,IF(LEN(H2120)=0,\"00\",RIGHT(H2120,2)))","v":"05"}]
["03-02-04-04",4,null,13,3,2,4,4,"03","02","04","04"]
["03-02-05-03",4,null,13,3,2,5,3,"03","02","05","03"]
["03-02-06-02",4,null,13,3,2,6,2,"03","02","06","02"]
["03-02-07-01",4,null,13,3,2,7,1,"03","02","07","01"]
["03-02-08-00",4,null,13,3,2,8,0,"03","02","08","00"]
["03-03-00-07",4,null,13,3,3,0,7,"03","03","00","07"]
["03-03-01-06",4,null,13,3,3,1,6,"03","03","01","06"]
["03-03-02-05",4,null,13,3,3,2,5,"03","03","02","05"]
["03-03-03-04",4,null,13,3,3,3,4,"03","03","03","04"]
["03-03-04-03",4,null,13,3,3,4,3,"03","03","04","03"]
["03-03-05-02",4,null,13,3,3,5,2,"03","03","05","02"]
["03-03-06-01",4,null,13,3,3,6,1,"03","03","06","01"]
["03-03-07-00",4,null,13,3,3,7,0,"03","03","07","00"]
["03-04-00-06",3,null,13,3,4,0,6,"03","04","00","06"]
["03-04-01-05",3,null,13,3,4,1,5,"03","04","01","05"]
["03-04-02-04",3,null,13,3,4,2,4,"03","04","02","04"]
["03-04-03-03",3,null,13,3,4,3,3,"03","04","03","03"]
["03-04-04-02",3,null,13,3,4,4,2,"03","04","04","02"]
["03-04-05-01",3,null,13,3,4,5,1,"03","04","05","01"]
["03-04-06-00",3,null,13,3,4,6,0,"03","04","06","00"]
["03-05-00-05",3,null,13,3,5,0,5,"03","05","00","05"]
["03-05-01-04",3,null,13,3,5,1,4,"03","05","01","04"]
["03-05-02-03",3,null,13,3,5,2,3,"03","05","02","03"]
["03-05-03-02",3,null,13,3,5,3,2,"03","05","03","02"]
["03-05-04-01",3,null,13,3,5,4,1,"03","05","04","01"]
["03-05-05-00",3,null,13,3,5,5,0,"03","05","05","00"]
["03-06-00-04",3,null,13,3,6,0,4,"03","06","00","04"]
["03-06-01-03",3,null,13,3,6,1,3,"03","06","01","03"]
["03-06-02-02",3,null,13,3,6,2,2,"03","06","02","02"]
["03-06-03-01",3,null,13,3,6,3,1,"03","06","03","01"]
["03-06-04-00",3,null,13,3,6,4,0,"03","06","04","00"]
["03-07-00-03",3,null,13,3,7,0,3,"03","07","00","03"]
["03-07-01-02",2,null,13,3,7,1,2,"03","07","01","02"]
["03-07-02-01",2,null,13,3,7,2,1,"03","07","02","01"]
["03-07-03-00",2,null,13,3,7,3,0,"03","07","03","00"]
["03-08-00-02",2,null,13,3,8,0,2,"03","08","00","02"]
["03-08-01-01",2,null,13,3,8,1,1,"03","08","01","01"]
["03-08-02-00",2,null,13,3,8,2,0,"03","08","02","00"]
["03-09-00-01",2,null,13,3,9,0,1,"03","09","00","01"]
["03-09-01-00",2,null,13,3,9,1,0,"03","09","01","00"]
["03-10-00-00",2,null,13,3,10,0,0,"03","10","00","00"]
["04-00-00-09",4,null,13,4,0,0,9,"04","00","00","09"]
["04-00-01-08",4,null,13,4,0,1,8,"04","00","01","08"]
["04-00-02-07",4,null,13,4,0,2,7,"04","00","02","07"]
["04-00-03-06",4,null,13,4,0,3,6,"04","00","03","06"]
["04-00-04-05",4,null,13,4,0,4,5,"04","00","04","05"]
["04-00-05-04",4,null,13,4,0,5,4,"04","00","05","04"]
["04-00-06-03",4,null,13,4,0,6,3,"04","00","06","03"]
["04-00-07-02",4,null,13,4,0,7,2,"04","00","07","02"]
["04-00-08-01",4,null,13,4,0,8,1,"04","00","08","01"]
["04-00-09-00",4,null,13,4,0,9,0,"04","00","09","00"]
["04-01-00-08",4,null,13,4,1,0,8,"04","01","00","08"]
["04-01-01-07",4,null,13,4,1,1,7,"04","01","01","07"]
["04-01-02-06",4,null,13,4,1,2,6,"04","01","02","06"]
["04-01-03-05",4,null,13,4,1,3,5,"04","01","03","05"]
["04-01-04-04",4,null,13,4,1,4,4,"04","01","04","04"]
["04-01-05-03",4,null,13,4,1,5,3,"04","01","05","03"]
["04-01-06-02",4,null,13,4,1,6,2,"04","01","06","02"]
["04-01-07-01",4,null,13,4,1,7,1,"04","01","07","01"]
["04-01-08-00",4,null,13,4,1,8,0,"04","01","08","00"]
["04-02-00-07",4,null,13,4,2,0,7,"04","02","00","07"]
["04-02-01-06",4,null,13,4,2,1,6,"04","02","01","06"]
[{"$f":"I2183&\"-\"&J2183&\"-\"&K2183&\"-\"&L2183","v":"04-02-02-05"},4,null,13,4,2,2,5,"04","02","02","05"]
["04-02-03-04",4,null,13,4,2,3,4,{"$f":"IF(LEN(E2184)=1,0&E2184,IF(LEN(E2184)=0,\"00\",RIGHT(E2184,2)))","v":"04"},{"$f":"IF(LEN(F2184)=1,0&F2184,IF(LEN(F2184)=0,\"00\",RIGHT(F2184,2)))","v":"02"},{"$f":"IF(LEN(G2184)=1,0&G2184,IF(LEN(G2184)=0,\"00\",RIGHT(G2184,2)))","v":"03"},{"$f":"IF(LEN(H2184)=1,0&H2184,IF(LEN(H2184)=0,\"00\",RIGHT(H2184,2)))","v":"04"}]
["04-02-04-03",4,null,13,4,2,4,3,"04","02","04","03"]
["04-02-05-02",4,null,13,4,2,5,2,"04","02","05","02"]
["04-02-06-01",4,null,13,4,2,6,1,"04","02","06","01"]
["04-02-07-00",4,null,13,4,2,7,0,"04","02","07","00"]
["04-03-00-06",3,null,13,4,3,0,6,"04","03","00","06"]
["04-03-01-05",3,null,13,4,3,1,5,"04","03","01","05"]
["04-03-02-04",3,null,13,4,3,2,4,"04","03","02","04"]
["04-03-03-03",3,null,13,4,3,3,3,"04","03","03","03"]
["04-03-04-02",3,null,13,4,3,4,2,"04","03","04","02"]
["04-03-05-01",3,null,13,4,3,5,1,"04","03","05","01"]
["04-03-06-00",3,null,13,4,3,6,0,"04","03","06","00"]
["04-04-00-05",3,null,13,4,4,0,5,"04","04","00","05"]
["04-04-01-04",3,null,13,4,4,1,4,"04","04","01","04"]
["04-04-02-03",3,null,13,4,4,2,3,"04","04","02","03"]
["04-04-03-02",3,null,13,4,4,3,2,"04","04","03","02"]
["04-04-04-01",3,null,13,4,4,4,1,"04","04","04","01"]
["04-04-05-00",3,null,13,4,4,5,0,"04","04","05","00"]
["04-05-00-04",3,null,13,4,5,0,4,"04","05","00","04"]
["04-05-01-03",3,null,13,4,5,1,3,"04","05","01","03"]
["04-05-02-02",3,null,13,4,5,2,2,"04","05","02","02"]
["04-05-03-01",3,null,13,4,5,3,1,"04","05","03","01"]
["04-05-04-00",3,null,13,4,5,4,0,"04","05","04","00"]
["04-06-00-03",3,null,13,4,6,0,3,"04","06","00","03"]
["04-06-01-02",2,null,13,4,6,1,2,"04","06","01","02"]
["04-06-02-01",2,null,13,4,6,2,1,"04","06","02","01"]
["04-06-03-00",2,null,13,4,6,3,0,"04","06","03","00"]
["04-07-00-02",2,null,13,4,7,0,2,"04","07","00","02"]
["04-07-01-01",2,null,13,4,7,1,1,"04","07","01","01"]
["04-07-02-00",2,null,13,4,7,2,0,"04","07","02","00"]
["04-08-00-01",2,null,13,4,8,0,1,"04","08","00","01"]
["04-08-01-00",2,null,13,4,8,1,0,"04","08","01","00"]
["04-09-00-00",2,null,13,4,9,0,0,"04","09","00","00"]
["05-00-00-08",4,null,13,5,0,0,8,"05","00","00","08"]
["05-00-01-07",4,null,13,5,0,1,7,"05","00","01","07"]
["05-00-02-06",4,null,13,5,0,2,6,"05","00","02","06"]
["05-00-03-05",4,null,13,5,0,3,5,"05","00","03","05"]
["05-00-04-04",4,null,13,5,0,4,4,"05","00","04","04"]
["05-00-05-03",4,null,13,5,0,5,3,"05","00","05","03"]
["05-00-06-02",4,null,13,5,0,6,2,"05","00","06","02"]
["05-00-07-01",4,null,13,5,0,7,1,"05","00","07","01"]
["05-00-08-00",4,null,13,5,0,8,0,"05","00","08","00"]
["05-01-00-07",4,null,13,5,1,0,7,"05","01","00","07"]
["05-01-01-06",4,null,13,5,1,1,6,"05","01","01","06"]
["05-01-02-05",4,null,13,5,1,2,5,"05","01","02","05"]
["05-01-03-04",4,null,13,5,1,3,4,"05","01","03","04"]
["05-01-04-03",4,null,13,5,1,4,3,"05","01","04","03"]
["05-01-05-02",4,null,13,5,1,5,2,"05","01","05","02"]
["05-01-06-01",4,null,13,5,1,6,1,"05","01","06","01"]
["05-01-07-00",3,null,13,5,1,7,0,"05","01","07","00"]
["05-02-00-06",3,null,13,5,2,0,6,"05","02","00","06"]
["05-02-01-05",3,null,13,5,2,1,5,"05","02","01","05"]
["05-02-02-04",3,null,13,5,2,2,4,"05","02","02","04"]
["05-02-03-03",3,null,13,5,2,3,3,"05","02","03","03"]
["05-02-04-02",3,null,13,5,2,4,2,"05","02","04","02"]
["05-02-05-01",3,null,13,5,2,5,1,"05","02","05","01"]
["05-02-06-00",3,null,13,5,2,6,0,"05","02","06","00"]
["05-03-00-05",3,null,13,5,3,0,5,"05","03","00","05"]
["05-03-01-04",3,null,13,5,3,1,4,"05","03","01","04"]
["05-03-02-03",3,null,13,5,3,2,3,"05","03","02","03"]
["05-03-03-02",3,null,13,5,3,3,2,"05","03","03","02"]
["05-03-04-01",3,null,13,5,3,4,1,"05","03","04","01"]
["05-03-05-00",3,null,13,5,3,5,0,"05","03","05","00"]
[{"$f":"I2247&\"-\"&J2247&\"-\"&K2247&\"-\"&L2247","v":"05-04-00-04"},3,null,13,5,4,0,4,"05","04","00","04"]
["05-04-01-03",3,null,13,5,4,1,3,{"$f":"IF(LEN(E2248)=1,0&E2248,IF(LEN(E2248)=0,\"00\",RIGHT(E2248,2)))","v":"05"},{"$f":"IF(LEN(F2248)=1,0&F2248,IF(LEN(F2248)=0,\"00\",RIGHT(F2248,2)))","v":"04"},{"$f":"IF(LEN(G2248)=1,0&G2248,IF(LEN(G2248)=0,\"00\",RIGHT(G2248,2)))","v":"01"},{"$f":"IF(LEN(H2248)=1,0&H2248,IF(LEN(H2248)=0,\"00\",RIGHT(H2248,2)))","v":"03"}]
["05-04-02-02",3,null,13,5,4,2,2,"05","04","02","02"]
["05-04-03-01",3,null,13,5,4,3,1,"05","04","03","01"]
["05-04-04-00",3,null,13,5,4,4,0,"05","04","04","00"]
["05-05-00-03",3,null,13,5,5,0,3,"05","05","00","03"]
["05-05-01-02",2,null,13,5,5,1,2,"05","05","01","02"]
["05-05-02-01",2,null,13,5,5,2,1,"05","05","02","01"]
["05-05-03-00",2,null,13,5,5,3,0,"05","05","03","00"]
["05-06-00-02",2,null,13,5,6,0,2,"05","06","00","02"]
["05-06-01-01",2,null,13,5,6,1,1,"05","06","01","01"]
["05-06-02-00",2,null,13,5,6,2,0,"05","06","02","00"]
["05-07-00-01",2,null,13,5,7,0,1,"05","07","00","01"]
["05-07-01-00",2,null,13,5,7,1,0,"05","07","01","00"]
["05-08-00-00",2,null,13,5,8,0,0,"05","08","00","00"]
["06-00-00-07",4,null,13,6,0,0,7,"06","00","00","07"]
["06-00-01-06",4,null,13,6,0,1,6,"06","00","01","06"]
["06-00-02-05",4,null,13,6,0,2,5,"06","00","02","05"]
["06-00-03-04",4,null,13,6,0,3,4,"06","00","03","04"]
["06-00-04-03",4,null,13,6,0,4,3,"06","00","04","03"]
["06-00-05-02",3,null,13,6,0,5,2,"06","00","05","02"]
["06-00-06-01",3,null,13,6,0,6,1,"06","00","06","01"]
["06-00-07-00",3,null,13,6,0,7,0,"06","00","07","00"]
["06-01-00-06",3,null,13,6,1,0,6,"06","01","00","06"]
["06-01-01-05",3,null,13,6,1,1,5,"06","01","01","05"]
["06-01-02-04",3,null,13,6,1,2,4,"06","01","02","04"]
["06-01-03-03",3,null,13,6,1,3,3,"06","01","03","03"]
["06-01-04-02",3,null,13,6,1,4,2,"06","01","04","02"]
["06-01-05-01",3,null,13,6,1,5,1,"06","01","05","01"]
["06-01-06-00",3,null,13,6,1,6,0,"06","01","06","00"]
["06-02-00-05",3,null,13,6,2,0,5,"06","02","00","05"]
["06-02-01-04",3,null,13,6,2,1,4,"06","02","01","04"]
["06-02-02-03",3,null,13,6,2,2,3,"06","02","02","03"]
["06-02-03-02",3,null,13,6,2,3,2,"06","02","03","02"]
["06-02-04-01",3,null,13,6,2,4,1,"06","02","04","01"]
["06-02-05-00",3,null,13,6,2,5,0,"06","02","05","00"]
["06-03-00-04",3,null,13,6,3,0,4,"06","03","00","04"]
["06-03-01-03",3,null,13,6,3,1,3,"06","03","01","03"]
["06-03-02-02",3,null,13,6,3,2,2,"06","03","02","02"]
["06-03-03-01",3,null,13,6,3,3,1,"06","03","03","01"]
["06-03-04-00",3,null,13,6,3,4,0,"06","03","04","00"]
["06-04-00-03",3,null,13,6,4,0,3,"06","04","00","03"]
["06-04-01-02",2,null,13,6,4,1,2,"06","04","01","02"]
["06-04-02-01",2,null,13,6,4,2,1,"06","04","02","01"]
["06-04-03-00",2,null,13,6,4,3,0,"06","04","03","00"]
["06-05-00-02",2,null,13,6,5,0,2,"06","05","00","02"]
["06-05-01-01",2,null,13,6,5,1,1,"06","05","01","01"]
["06-05-02-00",2,null,13,6,5,2,0,"06","05","02","00"]
["06-06-00-01",2,null,13,6,6,0,1,"06","06","00","01"]
["06-06-01-00",2,null,13,6,6,1,0,"06","06","01","00"]
["06-07-00-00",2,null,13,6,7,0,0,"06","07","00","00"]
["07-00-00-06",3,null,13,7,0,0,6,"07","00","00","06"]
["07-00-01-05",3,null,13,7,0,1,5,"07","00","01","05"]
["07-00-02-04",3,null,13,7,0,2,4,"07","00","02","04"]
["07-00-03-03",3,null,13,7,0,3,3,"07","00","03","03"]
["07-00-04-02",3,null,13,7,0,4,2,"07","00","04","02"]
["07-00-05-01",3,null,13,7,0,5,1,"07","00","05","01"]
["07-00-06-00",3,null,13,7,0,6,0,"07","00","06","00"]
["07-01-00-05",3,null,13,7,1,0,5,"07","01","00","05"]
["07-01-01-04",3,null,13,7,1,1,4,"07","01","01","04"]
["07-01-02-03",3,null,13,7,1,2,3,"07","01","02","03"]
["07-01-03-02",3,null,13,7,1,3,2,"07","01","03","02"]
["07-01-04-01",3,null,13,7,1,4,1,"07","01","04","01"]
["07-01-05-00",3,null,13,7,1,5,0,"07","01","05","00"]
[{"$f":"I2311&\"-\"&J2311&\"-\"&K2311&\"-\"&L2311","v":"07-02-00-04"},3,null,13,7,2,0,4,"07","02","00","04"]
["07-02-01-03",3,null,13,7,2,1,3,{"$f":"IF(LEN(E2312)=1,0&E2312,IF(LEN(E2312)=0,\"00\",RIGHT(E2312,2)))","v":"07"},{"$f":"IF(LEN(F2312)=1,0&F2312,IF(LEN(F2312)=0,\"00\",RIGHT(F2312,2)))","v":"02"},{"$f":"IF(LEN(G2312)=1,0&G2312,IF(LEN(G2312)=0,\"00\",RIGHT(G2312,2)))","v":"01"},{"$f":"IF(LEN(H2312)=1,0&H2312,IF(LEN(H2312)=0,\"00\",RIGHT(H2312,2)))","v":"03"}]
["07-02-02-02",3,null,13,7,2,2,2,"07","02","02","02"]
["07-02-03-01",3,null,13,7,2,3,1,"07","02","03","01"]
["07-02-04-00",3,null,13,7,2,4,0,"07","02","04","00"]
["07-03-00-03",3,null,13,7,3,0,3,"07","03","00","03"]
["07-03-01-02",2,null,13,7,3,1,2,"07","03","01","02"]
["07-03-02-01",2,null,13,7,3,2,1,"07","03","02","01"]
["07-03-03-00",2,null,13,7,3,3,0,"07","03","03","00"]
["07-04-00-02",2,null,13,7,4,0,2,"07","04","00","02"]
["07-04-01-01",2,null,13,7,4,1,1,"07","04","01","01"]
["07-04-02-00",2,null,13,7,4,2,0,"07","04","02","00"]
["07-05-00-01",2,null,13,7,5,0,1,"07","05","00","01"]
["07-05-01-00",2,null,13,7,5,1,0,"07","05","01","00"]
["07-06-00-00",2,null,13,7,6,0,0,"07","06","00","00"]
["08-00-00-05",3,null,13,8,0,0,5,"08","00","00","05"]
["08-00-01-04",3,null,13,8,0,1,4,"08","00","01","04"]
["08-00-02-03",3,null,13,8,0,2,3,"08","00","02","03"]
["08-00-03-02",3,null,13,8,0,3,2,"08","00","03","02"]
["08-00-04-01",3,null,13,8,0,4,1,"08","00","04","01"]
["08-00-05-00",3,null,13,8,0,5,0,"08","00","05","00"]
["08-01-00-04",3,null,13,8,1,0,4,"08","01","00","04"]
["08-01-01-03",3,null,13,8,1,1,3,"08","01","01","03"]
["08-01-02-02",3,null,13,8,1,2,2,"08","01","02","02"]
["08-01-03-01",3,null,13,8,1,3,1,"08","01","03","01"]
["08-01-04-00",3,null,13,8,1,4,0,"08","01","04","00"]
["08-02-00-03",3,null,13,8,2,0,3,"08","02","00","03"]
["08-02-01-02",2,null,13,8,2,1,2,"08","02","01","02"]
["08-02-02-01",2,null,13,8,2,2,1,"08","02","02","01"]
["08-02-03-00",2,null,13,8,2,3,0,"08","02","03","00"]
["08-03-00-02",2,null,13,8,3,0,2,"08","03","00","02"]
["08-03-01-01",2,null,13,8,3,1,1,"08","03","01","01"]
["08-03-02-00",2,null,13,8,3,2,0,"08","03","02","00"]
["08-04-00-01",2,null,13,8,4,0,1,"08","04","00","01"]
["08-04-01-00",2,null,13,8,4,1,0,"08","04","01","00"]
["08-05-00-00",2,null,13,8,5,0,0,"08","05","00","00"]
["09-00-00-04",3,null,13,9,0,0,4,"09","00","00","04"]
["09-00-01-03",3,null,13,9,0,1,3,"09","00","01","03"]
["09-00-02-02",3,null,13,9,0,2,2,"09","00","02","02"]
["09-00-03-01",3,null,13,9,0,3,1,"09","00","03","01"]
["09-00-04-00",3,null,13,9,0,4,0,"09","00","04","00"]
["09-01-00-03",3,null,13,9,1,0,3,"09","01","00","03"]
["09-01-01-02",2,null,13,9,1,1,2,"09","01","01","02"]
["09-01-02-01",2,null,13,9,1,2,1,"09","01","02","01"]
["09-01-03-00",2,null,13,9,1,3,0,"09","01","03","00"]
["09-02-00-02",2,null,13,9,2,0,2,"09","02","00","02"]
["09-02-01-01",2,null,13,9,2,1,1,"09","02","01","01"]
["09-02-02-00",2,null,13,9,2,2,0,"09","02","02","00"]
["09-03-00-01",2,null,13,9,3,0,1,"09","03","00","01"]
["09-03-01-00",2,null,13,9,3,1,0,"09","03","01","00"]
["09-04-00-00",2,null,13,9,4,0,0,"09","04","00","00"]
["10-00-00-03",3,null,13,10,0,0,3,"10","00","00","03"]
["10-00-01-02",2,null,13,10,0,1,2,"10","00","01","02"]
["10-00-02-01",2,null,13,10,0,2,1,"10","00","02","01"]
["10-00-03-00",2,null,13,10,0,3,0,"10","00","03","00"]
["10-01-00-02",2,null,13,10,1,0,2,"10","01","00","02"]
["10-01-01-01",2,null,13,10,1,1,1,"10","01","01","01"]
["10-01-02-00",2,null,13,10,1,2,0,"10","01","02","00"]
["10-02-00-01",2,null,13,10,2,0,1,"10","02","00","01"]
["10-02-01-00",2,null,13,10,2,1,0,"10","02","01","00"]
["10-03-00-00",2,null,13,10,3,0,0,"10","03","00","00"]
["11-00-00-02",2,null,13,11,0,0,2,"11","00","00","02"]
["11-00-01-01",2,null,13,11,0,1,1,"11","00","01","01"]
["11-00-02-00",2,null,13,11,0,2,0,"11","00","02","00"]
[{"$f":"I2375&\"-\"&J2375&\"-\"&K2375&\"-\"&L2375","v":"11-01-00-01"},2,null,13,11,1,0,1,"11","01","00","01"]
["11-01-01-00",2,null,13,11,1,1,0,{"$f":"IF(LEN(E2376)=1,0&E2376,IF(LEN(E2376)=0,\"00\",RIGHT(E2376,2)))","v":"11"},{"$f":"IF(LEN(F2376)=1,0&F2376,IF(LEN(F2376)=0,\"00\",RIGHT(F2376,2)))","v":"01"},{"$f":"IF(LEN(G2376)=1,0&G2376,IF(LEN(G2376)=0,\"00\",RIGHT(G2376,2)))","v":"01"},{"$f":"IF(LEN(H2376)=1,0&H2376,IF(LEN(H2376)=0,\"00\",RIGHT(H2376,2)))","v":"00"}]
["11-02-00-00",2,null,13,11,2,0,0,"11","02","00","00"]
["12-00-00-01",2,null,13,12,0,0,1,"12","00","00","01"]
["12-00-01-00",2,null,13,12,0,1,0,"12","00","01","00"]
["12-01-00-00",2,null,13,12,1,0,0,"12","01","00","00"]
["13-00-00-00",1,null,13,13,0,0,0,"13","00","00","00"]
["00-00-00-14",7,null,14,0,0,0,14,"00","00","00","14"]
["00-00-01-13",6,null,14,0,0,1,13,"00","00","01","13"]
["00-00-02-12",6,null,14,0,0,2,12,"00","00","02","12"]
["00-00-03-11",6,null,14,0,0,3,11,"00","00","03","11"]
["00-00-04-10",6,null,14,0,0,4,10,"00","00","04","10"]
["00-00-05-09",6,null,14,0,0,5,9,"00","00","05","09"]
["00-00-06-08",6,null,14,0,0,6,8,"00","00","06","08"]
["00-00-07-07",6,null,14,0,0,7,7,"00","00","07","07"]
["00-00-08-06",5,null,14,0,0,8,6,"00","00","08","06"]
["00-00-09-05",5,null,14,0,0,9,5,"00","00","09","05"]
["00-00-10-04",5,null,14,0,0,10,4,"00","00","10","04"]
["00-00-11-03",5,null,14,0,0,11,3,"00","00","11","03"]
["00-00-12-02",4,null,14,0,0,12,2,"00","00","12","02"]
["00-00-13-01",4,null,14,0,0,13,1,"00","00","13","01"]
["00-00-14-00",4,null,14,0,0,14,0,"00","00","14","00"]
["00-01-00-13",5,null,14,0,1,0,13,"00","01","00","13"]
["00-01-01-12",5,null,14,0,1,1,12,"00","01","01","12"]
["00-01-02-11",5,null,14,0,1,2,11,"00","01","02","11"]
["00-01-03-10",5,null,14,0,1,3,10,"00","01","03","10"]
["00-01-04-09",5,null,14,0,1,4,9,"00","01","04","09"]
["00-01-05-08",5,null,14,0,1,5,8,"00","01","05","08"]
["00-01-06-07",5,null,14,0,1,6,7,"00","01","06","07"]
["00-01-07-06",5,null,14,0,1,7,6,"00","01","07","06"]
["00-01-08-05",5,null,14,0,1,8,5,"00","01","08","05"]
["00-01-09-04",5,null,14,0,1,9,4,"00","01","09","04"]
["00-01-10-03",5,null,14,0,1,10,3,"00","01","10","03"]
["00-01-11-02",4,null,14,0,1,11,2,"00","01","11","02"]
["00-01-12-01",4,null,14,0,1,12,1,"00","01","12","01"]
["00-01-13-00",4,null,14,0,1,13,0,"00","01","13","00"]
["00-02-00-12",5,null,14,0,2,0,12,"00","02","00","12"]
["00-02-01-11",5,null,14,0,2,1,11,"00","02","01","11"]
["00-02-02-10",5,null,14,0,2,2,10,"00","02","02","10"]
["00-02-03-09",5,null,14,0,2,3,9,"00","02","03","09"]
["00-02-04-08",5,null,14,0,2,4,8,"00","02","04","08"]
["00-02-05-07",5,null,14,0,2,5,7,"00","02","05","07"]
["00-02-06-06",5,null,14,0,2,6,6,"00","02","06","06"]
["00-02-07-05",5,null,14,0,2,7,5,"00","02","07","05"]
["00-02-08-04",5,null,14,0,2,8,4,"00","02","08","04"]
["00-02-09-03",5,null,14,0,2,9,3,"00","02","09","03"]
["00-02-10-02",4,null,14,0,2,10,2,"00","02","10","02"]
["00-02-11-01",4,null,14,0,2,11,1,"00","02","11","01"]
["00-02-12-00",4,null,14,0,2,12,0,"00","02","12","00"]
["00-03-00-11",5,null,14,0,3,0,11,"00","03","00","11"]
["00-03-01-10",5,null,14,0,3,1,10,"00","03","01","10"]
["00-03-02-09",5,null,14,0,3,2,9,"00","03","02","09"]
["00-03-03-08",5,null,14,0,3,3,8,"00","03","03","08"]
["00-03-04-07",5,null,14,0,3,4,7,"00","03","04","07"]
["00-03-05-06",5,null,14,0,3,5,6,"00","03","05","06"]
["00-03-06-05",5,null,14,0,3,6,5,"00","03","06","05"]
["00-03-07-04",5,null,14,0,3,7,4,"00","03","07","04"]
["00-03-08-03",5,null,14,0,3,8,3,"00","03","08","03"]
["00-03-09-02",4,null,14,0,3,9,2,"00","03","09","02"]
["00-03-10-01",4,null,14,0,3,10,1,"00","03","10","01"]
["00-03-11-00",4,null,14,0,3,11,0,"00","03","11","00"]
["00-04-00-10",5,null,14,0,4,0,10,"00","04","00","10"]
["00-04-01-09",5,null,14,0,4,1,9,"00","04","01","09"]
["00-04-02-08",5,null,14,0,4,2,8,"00","04","02","08"]
[{"$f":"I2439&\"-\"&J2439&\"-\"&K2439&\"-\"&L2439","v":"00-04-03-07"},5,null,14,0,4,3,7,"00","04","03","07"]
["00-04-04-06",5,null,14,0,4,4,6,{"$f":"IF(LEN(E2440)=1,0&E2440,IF(LEN(E2440)=0,\"00\",RIGHT(E2440,2)))","v":"00"},{"$f":"IF(LEN(F2440)=1,0&F2440,IF(LEN(F2440)=0,\"00\",RIGHT(F2440,2)))","v":"04"},{"$f":"IF(LEN(G2440)=1,0&G2440,IF(LEN(G2440)=0,\"00\",RIGHT(G2440,2)))","v":"04"},{"$f":"IF(LEN(H2440)=1,0&H2440,IF(LEN(H2440)=0,\"00\",RIGHT(H2440,2)))","v":"06"}]
["00-04-05-05",5,null,14,0,4,5,5,"00","04","05","05"]
["00-04-06-04",5,null,14,0,4,6,4,"00","04","06","04"]
["00-04-07-03",5,null,14,0,4,7,3,"00","04","07","03"]
["00-04-08-02",4,null,14,0,4,8,2,"00","04","08","02"]
["00-04-09-01",4,null,14,0,4,9,1,"00","04","09","01"]
["00-04-10-00",4,null,14,0,4,10,0,"00","04","10","00"]
["00-05-00-09",5,null,14,0,5,0,9,"00","05","00","09"]
["00-05-01-08",5,null,14,0,5,1,8,"00","05","01","08"]
["00-05-02-07",5,null,14,0,5,2,7,"00","05","02","07"]
["00-05-03-06",5,null,14,0,5,3,6,"00","05","03","06"]
["00-05-04-05",5,null,14,0,5,4,5,"00","05","04","05"]
["00-05-05-04",4,null,14,0,5,5,4,"00","05","05","04"]
["00-05-06-03",4,null,14,0,5,6,3,"00","05","06","03"]
["00-05-07-02",4,null,14,0,5,7,2,"00","05","07","02"]
["00-05-08-01",4,null,14,0,5,8,1,"00","05","08","01"]
["00-05-09-00",4,null,14,0,5,9,0,"00","05","09","00"]
["00-06-00-08",5,null,14,0,6,0,8,"00","06","00","08"]
["00-06-01-07",5,null,14,0,6,1,7,"00","06","01","07"]
["00-06-02-06",5,null,14,0,6,2,6,"00","06","02","06"]
["00-06-03-05",4,null,14,0,6,3,5,"00","06","03","05"]
["00-06-04-04",4,null,14,0,6,4,4,"00","06","04","04"]
["00-06-05-03",4,null,14,0,6,5,3,"00","06","05","03"]
["00-06-06-02",4,null,14,0,6,6,2,"00","06","06","02"]
["00-06-07-01",4,null,14,0,6,7,1,"00","06","07","01"]
["00-06-08-00",4,null,14,0,6,8,0,"00","06","08","00"]
["00-07-00-07",4,null,14,0,7,0,7,"00","07","00","07"]
["00-07-01-06",4,null,14,0,7,1,6,"00","07","01","06"]
["00-07-02-05",4,null,14,0,7,2,5,"00","07","02","05"]
["00-07-03-04",4,null,14,0,7,3,4,"00","07","03","04"]
["00-07-04-03",4,null,14,0,7,4,3,"00","07","04","03"]
["00-07-05-02",4,null,14,0,7,5,2,"00","07","05","02"]
["00-07-06-01",4,null,14,0,7,6,1,"00","07","06","01"]
["00-07-07-00",4,null,14,0,7,7,0,"00","07","07","00"]
["00-08-00-06",3,null,14,0,8,0,6,"00","08","00","06"]
["00-08-01-05",3,null,14,0,8,1,5,"00","08","01","05"]
["00-08-02-04",3,null,14,0,8,2,4,"00","08","02","04"]
["00-08-03-03",3,null,14,0,8,3,3,"00","08","03","03"]
["00-08-04-02",3,null,14,0,8,4,2,"00","08","04","02"]
["00-08-05-01",3,null,14,0,8,5,1,"00","08","05","01"]
["00-08-06-00",3,null,14,0,8,6,0,"00","08","06","00"]
["00-09-00-05",3,null,14,0,9,0,5,"00","09","00","05"]
["00-09-01-04",3,null,14,0,9,1,4,"00","09","01","04"]
["00-09-02-03",3,null,14,0,9,2,3,"00","09","02","03"]
["00-09-03-02",3,null,14,0,9,3,2,"00","09","03","02"]
["00-09-04-01",3,null,14,0,9,4,1,"00","09","04","01"]
["00-09-05-00",3,null,14,0,9,5,0,"00","09","05","00"]
["00-10-00-04",3,null,14,0,10,0,4,"00","10","00","04"]
["00-10-01-03",3,null,14,0,10,1,3,"00","10","01","03"]
["00-10-02-02",3,null,14,0,10,2,2,"00","10","02","02"]
["00-10-03-01",3,null,14,0,10,3,1,"00","10","03","01"]
["00-10-04-00",3,null,14,0,10,4,0,"00","10","04","00"]
["00-11-00-03",3,null,14,0,11,0,3,"00","11","00","03"]
["00-11-01-02",3,null,14,0,11,1,2,"00","11","01","02"]
["00-11-02-01",3,null,14,0,11,2,1,"00","11","02","01"]
["00-11-03-00",3,null,14,0,11,3,0,"00","11","03","00"]
["00-12-00-02",3,null,14,0,12,0,2,"00","12","00","02"]
["00-12-01-01",3,null,14,0,12,1,1,"00","12","01","01"]
["00-12-02-00",2,null,14,0,12,2,0,"00","12","02","00"]
["00-13-00-01",2,null,14,0,13,0,1,"00","13","00","01"]
["00-13-01-00",2,null,14,0,13,1,0,"00","13","01","00"]
["00-14-00-00",2,null,14,0,14,0,0,"00","14","00","00"]
["01-00-00-13",5,null,14,1,0,0,13,"01","00","00","13"]
[{"$f":"I2503&\"-\"&J2503&\"-\"&K2503&\"-\"&L2503","v":"01-00-01-12"},5,null,14,1,0,1,12,"01","00","01","12"]
["01-00-02-11",5,null,14,1,0,2,11,{"$f":"IF(LEN(E2504)=1,0&E2504,IF(LEN(E2504)=0,\"00\",RIGHT(E2504,2)))","v":"01"},{"$f":"IF(LEN(F2504)=1,0&F2504,IF(LEN(F2504)=0,\"00\",RIGHT(F2504,2)))","v":"00"},{"$f":"IF(LEN(G2504)=1,0&G2504,IF(LEN(G2504)=0,\"00\",RIGHT(G2504,2)))","v":"02"},{"$f":"IF(LEN(H2504)=1,0&H2504,IF(LEN(H2504)=0,\"00\",RIGHT(H2504,2)))","v":"11"}]
["01-00-03-10",5,null,14,1,0,3,10,"01","00","03","10"]
["01-00-04-09",5,null,14,1,0,4,9,"01","00","04","09"]
["01-00-05-08",5,null,14,1,0,5,8,"01","00","05","08"]
["01-00-06-07",5,null,14,1,0,6,7,"01","00","06","07"]
["01-00-07-06",5,null,14,1,0,7,6,"01","00","07","06"]
["01-00-08-05",5,null,14,1,0,8,5,"01","00","08","05"]
["01-00-09-04",5,null,14,1,0,9,4,"01","00","09","04"]
["01-00-10-03",5,null,14,1,0,10,3,"01","00","10","03"]
["01-00-11-02",4,null,14,1,0,11,2,"01","00","11","02"]
["01-00-12-01",4,null,14,1,0,12,1,"01","00","12","01"]
["01-00-13-00",4,null,14,1,0,13,0,"01","00","13","00"]
["01-01-00-12",5,null,14,1,1,0,12,"01","01","00","12"]
["01-01-01-11",5,null,14,1,1,1,11,"01","01","01","11"]
["01-01-02-10",5,null,14,1,1,2,10,"01","01","02","10"]
["01-01-03-09",5,null,14,1,1,3,9,"01","01","03","09"]
["01-01-04-08",5,null,14,1,1,4,8,"01","01","04","08"]
["01-01-05-07",5,null,14,1,1,5,7,"01","01","05","07"]
["01-01-06-06",5,null,14,1,1,6,6,"01","01","06","06"]
["01-01-07-05",5,null,14,1,1,7,5,"01","01","07","05"]
["01-01-08-04",5,null,14,1,1,8,4,"01","01","08","04"]
["01-01-09-03",5,null,14,1,1,9,3,"01","01","09","03"]
["01-01-10-02",4,null,14,1,1,10,2,"01","01","10","02"]
["01-01-11-01",4,null,14,1,1,11,1,"01","01","11","01"]
["01-01-12-00",4,null,14,1,1,12,0,"01","01","12","00"]
["01-02-00-11",5,null,14,1,2,0,11,"01","02","00","11"]
["01-02-01-10",5,null,14,1,2,1,10,"01","02","01","10"]
["01-02-02-09",5,null,14,1,2,2,9,"01","02","02","09"]
["01-02-03-08",5,null,14,1,2,3,8,"01","02","03","08"]
["01-02-04-07",5,null,14,1,2,4,7,"01","02","04","07"]
["01-02-05-06",5,null,14,1,2,5,6,"01","02","05","06"]
["01-02-06-05",5,null,14,1,2,6,5,"01","02","06","05"]
["01-02-07-04",5,null,14,1,2,7,4,"01","02","07","04"]
["01-02-08-03",5,null,14,1,2,8,3,"01","02","08","03"]
["01-02-09-02",4,null,14,1,2,9,2,"01","02","09","02"]
["01-02-10-01",4,null,14,1,2,10,1,"01","02","10","01"]
["01-02-11-00",4,null,14,1,2,11,0,"01","02","11","00"]
["01-03-00-10",5,null,14,1,3,0,10,"01","03","00","10"]
["01-03-01-09",5,null,14,1,3,1,9,"01","03","01","09"]
["01-03-02-08",5,null,14,1,3,2,8,"01","03","02","08"]
["01-03-03-07",5,null,14,1,3,3,7,"01","03","03","07"]
["01-03-04-06",5,null,14,1,3,4,6,"01","03","04","06"]
["01-03-05-05",5,null,14,1,3,5,5,"01","03","05","05"]
["01-03-06-04",4,null,14,1,3,6,4,"01","03","06","04"]
["01-03-07-03",4,null,14,1,3,7,3,"01","03","07","03"]
["01-03-08-02",4,null,14,1,3,8,2,"01","03","08","02"]
["01-03-09-01",4,null,14,1,3,9,1,"01","03","09","01"]
["01-03-10-00",4,null,14,1,3,10,0,"01","03","10","00"]
["01-04-00-09",5,null,14,1,4,0,9,"01","04","00","09"]
["01-04-01-08",5,null,14,1,4,1,8,"01","04","01","08"]
["01-04-02-07",5,null,14,1,4,2,7,"01","04","02","07"]
["01-04-03-06",5,null,14,1,4,3,6,"01","04","03","06"]
["01-04-04-05",4,null,14,1,4,4,5,"01","04","04","05"]
["01-04-05-04",4,null,14,1,4,5,4,"01","04","05","04"]
["01-04-06-03",4,null,14,1,4,6,3,"01","04","06","03"]
["01-04-07-02",4,null,14,1,4,7,2,"01","04","07","02"]
["01-04-08-01",4,null,14,1,4,8,1,"01","04","08","01"]
["01-04-09-00",4,null,14,1,4,9,0,"01","04","09","00"]
["01-05-00-08",5,null,14,1,5,0,8,"01","05","00","08"]
["01-05-01-07",4,null,14,1,5,1,7,"01","05","01","07"]
["01-05-02-06",4,null,14,1,5,2,6,"01","05","02","06"]
["01-05-03-05",4,null,14,1,5,3,5,"01","05","03","05"]
["01-05-04-04",4,null,14,1,5,4,4,"01","05","04","04"]
[{"$f":"I2567&\"-\"&J2567&\"-\"&K2567&\"-\"&L2567","v":"01-05-05-03"},4,null,14,1,5,5,3,"01","05","05","03"]
["01-05-06-02",4,null,14,1,5,6,2,{"$f":"IF(LEN(E2568)=1,0&E2568,IF(LEN(E2568)=0,\"00\",RIGHT(E2568,2)))","v":"01"},{"$f":"IF(LEN(F2568)=1,0&F2568,IF(LEN(F2568)=0,\"00\",RIGHT(F2568,2)))","v":"05"},{"$f":"IF(LEN(G2568)=1,0&G2568,IF(LEN(G2568)=0,\"00\",RIGHT(G2568,2)))","v":"06"},{"$f":"IF(LEN(H2568)=1,0&H2568,IF(LEN(H2568)=0,\"00\",RIGHT(H2568,2)))","v":"02"}]
["01-05-07-01",4,null,14,1,5,7,1,"01","05","07","01"]
["01-05-08-00",4,null,14,1,5,8,0,"01","05","08","00"]
["01-06-00-07",4,null,14,1,6,0,7,"01","06","00","07"]
["01-06-01-06",4,null,14,1,6,1,6,"01","06","01","06"]
["01-06-02-05",4,null,14,1,6,2,5,"01","06","02","05"]
["01-06-03-04",4,null,14,1,6,3,4,"01","06","03","04"]
["01-06-04-03",4,null,14,1,6,4,3,"01","06","04","03"]
["01-06-05-02",4,null,14,1,6,5,2,"01","06","05","02"]
["01-06-06-01",4,null,14,1,6,6,1,"01","06","06","01"]
["01-06-07-00",4,null,14,1,6,7,0,"01","06","07","00"]
["01-07-00-06",3,null,14,1,7,0,6,"01","07","00","06"]
["01-07-01-05",3,null,14,1,7,1,5,"01","07","01","05"]
["01-07-02-04",3,null,14,1,7,2,4,"01","07","02","04"]
["01-07-03-03",3,null,14,1,7,3,3,"01","07","03","03"]
["01-07-04-02",3,null,14,1,7,4,2,"01","07","04","02"]
["01-07-05-01",3,null,14,1,7,5,1,"01","07","05","01"]
["01-07-06-00",3,null,14,1,7,6,0,"01","07","06","00"]
["01-08-00-05",3,null,14,1,8,0,5,"01","08","00","05"]
["01-08-01-04",3,null,14,1,8,1,4,"01","08","01","04"]
["01-08-02-03",3,null,14,1,8,2,3,"01","08","02","03"]
["01-08-03-02",3,null,14,1,8,3,2,"01","08","03","02"]
["01-08-04-01",3,null,14,1,8,4,1,"01","08","04","01"]
["01-08-05-00",3,null,14,1,8,5,0,"01","08","05","00"]
["01-09-00-04",3,null,14,1,9,0,4,"01","09","00","04"]
["01-09-01-03",3,null,14,1,9,1,3,"01","09","01","03"]
["01-09-02-02",3,null,14,1,9,2,2,"01","09","02","02"]
["01-09-03-01",3,null,14,1,9,3,1,"01","09","03","01"]
["01-09-04-00",3,null,14,1,9,4,0,"01","09","04","00"]
["01-10-00-03",3,null,14,1,10,0,3,"01","10","00","03"]
["01-10-01-02",3,null,14,1,10,1,2,"01","10","01","02"]
["01-10-02-01",3,null,14,1,10,2,1,"01","10","02","01"]
["01-10-03-00",2,null,14,1,10,3,0,"01","10","03","00"]
["01-11-00-02",2,null,14,1,11,0,2,"01","11","00","02"]
["01-11-01-01",2,null,14,1,11,1,1,"01","11","01","01"]
["01-11-02-00",2,null,14,1,11,2,0,"01","11","02","00"]
["01-12-00-01",2,null,14,1,12,0,1,"01","12","00","01"]
["01-12-01-00",2,null,14,1,12,1,0,"01","12","01","00"]
["01-13-00-00",2,null,14,1,13,0,0,"01","13","00","00"]
["02-00-00-12",5,null,14,2,0,0,12,"02","00","00","12"]
["02-00-01-11",5,null,14,2,0,1,11,"02","00","01","11"]
["02-00-02-10",5,null,14,2,0,2,10,"02","00","02","10"]
["02-00-03-09",5,null,14,2,0,3,9,"02","00","03","09"]
["02-00-04-08",5,null,14,2,0,4,8,"02","00","04","08"]
["02-00-05-07",5,null,14,2,0,5,7,"02","00","05","07"]
["02-00-06-06",5,null,14,2,0,6,6,"02","00","06","06"]
["02-00-07-05",5,null,14,2,0,7,5,"02","00","07","05"]
["02-00-08-04",5,null,14,2,0,8,4,"02","00","08","04"]
["02-00-09-03",5,null,14,2,0,9,3,"02","00","09","03"]
["02-00-10-02",4,null,14,2,0,10,2,"02","00","10","02"]
["02-00-11-01",4,null,14,2,0,11,1,"02","00","11","01"]
["02-00-12-00",4,null,14,2,0,12,0,"02","00","12","00"]
["02-01-00-11",5,null,14,2,1,0,11,"02","01","00","11"]
["02-01-01-10",5,null,14,2,1,1,10,"02","01","01","10"]
["02-01-02-09",5,null,14,2,1,2,9,"02","01","02","09"]
["02-01-03-08",5,null,14,2,1,3,8,"02","01","03","08"]
["02-01-04-07",5,null,14,2,1,4,7,"02","01","04","07"]
["02-01-05-06",5,null,14,2,1,5,6,"02","01","05","06"]
["02-01-06-05",5,null,14,2,1,6,5,"02","01","06","05"]
["02-01-07-04",4,null,14,2,1,7,4,"02","01","07","04"]
["02-01-08-03",4,null,14,2,1,8,3,"02","01","08","03"]
["02-01-09-02",4,null,14,2,1,9,2,"02","01","09","02"]
["02-01-10-01",4,null,14,2,1,10,1,"02","01","10","01"]
[{"$f":"I2631&\"-\"&J2631&\"-\"&K2631&\"-\"&L2631","v":"02-01-11-00"},4,null,14,2,1,11,0,"02","01","11","00"]
["02-02-00-10",5,null,14,2,2,0,10,{"$f":"IF(LEN(E2632)=1,0&E2632,IF(LEN(E2632)=0,\"00\",RIGHT(E2632,2)))","v":"02"},{"$f":"IF(LEN(F2632)=1,0&F2632,IF(LEN(F2632)=0,\"00\",RIGHT(F2632,2)))","v":"02"},{"$f":"IF(LEN(G2632)=1,0&G2632,IF(LEN(G2632)=0,\"00\",RIGHT(G2632,2)))","v":"00"},{"$f":"IF(LEN(H2632)=1,0&H2632,IF(LEN(H2632)=0,\"00\",RIGHT(H2632,2)))","v":"10"}]
["02-02-01-09",5,null,14,2,2,1,9,"02","02","01","09"]
["02-02-02-08",5,null,14,2,2,2,8,"02","02","02","08"]
["02-02-03-07",5,null,14,2,2,3,7,"02","02","03","07"]
["02-02-04-06",5,null,14,2,2,4,6,"02","02","04","06"]
["02-02-05-05",4,null,14,2,2,5,5,"02","02","05","05"]
["02-02-06-04",4,null,14,2,2,6,4,"02","02","06","04"]
["02-02-07-03",4,null,14,2,2,7,3,"02","02","07","03"]
["02-02-08-02",4,null,14,2,2,8,2,"02","02","08","02"]
["02-02-09-01",4,null,14,2,2,9,1,"02","02","09","01"]
["02-02-10-00",4,null,14,2,2,10,0,"02","02","10","00"]
["02-03-00-09",5,null,14,2,3,0,9,"02","03","00","09"]
["02-03-01-08",5,null,14,2,3,1,8,"02","03","01","08"]
["02-03-02-07",4,null,14,2,3,2,7,"02","03","02","07"]
["02-03-03-06",4,null,14,2,3,3,6,"02","03","03","06"]
["02-03-04-05",4,null,14,2,3,4,5,"02","03","04","05"]
["02-03-05-04",4,null,14,2,3,5,4,"02","03","05","04"]
["02-03-06-03",4,null,14,2,3,6,3,"02","03","06","03"]
["02-03-07-02",4,null,14,2,3,7,2,"02","03","07","02"]
["02-03-08-01",4,null,14,2,3,8,1,"02","03","08","01"]
["02-03-09-00",4,null,14,2,3,9,0,"02","03","09","00"]
["02-04-00-08",4,null,14,2,4,0,8,"02","04","00","08"]
["02-04-01-07",4,null,14,2,4,1,7,"02","04","01","07"]
["02-04-02-06",4,null,14,2,4,2,6,"02","04","02","06"]
["02-04-03-05",4,null,14,2,4,3,5,"02","04","03","05"]
["02-04-04-04",4,null,14,2,4,4,4,"02","04","04","04"]
["02-04-05-03",4,null,14,2,4,5,3,"02","04","05","03"]
["02-04-06-02",4,null,14,2,4,6,2,"02","04","06","02"]
["02-04-07-01",4,null,14,2,4,7,1,"02","04","07","01"]
["02-04-08-00",4,null,14,2,4,8,0,"02","04","08","00"]
["02-05-00-07",4,null,14,2,5,0,7,"02","05","00","07"]
["02-05-01-06",4,null,14,2,5,1,6,"02","05","01","06"]
["02-05-02-05",4,null,14,2,5,2,5,"02","05","02","05"]
["02-05-03-04",4,null,14,2,5,3,4,"02","05","03","04"]
["02-05-04-03",4,null,14,2,5,4,3,"02","05","04","03"]
["02-05-05-02",4,null,14,2,5,5,2,"02","05","05","02"]
["02-05-06-01",4,null,14,2,5,6,1,"02","05","06","01"]
["02-05-07-00",4,null,14,2,5,7,0,"02","05","07","00"]
["02-06-00-06",3,null,14,2,6,0,6,"02","06","00","06"]
["02-06-01-05",3,null,14,2,6,1,5,"02","06","01","05"]
["02-06-02-04",3,null,14,2,6,2,4,"02","06","02","04"]
["02-06-03-03",3,null,14,2,6,3,3,"02","06","03","03"]
["02-06-04-02",3,null,14,2,6,4,2,"02","06","04","02"]
["02-06-05-01",3,null,14,2,6,5,1,"02","06","05","01"]
["02-06-06-00",3,null,14,2,6,6,0,"02","06","06","00"]
["02-07-00-05",3,null,14,2,7,0,5,"02","07","00","05"]
["02-07-01-04",3,null,14,2,7,1,4,"02","07","01","04"]
["02-07-02-03",3,null,14,2,7,2,3,"02","07","02","03"]
["02-07-03-02",3,null,14,2,7,3,2,"02","07","03","02"]
["02-07-04-01",3,null,14,2,7,4,1,"02","07","04","01"]
["02-07-05-00",3,null,14,2,7,5,0,"02","07","05","00"]
["02-08-00-04",3,null,14,2,8,0,4,"02","08","00","04"]
["02-08-01-03",3,null,14,2,8,1,3,"02","08","01","03"]
["02-08-02-02",3,null,14,2,8,2,2,"02","08","02","02"]
["02-08-03-01",3,null,14,2,8,3,1,"02","08","03","01"]
["02-08-04-00",3,null,14,2,8,4,0,"02","08","04","00"]
["02-09-00-03",3,null,14,2,9,0,3,"02","09","00","03"]
["02-09-01-02",2,null,14,2,9,1,2,"02","09","01","02"]
["02-09-02-01",2,null,14,2,9,2,1,"02","09","02","01"]
["02-09-03-00",2,null,14,2,9,3,0,"02","09","03","00"]
["02-10-00-02",2,null,14,2,10,0,2,"02","10","00","02"]
["02-10-01-01",2,null,14,2,10,1,1,"02","10","01","01"]
["02-10-02-00",2,null,14,2,10,2,0,"02","10","02","00"]
[{"$f":"I2695&\"-\"&J2695&\"-\"&K2695&\"-\"&L2695","v":"02-11-00-01"},2,null,14,2,11,0,1,"02","11","00","01"]
["02-11-01-00",2,null,14,2,11,1,0,{"$f":"IF(LEN(E2696)=1,0&E2696,IF(LEN(E2696)=0,\"00\",RIGHT(E2696,2)))","v":"02"},{"$f":"IF(LEN(F2696)=1,0&F2696,IF(LEN(F2696)=0,\"00\",RIGHT(F2696,2)))","v":"11"},{"$f":"IF(LEN(G2696)=1,0&G2696,IF(LEN(G2696)=0,\"00\",RIGHT(G2696,2)))","v":"01"},{"$f":"IF(LEN(H2696)=1,0&H2696,IF(LEN(H2696)=0,\"00\",RIGHT(H2696,2)))","v":"00"}]
["02-12-00-00",2,null,14,2,12,0,0,"02","12","00","00"]
["03-00-00-11",5,null,14,3,0,0,11,"03","00","00","11"]
["03-00-01-10",5,null,14,3,0,1,10,"03","00","01","10"]
["03-00-02-09",5,null,14,3,0,2,9,"03","00","02","09"]
["03-00-03-08",5,null,14,3,0,3,8,"03","00","03","08"]
["03-00-04-07",5,null,14,3,0,4,7,"03","00","04","07"]
["03-00-05-06",5,null,14,3,0,5,6,"03","00","05","06"]
["03-00-06-05",4,null,14,3,0,6,5,"03","00","06","05"]
["03-00-07-04",4,null,14,3,0,7,4,"03","00","07","04"]
["03-00-08-03",4,null,14,3,0,8,3,"03","00","08","03"]
["03-00-09-02",4,null,14,3,0,9,2,"03","00","09","02"]
["03-00-10-01",4,null,14,3,0,10,1,"03","00","10","01"]
["03-00-11-00",4,null,14,3,0,11,0,"03","00","11","00"]
["03-01-00-10",5,null,14,3,1,0,10,"03","01","00","10"]
["03-01-01-09",5,null,14,3,1,1,9,"03","01","01","09"]
["03-01-02-08",5,null,14,3,1,2,8,"03","01","02","08"]
["03-01-03-07",4,null,14,3,1,3,7,"03","01","03","07"]
["03-01-04-06",4,null,14,3,1,4,6,"03","01","04","06"]
["03-01-05-05",4,null,14,3,1,5,5,"03","01","05","05"]
["03-01-06-04",4,null,14,3,1,6,4,"03","01","06","04"]
["03-01-07-03",4,null,14,3,1,7,3,"03","01","07","03"]
["03-01-08-02",4,null,14,3,1,8,2,"03","01","08","02"]
["03-01-09-01",4,null,14,3,1,9,1,"03","01","09","01"]
["03-01-10-00",4,null,14,3,1,10,0,"03","01","10","00"]
["03-02-00-09",5,null,14,3,2,0,9,"03","02","00","09"]
["03-02-01-08",4,null,14,3,2,1,8,"03","02","01","08"]
["03-02-02-07",4,null,14,3,2,2,7,"03","02","02","07"]
["03-02-03-06",4,null,14,3,2,3,6,"03","02","03","06"]
["03-02-04-05",4,null,14,3,2,4,5,"03","02","04","05"]
["03-02-05-04",4,null,14,3,2,5,4,"03","02","05","04"]
["03-02-06-03",4,null,14,3,2,6,3,"03","02","06","03"]
["03-02-07-02",4,null,14,3,2,7,2,"03","02","07","02"]
["03-02-08-01",4,null,14,3,2,8,1,"03","02","08","01"]
["03-02-09-00",4,null,14,3,2,9,0,"03","02","09","00"]
["03-03-00-08",4,null,14,3,3,0,8,"03","03","00","08"]
["03-03-01-07",4,null,14,3,3,1,7,"03","03","01","07"]
["03-03-02-06",4,null,14,3,3,2,6,"03","03","02","06"]
["03-03-03-05",4,null,14,3,3,3,5,"03","03","03","05"]
["03-03-04-04",4,null,14,3,3,4,4,"03","03","04","04"]
["03-03-05-03",4,null,14,3,3,5,3,"03","03","05","03"]
["03-03-06-02",4,null,14,3,3,6,2,"03","03","06","02"]
["03-03-07-01",4,null,14,3,3,7,1,"03","03","07","01"]
["03-03-08-00",4,null,14,3,3,8,0,"03","03","08","00"]
["03-04-00-07",4,null,14,3,4,0,7,"03","04","00","07"]
["03-04-01-06",4,null,14,3,4,1,6,"03","04","01","06"]
["03-04-02-05",4,null,14,3,4,2,5,"03","04","02","05"]
["03-04-03-04",4,null,14,3,4,3,4,"03","04","03","04"]
["03-04-04-03",4,null,14,3,4,4,3,"03","04","04","03"]
["03-04-05-02",4,null,14,3,4,5,2,"03","04","05","02"]
["03-04-06-01",4,null,14,3,4,6,1,"03","04","06","01"]
["03-04-07-00",4,null,14,3,4,7,0,"03","04","07","00"]
["03-05-00-06",3,null,14,3,5,0,6,"03","05","00","06"]
["03-05-01-05",3,null,14,3,5,1,5,"03","05","01","05"]
["03-05-02-04",3,null,14,3,5,2,4,"03","05","02","04"]
["03-05-03-03",3,null,14,3,5,3,3,"03","05","03","03"]
["03-05-04-02",3,null,14,3,5,4,2,"03","05","04","02"]
["03-05-05-01",3,null,14,3,5,5,1,"03","05","05","01"]
["03-05-06-00",3,null,14,3,5,6,0,"03","05","06","00"]
["03-06-00-05",3,null,14,3,6,0,5,"03","06","00","05"]
["03-06-01-04",3,null,14,3,6,1,4,"03","06","01","04"]
["03-06-02-03",3,null,14,3,6,2,3,"03","06","02","03"]
["03-06-03-02",3,null,14,3,6,3,2,"03","06","03","02"]
[{"$f":"I2759&\"-\"&J2759&\"-\"&K2759&\"-\"&L2759","v":"03-06-04-01"},3,null,14,3,6,4,1,"03","06","04","01"]
["03-06-05-00",3,null,14,3,6,5,0,{"$f":"IF(LEN(E2760)=1,0&E2760,IF(LEN(E2760)=0,\"00\",RIGHT(E2760,2)))","v":"03"},{"$f":"IF(LEN(F2760)=1,0&F2760,IF(LEN(F2760)=0,\"00\",RIGHT(F2760,2)))","v":"06"},{"$f":"IF(LEN(G2760)=1,0&G2760,IF(LEN(G2760)=0,\"00\",RIGHT(G2760,2)))","v":"05"},{"$f":"IF(LEN(H2760)=1,0&H2760,IF(LEN(H2760)=0,\"00\",RIGHT(H2760,2)))","v":"00"}]
["03-07-00-04",3,null,14,3,7,0,4,"03","07","00","04"]
["03-07-01-03",3,null,14,3,7,1,3,"03","07","01","03"]
["03-07-02-02",3,null,14,3,7,2,2,"03","07","02","02"]
["03-07-03-01",3,null,14,3,7,3,1,"03","07","03","01"]
["03-07-04-00",3,null,14,3,7,4,0,"03","07","04","00"]
["03-08-00-03",3,null,14,3,8,0,3,"03","08","00","03"]
["03-08-01-02",2,null,14,3,8,1,2,"03","08","01","02"]
["03-08-02-01",2,null,14,3,8,2,1,"03","08","02","01"]
["03-08-03-00",2,null,14,3,8,3,0,"03","08","03","00"]
["03-09-00-02",2,null,14,3,9,0,2,"03","09","00","02"]
["03-09-01-01",2,null,14,3,9,1,1,"03","09","01","01"]
["03-09-02-00",2,null,14,3,9,2,0,"03","09","02","00"]
["03-10-00-01",2,null,14,3,10,0,1,"03","10","00","01"]
["03-10-01-00",2,null,14,3,10,1,0,"03","10","01","00"]
["03-11-00-00",2,null,14,3,11,0,0,"03","11","00","00"]
["04-00-00-10",5,null,14,4,0,0,10,"04","00","00","10"]
["04-00-01-09",5,null,14,4,0,1,9,"04","00","01","09"]
["04-00-02-08",4,null,14,4,0,2,8,"04","00","02","08"]
["04-00-03-07",4,null,14,4,0,3,7,"04","00","03","07"]
["04-00-04-06",4,null,14,4,0,4,6,"04","00","04","06"]
["04-00-05-05",4,null,14,4,0,5,5,"04","00","05","05"]
["04-00-06-04",4,null,14,4,0,6,4,"04","00","06","04"]
["04-00-07-03",4,null,14,4,0,7,3,"04","00","07","03"]
["04-00-08-02",4,null,14,4,0,8,2,"04","00","08","02"]
["04-00-09-01",4,null,14,4,0,9,1,"04","00","09","01"]
["04-00-10-00",4,null,14,4,0,10,0,"04","00","10","00"]
["04-01-00-09",4,null,14,4,1,0,9,"04","01","00","09"]
["04-01-01-08",4,null,14,4,1,1,8,"04","01","01","08"]
["04-01-02-07",4,null,14,4,1,2,7,"04","01","02","07"]
["04-01-03-06",4,null,14,4,1,3,6,"04","01","03","06"]
["04-01-04-05",4,null,14,4,1,4,5,"04","01","04","05"]
["04-01-05-04",4,null,14,4,1,5,4,"04","01","05","04"]
["04-01-06-03",4,null,14,4,1,6,3,"04","01","06","03"]
["04-01-07-02",4,null,14,4,1,7,2,"04","01","07","02"]
["04-01-08-01",4,null,14,4,1,8,1,"04","01","08","01"]
["04-01-09-00",4,null,14,4,1,9,0,"04","01","09","00"]
["04-02-00-08",4,null,14,4,2,0,8,"04","02","00","08"]
["04-02-01-07",4,null,14,4,2,1,7,"04","02","01","07"]
["04-02-02-06",4,null,14,4,2,2,6,"04","02","02","06"]
["04-02-03-05",4,null,14,4,2,3,5,"04","02","03","05"]
["04-02-04-04",4,null,14,4,2,4,4,"04","02","04","04"]
["04-02-05-03",4,null,14,4,2,5,3,"04","02","05","03"]
["04-02-06-02",4,null,14,4,2,6,2,"04","02","06","02"]
["04-02-07-01",4,null,14,4,2,7,1,"04","02","07","01"]
["04-02-08-00",4,null,14,4,2,8,0,"04","02","08","00"]
["04-03-00-07",4,null,14,4,3,0,7,"04","03","00","07"]
["04-03-01-06",4,null,14,4,3,1,6,"04","03","01","06"]
["04-03-02-05",4,null,14,4,3,2,5,"04","03","02","05"]
["04-03-03-04",4,null,14,4,3,3,4,"04","03","03","04"]
["04-03-04-03",4,null,14,4,3,4,3,"04","03","04","03"]
["04-03-05-02",4,null,14,4,3,5,2,"04","03","05","02"]
["04-03-06-01",4,null,14,4,3,6,1,"04","03","06","01"]
["04-03-07-00",4,null,14,4,3,7,0,"04","03","07","00"]
["04-04-00-06",3,null,14,4,4,0,6,"04","04","00","06"]
["04-04-01-05",3,null,14,4,4,1,5,"04","04","01","05"]
["04-04-02-04",3,null,14,4,4,2,4,"04","04","02","04"]
["04-04-03-03",4,null,14,4,4,3,3,"04","04","03","03"]
["04-04-04-02",3,null,14,4,4,4,2,"04","04","04","02"]
["04-04-05-01",3,null,14,4,4,5,1,"04","04","05","01"]
["04-04-06-00",3,null,14,4,4,6,0,"04","04","06","00"]
["04-05-00-05",3,null,14,4,5,0,5,"04","05","00","05"]
["04-05-01-04",3,null,14,4,5,1,4,"04","05","01","04"]
[{"$f":"I2823&\"-\"&J2823&\"-\"&K2823&\"-\"&L2823","v":"04-05-02-03"},3,null,14,4,5,2,3,"04","05","02","03"]
["04-05-03-02",3,null,14,4,5,3,2,{"$f":"IF(LEN(E2824)=1,0&E2824,IF(LEN(E2824)=0,\"00\",RIGHT(E2824,2)))","v":"04"},{"$f":"IF(LEN(F2824)=1,0&F2824,IF(LEN(F2824)=0,\"00\",RIGHT(F2824,2)))","v":"05"},{"$f":"IF(LEN(G2824)=1,0&G2824,IF(LEN(G2824)=0,\"00\",RIGHT(G2824,2)))","v":"03"},{"$f":"IF(LEN(H2824)=1,0&H2824,IF(LEN(H2824)=0,\"00\",RIGHT(H2824,2)))","v":"02"}]
["04-05-04-01",3,null,14,4,5,4,1,"04","05","04","01"]
["04-05-05-00",3,null,14,4,5,5,0,"04","05","05","00"]
["04-06-00-04",3,null,14,4,6,0,4,"04","06","00","04"]
["04-06-01-03",3,null,14,4,6,1,3,"04","06","01","03"]
["04-06-02-02",3,null,14,4,6,2,2,"04","06","02","02"]
["04-06-03-01",3,null,14,4,6,3,1,"04","06","03","01"]
["04-06-04-00",3,null,14,4,6,4,0,"04","06","04","00"]
["04-07-00-03",3,null,14,4,7,0,3,"04","07","00","03"]
["04-07-01-02",2,null,14,4,7,1,2,"04","07","01","02"]
["04-07-02-01",2,null,14,4,7,2,1,"04","07","02","01"]
["04-07-03-00",2,null,14,4,7,3,0,"04","07","03","00"]
["04-08-00-02",2,null,14,4,8,0,2,"04","08","00","02"]
["04-08-01-01",2,null,14,4,8,1,1,"04","08","01","01"]
["04-08-02-00",2,null,14,4,8,2,0,"04","08","02","00"]
["04-09-00-01",2,null,14,4,9,0,1,"04","09","00","01"]
["04-09-01-00",2,null,14,4,9,1,0,"04","09","01","00"]
["04-10-00-00",2,null,14,4,10,0,0,"04","10","00","00"]
["05-00-00-09",4,null,14,5,0,0,9,"05","00","00","09"]
["05-00-01-08",4,null,14,5,0,1,8,"05","00","01","08"]
["05-00-02-07",4,null,14,5,0,2,7,"05","00","02","07"]
["05-00-03-06",4,null,14,5,0,3,6,"05","00","03","06"]
["05-00-04-05",4,null,14,5,0,4,5,"05","00","04","05"]
["05-00-05-04",4,null,14,5,0,5,4,"05","00","05","04"]
["05-00-06-03",4,null,14,5,0,6,3,"05","00","06","03"]
["05-00-07-02",4,null,14,5,0,7,2,"05","00","07","02"]
["05-00-08-01",4,null,14,5,0,8,1,"05","00","08","01"]
["05-00-09-00",4,null,14,5,0,9,0,"05","00","09","00"]
["05-01-00-08",4,null,14,5,1,0,8,"05","01","00","08"]
["05-01-01-07",4,null,14,5,1,1,7,"05","01","01","07"]
["05-01-02-06",4,null,14,5,1,2,6,"05","01","02","06"]
["05-01-03-05",4,null,14,5,1,3,5,"05","01","03","05"]
["05-01-04-04",4,null,14,5,1,4,4,"05","01","04","04"]
["05-01-05-03",4,null,14,5,1,5,3,"05","01","05","03"]
["05-01-06-02",4,null,14,5,1,6,2,"05","01","06","02"]
["05-01-07-01",4,null,14,5,1,7,1,"05","01","07","01"]
["05-01-08-00",4,null,14,5,1,8,0,"05","01","08","00"]
["05-02-00-07",4,null,14,5,2,0,7,"05","02","00","07"]
["05-02-01-06",4,null,14,5,2,1,6,"05","02","01","06"]
["05-02-02-05",4,null,14,5,2,2,5,"05","02","02","05"]
["05-02-03-04",4,null,14,5,2,3,4,"05","02","03","04"]
["05-02-04-03",4,null,14,5,2,4,3,"05","02","04","03"]
["05-02-05-02",4,null,14,5,2,5,2,"05","02","05","02"]
["05-02-06-01",4,null,14,5,2,6,1,"05","02","06","01"]
["05-02-07-00",3,null,14,5,2,7,0,"05","02","07","00"]
["05-03-00-06",3,null,14,5,3,0,6,"05","03","00","06"]
["05-03-01-05",3,null,14,5,3,1,5,"05","03","01","05"]
["05-03-02-04",3,null,14,5,3,2,4,"05","03","02","04"]
["05-03-03-03",3,null,14,5,3,3,3,"05","03","03","03"]
["05-03-04-02",3,null,14,5,3,4,2,"05","03","04","02"]
["05-03-05-01",3,null,14,5,3,5,1,"05","03","05","01"]
["05-03-06-00",3,null,14,5,3,6,0,"05","03","06","00"]
["05-04-00-05",3,null,14,5,4,0,5,"05","04","00","05"]
["05-04-01-04",3,null,14,5,4,1,4,"05","04","01","04"]
["05-04-02-03",3,null,14,5,4,2,3,"05","04","02","03"]
["05-04-03-02",3,null,14,5,4,3,2,"05","04","03","02"]
["05-04-04-01",3,null,14,5,4,4,1,"05","04","04","01"]
["05-04-05-00",3,null,14,5,4,5,0,"05","04","05","00"]
["05-05-00-04",3,null,14,5,5,0,4,"05","05","00","04"]
["05-05-01-03",3,null,14,5,5,1,3,"05","05","01","03"]
["05-05-02-02",3,null,14,5,5,2,2,"05","05","02","02"]
["05-05-03-01",3,null,14,5,5,3,1,"05","05","03","01"]
["05-05-04-00",3,null,14,5,5,4,0,"05","05","04","00"]
[{"$f":"I2887&\"-\"&J2887&\"-\"&K2887&\"-\"&L2887","v":"05-06-00-03"},3,null,14,5,6,0,3,"05","06","00","03"]
["05-06-01-02",2,null,14,5,6,1,2,{"$f":"IF(LEN(E2888)=1,0&E2888,IF(LEN(E2888)=0,\"00\",RIGHT(E2888,2)))","v":"05"},{"$f":"IF(LEN(F2888)=1,0&F2888,IF(LEN(F2888)=0,\"00\",RIGHT(F2888,2)))","v":"06"},{"$f":"IF(LEN(G2888)=1,0&G2888,IF(LEN(G2888)=0,\"00\",RIGHT(G2888,2)))","v":"01"},{"$f":"IF(LEN(H2888)=1,0&H2888,IF(LEN(H2888)=0,\"00\",RIGHT(H2888,2)))","v":"02"}]
["05-06-02-01",2,null,14,5,6,2,1,"05","06","02","01"]
["05-06-03-00",2,null,14,5,6,3,0,"05","06","03","00"]
["05-07-00-02",2,null,14,5,7,0,2,"05","07","00","02"]
["05-07-01-01",2,null,14,5,7,1,1,"05","07","01","01"]
["05-07-02-00",2,null,14,5,7,2,0,"05","07","02","00"]
["05-08-00-01",2,null,14,5,8,0,1,"05","08","00","01"]
["05-08-01-00",2,null,14,5,8,1,0,"05","08","01","00"]
["05-09-00-00",2,null,14,5,9,0,0,"05","09","00","00"]
["06-00-00-08",4,null,14,6,0,0,8,"06","00","00","08"]
["06-00-01-07",4,null,14,6,0,1,7,"06","00","01","07"]
["06-00-02-06",4,null,14,6,0,2,6,"06","00","02","06"]
["06-00-03-05",4,null,14,6,0,3,5,"06","00","03","05"]
["06-00-04-04",4,null,14,6,0,4,4,"06","00","04","04"]
["06-00-05-03",4,null,14,6,0,5,3,"06","00","05","03"]
["06-00-06-02",4,null,14,6,0,6,2,"06","00","06","02"]
["06-00-07-01",4,null,14,6,0,7,1,"06","00","07","01"]
["06-00-08-00",3,null,14,6,0,8,0,"06","00","08","00"]
["06-01-00-07",4,null,14,6,1,0,7,"06","01","00","07"]
["06-01-01-06",4,null,14,6,1,1,6,"06","01","01","06"]
["06-01-02-05",4,null,14,6,1,2,5,"06","01","02","05"]
["06-01-03-04",4,null,14,6,1,3,4,"06","01","03","04"]
["06-01-04-03",4,null,14,6,1,4,3,"06","01","04","03"]
["06-01-05-02",3,null,14,6,1,5,2,"06","01","05","02"]
["06-01-06-01",3,null,14,6,1,6,1,"06","01","06","01"]
["06-01-07-00",3,null,14,6,1,7,0,"06","01","07","00"]
["06-02-00-06",3,null,14,6,2,0,6,"06","02","00","06"]
["06-02-01-05",3,null,14,6,2,1,5,"06","02","01","05"]
["06-02-02-04",3,null,14,6,2,2,4,"06","02","02","04"]
["06-02-03-03",3,null,14,6,2,3,3,"06","02","03","03"]
["06-02-04-02",3,null,14,6,2,4,2,"06","02","04","02"]
["06-02-05-01",3,null,14,6,2,5,1,"06","02","05","01"]
["06-02-06-00",3,null,14,6,2,6,0,"06","02","06","00"]
["06-03-00-05",3,null,14,6,3,0,5,"06","03","00","05"]
["06-03-01-04",3,null,14,6,3,1,4,"06","03","01","04"]
["06-03-02-03",3,null,14,6,3,2,3,"06","03","02","03"]
["06-03-03-02",3,null,14,6,3,3,2,"06","03","03","02"]
["06-03-04-01",3,null,14,6,3,4,1,"06","03","04","01"]
["06-03-05-00",3,null,14,6,3,5,0,"06","03","05","00"]
["06-04-00-04",3,null,14,6,4,0,4,"06","04","00","04"]
["06-04-01-03",3,null,14,6,4,1,3,"06","04","01","03"]
["06-04-02-02",3,null,14,6,4,2,2,"06","04","02","02"]
["06-04-03-01",3,null,14,6,4,3,1,"06","04","03","01"]
["06-04-04-00",3,null,14,6,4,4,0,"06","04","04","00"]
["06-05-00-03",3,null,14,6,5,0,3,"06","05","00","03"]
["06-05-01-02",2,null,14,6,5,1,2,"06","05","01","02"]
["06-05-02-01",2,null,14,6,5,2,1,"06","05","02","01"]
["06-05-03-00",2,null,14,6,5,3,0,"06","05","03","00"]
["06-06-00-02",2,null,14,6,6,0,2,"06","06","00","02"]
["06-06-01-01",2,null,14,6,6,1,1,"06","06","01","01"]
["06-06-02-00",2,null,14,6,6,2,0,"06","06","02","00"]
["06-07-00-01",2,null,14,6,7,0,1,"06","07","00","01"]
["06-07-01-00",2,null,14,6,7,1,0,"06","07","01","00"]
["06-08-00-00",2,null,14,6,8,0,0,"06","08","00","00"]
["07-00-00-07",4,null,14,7,0,0,7,"07","00","00","07"]
["07-00-01-06",4,null,14,7,0,1,6,"07","00","01","06"]
["07-00-02-05",4,null,14,7,0,2,5,"07","00","02","05"]
["07-00-03-04",4,null,14,7,0,3,4,"07","00","03","04"]
["07-00-04-03",3,null,14,7,0,4,3,"07","00","04","03"]
["07-00-05-02",3,null,14,7,0,5,2,"07","00","05","02"]
["07-00-06-01",3,null,14,7,0,6,1,"07","00","06","01"]
["07-00-07-00",3,null,14,7,0,7,0,"07","00","07","00"]
["07-01-00-06",3,null,14,7,1,0,6,"07","01","00","06"]
[{"$f":"I2951&\"-\"&J2951&\"-\"&K2951&\"-\"&L2951","v":"07-01-01-05"},3,null,14,7,1,1,5,"07","01","01","05"]
["07-01-02-04",3,null,14,7,1,2,4,{"$f":"IF(LEN(E2952)=1,0&E2952,IF(LEN(E2952)=0,\"00\",RIGHT(E2952,2)))","v":"07"},{"$f":"IF(LEN(F2952)=1,0&F2952,IF(LEN(F2952)=0,\"00\",RIGHT(F2952,2)))","v":"01"},{"$f":"IF(LEN(G2952)=1,0&G2952,IF(LEN(G2952)=0,\"00\",RIGHT(G2952,2)))","v":"02"},{"$f":"IF(LEN(H2952)=1,0&H2952,IF(LEN(H2952)=0,\"00\",RIGHT(H2952,2)))","v":"04"}]
["07-01-03-03",3,null,14,7,1,3,3,"07","01","03","03"]
["07-01-04-02",3,null,14,7,1,4,2,"07","01","04","02"]
["07-01-05-01",3,null,14,7,1,5,1,"07","01","05","01"]
["07-01-06-00",3,null,14,7,1,6,0,"07","01","06","00"]
["07-02-00-05",3,null,14,7,2,0,5,"07","02","00","05"]
["07-02-01-04",3,null,14,7,2,1,4,"07","02","01","04"]
["07-02-02-03",3,null,14,7,2,2,3,"07","02","02","03"]
["07-02-03-02",3,null,14,7,2,3,2,"07","02","03","02"]
["07-02-04-01",3,null,14,7,2,4,1,"07","02","04","01"]
["07-02-05-00",3,null,14,7,2,5,0,"07","02","05","00"]
["07-03-00-04",3,null,14,7,3,0,4,"07","03","00","04"]
["07-03-01-03",3,null,14,7,3,1,3,"07","03","01","03"]
["07-03-02-02",3,null,14,7,3,2,2,"07","03","02","02"]
["07-03-03-01",3,null,14,7,3,3,1,"07","03","03","01"]
["07-03-04-00",3,null,14,7,3,4,0,"07","03","04","00"]
["07-04-00-03",3,null,14,7,4,0,3,"07","04","00","03"]
["07-04-01-02",2,null,14,7,4,1,2,"07","04","01","02"]
["07-04-02-01",2,null,14,7,4,2,1,"07","04","02","01"]
["07-04-03-00",2,null,14,7,4,3,0,"07","04","03","00"]
["07-05-00-02",2,null,14,7,5,0,2,"07","05","00","02"]
["07-05-01-01",2,null,14,7,5,1,1,"07","05","01","01"]
["07-05-02-00",2,null,14,7,5,2,0,"07","05","02","00"]
["07-06-00-01",2,null,14,7,6,0,1,"07","06","00","01"]
["07-06-01-00",2,null,14,7,6,1,0,"07","06","01","00"]
["07-07-00-00",2,null,14,7,7,0,0,"07","07","00","00"]
["08-00-00-06",3,null,14,8,0,0,6,"08","00","00","06"]
["08-00-01-05",3,null,14,8,0,1,5,"08","00","01","05"]
["08-00-02-04",3,null,14,8,0,2,4,"08","00","02","04"]
["08-00-03-03",3,null,14,8,0,3,3,"08","00","03","03"]
["08-00-04-02",3,null,14,8,0,4,2,"08","00","04","02"]
["08-00-05-01",3,null,14,8,0,5,1,"08","00","05","01"]
["08-00-06-00",3,null,14,8,0,6,0,"08","00","06","00"]
["08-01-00-05",3,null,14,8,1,0,5,"08","01","00","05"]
["08-01-01-04",3,null,14,8,1,1,4,"08","01","01","04"]
["08-01-02-03",3,null,14,8,1,2,3,"08","01","02","03"]
["08-01-03-02",3,null,14,8,1,3,2,"08","01","03","02"]
["08-01-04-01",3,null,14,8,1,4,1,"08","01","04","01"]
["08-01-05-00",3,null,14,8,1,5,0,"08","01","05","00"]
["08-02-00-04",3,null,14,8,2,0,4,"08","02","00","04"]
["08-02-01-03",3,null,14,8,2,1,3,"08","02","01","03"]
["08-02-02-02",3,null,14,8,2,2,2,"08","02","02","02"]
["08-02-03-01",3,null,14,8,2,3,1,"08","02","03","01"]
["08-02-04-00",3,null,14,8,2,4,0,"08","02","04","00"]
["08-03-00-03",3,null,14,8,3,0,3,"08","03","00","03"]
["08-03-01-02",2,null,14,8,3,1,2,"08","03","01","02"]
["08-03-02-01",2,null,14,8,3,2,1,"08","03","02","01"]
["08-03-03-00",2,null,14,8,3,3,0,"08","03","03","00"]
["08-04-00-02",2,null,14,8,4,0,2,"08","04","00","02"]
["08-04-01-01",2,null,14,8,4,1,1,"08","04","01","01"]
["08-04-02-00",2,null,14,8,4,2,0,"08","04","02","00"]
["08-05-00-01",2,null,14,8,5,0,1,"08","05","00","01"]
["08-05-01-00",2,null,14,8,5,1,0,"08","05","01","00"]
["08-06-00-00",2,null,14,8,6,0,0,"08","06","00","00"]
["09-00-00-05",3,null,14,9,0,0,5,"09","00","00","05"]
["09-00-01-04",3,null,14,9,0,1,4,"09","00","01","04"]
["09-00-02-03",3,null,14,9,0,2,3,"09","00","02","03"]
["09-00-03-02",3,null,14,9,0,3,2,"09","00","03","02"]
["09-00-04-01",3,null,14,9,0,4,1,"09","00","04","01"]
["09-00-05-00",3,null,14,9,0,5,0,"09","00","05","00"]
["09-01-00-04",3,null,14,9,1,0,4,"09","01","00","04"]
["09-01-01-03",3,null,14,9,1,1,3,"09","01","01","03"]
["09-01-02-02",3,null,14,9,1,2,2,"09","01","02","02"]
[{"$f":"I3015&\"-\"&J3015&\"-\"&K3015&\"-\"&L3015","v":"09-01-03-01"},3,null,14,9,1,3,1,"09","01","03","01"]
["09-01-04-00",3,null,14,9,1,4,0,{"$f":"IF(LEN(E3016)=1,0&E3016,IF(LEN(E3016)=0,\"00\",RIGHT(E3016,2)))","v":"09"},{"$f":"IF(LEN(F3016)=1,0&F3016,IF(LEN(F3016)=0,\"00\",RIGHT(F3016,2)))","v":"01"},{"$f":"IF(LEN(G3016)=1,0&G3016,IF(LEN(G3016)=0,\"00\",RIGHT(G3016,2)))","v":"04"},{"$f":"IF(LEN(H3016)=1,0&H3016,IF(LEN(H3016)=0,\"00\",RIGHT(H3016,2)))","v":"00"}]
["09-02-00-03",3,null,14,9,2,0,3,"09","02","00","03"]
["09-02-01-02",2,null,14,9,2,1,2,"09","02","01","02"]
["09-02-02-01",2,null,14,9,2,2,1,"09","02","02","01"]
["09-02-03-00",2,null,14,9,2,3,0,"09","02","03","00"]
["09-03-00-02",2,null,14,9,3,0,2,"09","03","00","02"]
["09-03-01-01",2,null,14,9,3,1,1,"09","03","01","01"]
["09-03-02-00",2,null,14,9,3,2,0,"09","03","02","00"]
["09-04-00-01",2,null,14,9,4,0,1,"09","04","00","01"]
["09-04-01-00",2,null,14,9,4,1,0,"09","04","01","00"]
["09-05-00-00",2,null,14,9,5,0,0,"09","05","00","00"]
["10-00-00-04",3,null,14,10,0,0,4,"10","00","00","04"]
["10-00-01-03",3,null,14,10,0,1,3,"10","00","01","03"]
["10-00-02-02",3,null,14,10,0,2,2,"10","00","02","02"]
["10-00-03-01",3,null,14,10,0,3,1,"10","00","03","01"]
["10-00-04-00",3,null,14,10,0,4,0,"10","00","04","00"]
["10-01-00-03",3,null,14,10,1,0,3,"10","01","00","03"]
["10-01-01-02",2,null,14,10,1,1,2,"10","01","01","02"]
["10-01-02-01",2,null,14,10,1,2,1,"10","01","02","01"]
["10-01-03-00",2,null,14,10,1,3,0,"10","01","03","00"]
["10-02-00-02",2,null,14,10,2,0,2,"10","02","00","02"]
["10-02-01-01",2,null,14,10,2,1,1,"10","02","01","01"]
["10-02-02-00",2,null,14,10,2,2,0,"10","02","02","00"]
["10-03-00-01",2,null,14,10,3,0,1,"10","03","00","01"]
["10-03-01-00",2,null,14,10,3,1,0,"10","03","01","00"]
["10-04-00-00",2,null,14,10,4,0,0,"10","04","00","00"]
["11-00-00-03",3,null,14,11,0,0,3,"11","00","00","03"]
["11-00-01-02",2,null,14,11,0,1,2,"11","00","01","02"]
["11-00-02-01",2,null,14,11,0,2,1,"11","00","02","01"]
["11-00-03-00",2,null,14,11,0,3,0,"11","00","03","00"]
["11-01-00-02",2,null,14,11,1,0,2,"11","01","00","02"]
["11-01-01-01",2,null,14,11,1,1,1,"11","01","01","01"]
["11-01-02-00",2,null,14,11,1,2,0,"11","01","02","00"]
["11-02-00-01",2,null,14,11,2,0,1,"11","02","00","01"]
["11-02-01-00",2,null,14,11,2,1,0,"11","02","01","00"]
["11-03-00-00",2,null,14,11,3,0,0,"11","03","00","00"]
["12-00-00-02",2,null,14,12,0,0,2,"12","00","00","02"]
["12-00-01-01",2,null,14,12,0,1,1,"12","00","01","01"]
["12-00-02-00",2,null,14,12,0,2,0,"12","00","02","00"]
["12-01-00-01",2,null,14,12,1,0,1,"12","01","00","01"]
["12-01-01-00",2,null,14,12,1,1,0,"12","01","01","00"]
["12-02-00-00",2,null,14,12,2,0,0,"12","02","00","00"]
["13-00-00-01",2,null,14,13,0,0,1,"13","00","00","01"]
["13-00-01-00",2,null,14,13,0,1,0,"13","00","01","00"]
["13-01-00-00",2,null,14,13,1,0,0,"13","01","00","00"]
["14-00-00-00",1,null,14,14,0,0,0,"14","00","00","00"]
["00-00-00-15",7,null,15,0,0,0,15,"00","00","00","15"]
["00-00-01-14",6,null,15,0,0,1,14,"00","00","01","14"]
["00-00-02-13",6,null,15,0,0,2,13,"00","00","02","13"]
["00-00-03-12",6,null,15,0,0,3,12,"00","00","03","12"]
["00-00-04-11",6,null,15,0,0,4,11,"00","00","04","11"]
["00-00-05-10",6,null,15,0,0,5,10,"00","00","05","10"]
["00-00-06-09",6,null,15,0,0,6,9,"00","00","06","09"]
["00-00-07-08",6,null,15,0,0,7,8,"00","00","07","08"]
["00-00-08-07",5,null,15,0,0,8,7,"00","00","08","07"]
["00-00-09-06",5,null,15,0,0,9,6,"00","00","09","06"]
["00-00-10-05",5,null,15,0,0,10,5,"00","00","10","05"]
["00-00-11-04",5,null,15,0,0,11,4,"00","00","11","04"]
["00-00-12-03",5,null,15,0,0,12,3,"00","00","12","03"]
["00-00-13-02",4,null,15,0,0,13,2,"00","00","13","02"]
["00-00-14-01",4,null,15,0,0,14,1,"00","00","14","01"]
["00-00-15-00",4,null,15,0,0,15,0,"00","00","15","00"]
["00-01-00-14",5,null,15,0,1,0,14,"00","01","00","14"]
[{"$f":"I3079&\"-\"&J3079&\"-\"&K3079&\"-\"&L3079","v":"00-01-01-13"},5,null,15,0,1,1,13,"00","01","01","13"]
["00-01-02-12",5,null,15,0,1,2,12,{"$f":"IF(LEN(E3080)=1,0&E3080,IF(LEN(E3080)=0,\"00\",RIGHT(E3080,2)))","v":"00"},{"$f":"IF(LEN(F3080)=1,0&F3080,IF(LEN(F3080)=0,\"00\",RIGHT(F3080,2)))","v":"01"},{"$f":"IF(LEN(G3080)=1,0&G3080,IF(LEN(G3080)=0,\"00\",RIGHT(G3080,2)))","v":"02"},{"$f":"IF(LEN(H3080)=1,0&H3080,IF(LEN(H3080)=0,\"00\",RIGHT(H3080,2)))","v":"12"}]
["00-01-03-11",5,null,15,0,1,3,11,"00","01","03","11"]
["00-01-04-10",5,null,15,0,1,4,10,"00","01","04","10"]
["00-01-05-09",5,null,15,0,1,5,9,"00","01","05","09"]
["00-01-06-08",5,null,15,0,1,6,8,"00","01","06","08"]
["00-01-07-07",5,null,15,0,1,7,7,"00","01","07","07"]
["00-01-08-06",5,null,15,0,1,8,6,"00","01","08","06"]
["00-01-09-05",5,null,15,0,1,9,5,"00","01","09","05"]
["00-01-10-04",5,null,15,0,1,10,4,"00","01","10","04"]
["00-01-11-03",5,null,15,0,1,11,3,"00","01","11","03"]
["00-01-12-02",4,null,15,0,1,12,2,"00","01","12","02"]
["00-01-13-01",4,null,15,0,1,13,1,"00","01","13","01"]
["00-01-14-00",4,null,15,0,1,14,0,"00","01","14","00"]
["00-02-00-13",5,null,15,0,2,0,13,"00","02","00","13"]
["00-02-01-12",5,null,15,0,2,1,12,"00","02","01","12"]
["00-02-02-11",5,null,15,0,2,2,11,"00","02","02","11"]
["00-02-03-10",5,null,15,0,2,3,10,"00","02","03","10"]
["00-02-04-09",5,null,15,0,2,4,9,"00","02","04","09"]
["00-02-05-08",5,null,15,0,2,5,8,"00","02","05","08"]
["00-02-06-07",5,null,15,0,2,6,7,"00","02","06","07"]
["00-02-07-06",5,null,15,0,2,7,6,"00","02","07","06"]
["00-02-08-05",5,null,15,0,2,8,5,"00","02","08","05"]
["00-02-09-04",5,null,15,0,2,9,4,"00","02","09","04"]
["00-02-10-03",5,null,15,0,2,10,3,"00","02","10","03"]
["00-02-11-02",4,null,15,0,2,11,2,"00","02","11","02"]
["00-02-12-01",4,null,15,0,2,12,1,"00","02","12","01"]
["00-02-13-00",4,null,15,0,2,13,0,"00","02","13","00"]
["00-03-00-12",5,null,15,0,3,0,12,"00","03","00","12"]
["00-03-01-11",5,null,15,0,3,1,11,"00","03","01","11"]
["00-03-02-10",5,null,15,0,3,2,10,"00","03","02","10"]
["00-03-03-09",5,null,15,0,3,3,9,"00","03","03","09"]
["00-03-04-08",5,null,15,0,3,4,8,"00","03","04","08"]
["00-03-05-07",5,null,15,0,3,5,7,"00","03","05","07"]
["00-03-06-06",5,null,15,0,3,6,6,"00","03","06","06"]
["00-03-07-05",5,null,15,0,3,7,5,"00","03","07","05"]
["00-03-08-04",5,null,15,0,3,8,4,"00","03","08","04"]
["00-03-09-03",5,null,15,0,3,9,3,"00","03","09","03"]
["00-03-10-02",4,null,15,0,3,10,2,"00","03","10","02"]
["00-03-11-01",4,null,15,0,3,11,1,"00","03","11","01"]
["00-03-12-00",4,null,15,0,3,12,0,"00","03","12","00"]
["00-04-00-11",5,null,15,0,4,0,11,"00","04","00","11"]
["00-04-01-10",5,null,15,0,4,1,10,"00","04","01","10"]
["00-04-02-09",5,null,15,0,4,2,9,"00","04","02","09"]
["00-04-03-08",5,null,15,0,4,3,8,"00","04","03","08"]
["00-04-04-07",5,null,15,0,4,4,7,"00","04","04","07"]
["00-04-05-06",5,null,15,0,4,5,6,"00","04","05","06"]
["00-04-06-05",5,null,15,0,4,6,5,"00","04","06","05"]
["00-04-07-04",5,null,15,0,4,7,4,"00","04","07","04"]
["00-04-08-03",5,null,15,0,4,8,3,"00","04","08","03"]
["00-04-09-02",4,null,15,0,4,9,2,"00","04","09","02"]
["00-04-10-01",4,null,15,0,4,10,1,"00","04","10","01"]
["00-04-11-00",4,null,15,0,4,11,0,"00","04","11","00"]
["00-05-00-10",5,null,15,0,5,0,10,"00","05","00","10"]
["00-05-01-09",5,null,15,0,5,1,9,"00","05","01","09"]
["00-05-02-08",5,null,15,0,5,2,8,"00","05","02","08"]
["00-05-03-07",5,null,15,0,5,3,7,"00","05","03","07"]
["00-05-04-06",5,null,15,0,5,4,6,"00","05","04","06"]
["00-05-05-05",5,null,15,0,5,5,5,"00","05","05","05"]
["00-05-06-04",4,null,15,0,5,6,4,"00","05","06","04"]
["00-05-07-03",4,null,15,0,5,7,3,"00","05","07","03"]
["00-05-08-02",4,null,15,0,5,8,2,"00","05","08","02"]
["00-05-09-01",4,null,15,0,5,9,1,"00","05","09","01"]
["00-05-10-00",4,null,15,0,5,10,0,"00","05","10","00"]
[{"$f":"I3143&\"-\"&J3143&\"-\"&K3143&\"-\"&L3143","v":"00-06-00-09"},5,null,15,0,6,0,9,"00","06","00","09"]
["00-06-01-08",5,null,15,0,6,1,8,{"$f":"IF(LEN(E3144)=1,0&E3144,IF(LEN(E3144)=0,\"00\",RIGHT(E3144,2)))","v":"00"},{"$f":"IF(LEN(F3144)=1,0&F3144,IF(LEN(F3144)=0,\"00\",RIGHT(F3144,2)))","v":"06"},{"$f":"IF(LEN(G3144)=1,0&G3144,IF(LEN(G3144)=0,\"00\",RIGHT(G3144,2)))","v":"01"},{"$f":"IF(LEN(H3144)=1,0&H3144,IF(LEN(H3144)=0,\"00\",RIGHT(H3144,2)))","v":"08"}]
["00-06-02-07",5,null,15,0,6,2,7,"00","06","02","07"]
["00-06-03-06",5,null,15,0,6,3,6,"00","06","03","06"]
["00-06-04-05",4,null,15,0,6,4,5,"00","06","04","05"]
["00-06-05-04",4,null,15,0,6,5,4,"00","06","05","04"]
["00-06-06-03",4,null,15,0,6,6,3,"00","06","06","03"]
["00-06-07-02",4,null,15,0,6,7,2,"00","06","07","02"]
["00-06-08-01",4,null,15,0,6,8,1,"00","06","08","01"]
["00-06-09-00",4,null,15,0,6,9,0,"00","06","09","00"]
["00-07-00-08",5,null,15,0,7,0,8,"00","07","00","08"]
["00-07-01-07",4,null,15,0,7,1,7,"00","07","01","07"]
["00-07-02-06",4,null,15,0,7,2,6,"00","07","02","06"]
["00-07-03-05",4,null,15,0,7,3,5,"00","07","03","05"]
["00-07-04-04",4,null,15,0,7,4,4,"00","07","04","04"]
["00-07-05-03",4,null,15,0,7,5,3,"00","07","05","03"]
["00-07-06-02",4,null,15,0,7,6,2,"00","07","06","02"]
["00-07-07-01",4,null,15,0,7,7,1,"00","07","07","01"]
["00-07-08-00",4,null,15,0,7,8,0,"00","07","08","00"]
["00-08-00-07",3,null,15,0,8,0,7,"00","08","00","07"]
["00-08-01-06",3,null,15,0,8,1,6,"00","08","01","06"]
["00-08-02-05",3,null,15,0,8,2,5,"00","08","02","05"]
["00-08-03-04",3,null,15,0,8,3,4,"00","08","03","04"]
["00-08-04-03",3,null,15,0,8,4,3,"00","08","04","03"]
["00-08-05-02",3,null,15,0,8,5,2,"00","08","05","02"]
["00-08-06-01",3,null,15,0,8,6,1,"00","08","06","01"]
["00-08-07-00",3,null,15,0,8,7,0,"00","08","07","00"]
["00-09-00-06",3,null,15,0,9,0,6,"00","09","00","06"]
["00-09-01-05",3,null,15,0,9,1,5,"00","09","01","05"]
["00-09-02-04",3,null,15,0,9,2,4,"00","09","02","04"]
["00-09-03-03",3,null,15,0,9,3,3,"00","09","03","03"]
["00-09-04-02",3,null,15,0,9,4,2,"00","09","04","02"]
["00-09-05-01",3,null,15,0,9,5,1,"00","09","05","01"]
["00-09-06-00",3,null,15,0,9,6,0,"00","09","06","00"]
["00-10-00-05",3,null,15,0,10,0,5,"00","10","00","05"]
["00-10-01-04",3,null,15,0,10,1,4,"00","10","01","04"]
["00-10-02-03",3,null,15,0,10,2,3,"00","10","02","03"]
["00-10-03-02",3,null,15,0,10,3,2,"00","10","03","02"]
["00-10-04-01",3,null,15,0,10,4,1,"00","10","04","01"]
["00-10-05-00",3,null,15,0,10,5,0,"00","10","05","00"]
["00-11-00-04",3,null,15,0,11,0,4,"00","11","00","04"]
["00-11-01-03",3,null,15,0,11,1,3,"00","11","01","03"]
["00-11-02-02",3,null,15,0,11,2,2,"00","11","02","02"]
["00-11-03-01",3,null,15,0,11,3,1,"00","11","03","01"]
["00-11-04-00",3,null,15,0,11,4,0,"00","11","04","00"]
["00-12-00-03",3,null,15,0,12,0,3,"00","12","00","03"]
["00-12-01-02",3,null,15,0,12,1,2,"00","12","01","02"]
["00-12-02-01",3,null,15,0,12,2,1,"00","12","02","01"]
["00-12-03-00",3,null,15,0,12,3,0,"00","12","03","00"]
["00-13-00-02",3,null,15,0,13,0,2,"00","13","00","02"]
["00-13-01-01",2,null,15,0,13,1,1,"00","13","01","01"]
["00-13-02-00",2,null,15,0,13,2,0,"00","13","02","00"]
["00-14-00-01",2,null,15,0,14,0,1,"00","14","00","01"]
["00-14-01-00",2,null,15,0,14,1,0,"00","14","01","00"]
["00-15-00-00",2,null,15,0,15,0,0,"00","15","00","00"]
["01-00-00-14",5,null,15,1,0,0,14,"01","00","00","14"]
["01-00-01-13",5,null,15,1,0,1,13,"01","00","01","13"]
["01-00-02-12",5,null,15,1,0,2,12,"01","00","02","12"]
["01-00-03-11",5,null,15,1,0,3,11,"01","00","03","11"]
["01-00-04-10",5,null,15,1,0,4,10,"01","00","04","10"]
["01-00-05-09",5,null,15,1,0,5,9,"01","00","05","09"]
["01-00-06-08",5,null,15,1,0,6,8,"01","00","06","08"]
["01-00-07-07",5,null,15,1,0,7,7,"01","00","07","07"]
["01-00-08-06",5,null,15,1,0,8,6,"01","00","08","06"]
[{"$f":"I3207&\"-\"&J3207&\"-\"&K3207&\"-\"&L3207","v":"01-00-09-05"},5,null,15,1,0,9,5,"01","00","09","05"]
["01-00-10-04",5,null,15,1,0,10,4,{"$f":"IF(LEN(E3208)=1,0&E3208,IF(LEN(E3208)=0,\"00\",RIGHT(E3208,2)))","v":"01"},{"$f":"IF(LEN(F3208)=1,0&F3208,IF(LEN(F3208)=0,\"00\",RIGHT(F3208,2)))","v":"00"},{"$f":"IF(LEN(G3208)=1,0&G3208,IF(LEN(G3208)=0,\"00\",RIGHT(G3208,2)))","v":"10"},{"$f":"IF(LEN(H3208)=1,0&H3208,IF(LEN(H3208)=0,\"00\",RIGHT(H3208,2)))","v":"04"}]
["01-00-11-03",5,null,15,1,0,11,3,"01","00","11","03"]
["01-00-12-02",4,null,15,1,0,12,2,"01","00","12","02"]
["01-00-13-01",4,null,15,1,0,13,1,"01","00","13","01"]
["01-00-14-00",4,null,15,1,0,14,0,"01","00","14","00"]
["01-01-00-13",5,null,15,1,1,0,13,"01","01","00","13"]
["01-01-01-12",5,null,15,1,1,1,12,"01","01","01","12"]
["01-01-02-11",5,null,15,1,1,2,11,"01","01","02","11"]
["01-01-03-10",5,null,15,1,1,3,10,"01","01","03","10"]
["01-01-04-09",5,null,15,1,1,4,9,"01","01","04","09"]
["01-01-05-08",5,null,15,1,1,5,8,"01","01","05","08"]
["01-01-06-07",5,null,15,1,1,6,7,"01","01","06","07"]
["01-01-07-06",5,null,15,1,1,7,6,"01","01","07","06"]
["01-01-08-05",5,null,15,1,1,8,5,"01","01","08","05"]
["01-01-09-04",5,null,15,1,1,9,4,"01","01","09","04"]
["01-01-10-03",5,null,15,1,1,10,3,"01","01","10","03"]
["01-01-11-02",4,null,15,1,1,11,2,"01","01","11","02"]
["01-01-12-01",4,null,15,1,1,12,1,"01","01","12","01"]
["01-01-13-00",4,null,15,1,1,13,0,"01","01","13","00"]
["01-02-00-12",5,null,15,1,2,0,12,"01","02","00","12"]
["01-02-01-11",5,null,15,1,2,1,11,"01","02","01","11"]
["01-02-02-10",5,null,15,1,2,2,10,"01","02","02","10"]
["01-02-03-09",5,null,15,1,2,3,9,"01","02","03","09"]
["01-02-04-08",5,null,15,1,2,4,8,"01","02","04","08"]
["01-02-05-07",5,null,15,1,2,5,7,"01","02","05","07"]
["01-02-06-06",5,null,15,1,2,6,6,"01","02","06","06"]
["01-02-07-05",5,null,15,1,2,7,5,"01","02","07","05"]
["01-02-08-04",5,null,15,1,2,8,4,"01","02","08","04"]
["01-02-09-03",5,null,15,1,2,9,3,"01","02","09","03"]
["01-02-10-02",4,null,15,1,2,10,2,"01","02","10","02"]
["01-02-11-01",4,null,15,1,2,11,1,"01","02","11","01"]
["01-02-12-00",4,null,15,1,2,12,0,"01","02","12","00"]
["01-03-00-11",5,null,15,1,3,0,11,"01","03","00","11"]
["01-03-01-10",5,null,15,1,3,1,10,"01","03","01","10"]
["01-03-02-09",5,null,15,1,3,2,9,"01","03","02","09"]
["01-03-03-08",5,null,15,1,3,3,8,"01","03","03","08"]
["01-03-04-07",5,null,15,1,3,4,7,"01","03","04","07"]
["01-03-05-06",5,null,15,1,3,5,6,"01","03","05","06"]
["01-03-06-05",5,null,15,1,3,6,5,"01","03","06","05"]
["01-03-07-04",4,null,15,1,3,7,4,"01","03","07","04"]
["01-03-08-03",4,null,15,1,3,8,3,"01","03","08","03"]
["01-03-09-02",4,null,15,1,3,9,2,"01","03","09","02"]
["01-03-10-01",4,null,15,1,3,10,1,"01","03","10","01"]
["01-03-11-00",4,null,15,1,3,11,0,"01","03","11","00"]
["01-04-00-10",5,null,15,1,4,0,10,"01","04","00","10"]
["01-04-01-09",5,null,15,1,4,1,9,"01","04","01","09"]
["01-04-02-08",5,null,15,1,4,2,8,"01","04","02","08"]
["01-04-03-07",5,null,15,1,4,3,7,"01","04","03","07"]
["01-04-04-06",5,null,15,1,4,4,6,"01","04","04","06"]
["01-04-05-05",4,null,15,1,4,5,5,"01","04","05","05"]
["01-04-06-04",4,null,15,1,4,6,4,"01","04","06","04"]
["01-04-07-03",4,null,15,1,4,7,3,"01","04","07","03"]
["01-04-08-02",4,null,15,1,4,8,2,"01","04","08","02"]
["01-04-09-01",4,null,15,1,4,9,1,"01","04","09","01"]
["01-04-10-00",4,null,15,1,4,10,0,"01","04","10","00"]
["01-05-00-09",5,null,15,1,5,0,9,"01","05","00","09"]
["01-05-01-08",5,null,15,1,5,1,8,"01","05","01","08"]
["01-05-02-07",4,null,15,1,5,2,7,"01","05","02","07"]
["01-05-03-06",4,null,15,1,5,3,6,"01","05","03","06"]
["01-05-04-05",4,null,15,1,5,4,5,"01","05","04","05"]
["01-05-05-04",4,null,15,1,5,5,4,"01","05","05","04"]
["01-05-06-03",4,null,15,1,5,6,3,"01","05","06","03"]
["01-05-07-02",4,null,15,1,5,7,2,"01","05","07","02"]
[{"$f":"I3271&\"-\"&J3271&\"-\"&K3271&\"-\"&L3271","v":"01-05-08-01"},4,null,15,1,5,8,1,"01","05","08","01"]
["01-05-09-00",4,null,15,1,5,9,0,{"$f":"IF(LEN(E3272)=1,0&E3272,IF(LEN(E3272)=0,\"00\",RIGHT(E3272,2)))","v":"01"},{"$f":"IF(LEN(F3272)=1,0&F3272,IF(LEN(F3272)=0,\"00\",RIGHT(F3272,2)))","v":"05"},{"$f":"IF(LEN(G3272)=1,0&G3272,IF(LEN(G3272)=0,\"00\",RIGHT(G3272,2)))","v":"09"},{"$f":"IF(LEN(H3272)=1,0&H3272,IF(LEN(H3272)=0,\"00\",RIGHT(H3272,2)))","v":"00"}]
["01-06-00-08",4,null,15,1,6,0,8,"01","06","00","08"]
["01-06-01-07",4,null,15,1,6,1,7,"01","06","01","07"]
["01-06-02-06",4,null,15,1,6,2,6,"01","06","02","06"]
["01-06-03-05",4,null,15,1,6,3,5,"01","06","03","05"]
["01-06-04-04",4,null,15,1,6,4,4,"01","06","04","04"]
["01-06-05-03",4,null,15,1,6,5,3,"01","06","05","03"]
["01-06-06-02",4,null,15,1,6,6,2,"01","06","06","02"]
["01-06-07-01",4,null,15,1,6,7,1,"01","06","07","01"]
["01-06-08-00",4,null,15,1,6,8,0,"01","06","08","00"]
["01-07-00-07",3,null,15,1,7,0,7,"01","07","00","07"]
["01-07-01-06",3,null,15,1,7,1,6,"01","07","01","06"]
["01-07-02-05",3,null,15,1,7,2,5,"01","07","02","05"]
["01-07-03-04",3,null,15,1,7,3,4,"01","07","03","04"]
["01-07-04-03",3,null,15,1,7,4,3,"01","07","04","03"]
["01-07-05-02",3,null,15,1,7,5,2,"01","07","05","02"]
["01-07-06-01",3,null,15,1,7,6,1,"01","07","06","01"]
["01-07-07-00",3,null,15,1,7,7,0,"01","07","07","00"]
["01-08-00-06",3,null,15,1,8,0,6,"01","08","00","06"]
["01-08-01-05",3,null,15,1,8,1,5,"01","08","01","05"]
["01-08-02-04",3,null,15,1,8,2,4,"01","08","02","04"]
["01-08-03-03",3,null,15,1,8,3,3,"01","08","03","03"]
["01-08-04-02",3,null,15,1,8,4,2,"01","08","04","02"]
["01-08-05-01",3,null,15,1,8,5,1,"01","08","05","01"]
["01-08-06-00",3,null,15,1,8,6,0,"01","08","06","00"]
["01-09-00-05",3,null,15,1,9,0,5,"01","09","00","05"]
["01-09-01-04",3,null,15,1,9,1,4,"01","09","01","04"]
["01-09-02-03",3,null,15,1,9,2,3,"01","09","02","03"]
["01-09-03-02",3,null,15,1,9,3,2,"01","09","03","02"]
["01-09-04-01",3,null,15,1,9,4,1,"01","09","04","01"]
["01-09-05-00",3,null,15,1,9,5,0,"01","09","05","00"]
["01-10-00-04",3,null,15,1,10,0,4,"01","10","00","04"]
["01-10-01-03",3,null,15,1,10,1,3,"01","10","01","03"]
["01-10-02-02",3,null,15,1,10,2,2,"01","10","02","02"]
["01-10-03-01",3,null,15,1,10,3,1,"01","10","03","01"]
["01-10-04-00",3,null,15,1,10,4,0,"01","10","04","00"]
["01-11-00-03",3,null,15,1,11,0,3,"01","11","00","03"]
["01-11-01-02",3,null,15,1,11,1,2,"01","11","01","02"]
["01-11-02-01",2,null,15,1,11,2,1,"01","11","02","01"]
["01-11-03-00",2,null,15,1,11,3,0,"01","11","03","00"]
["01-12-00-02",2,null,15,1,12,0,2,"01","12","00","02"]
["01-12-01-01",2,null,15,1,12,1,1,"01","12","01","01"]
["01-12-02-00",2,null,15,1,12,2,0,"01","12","02","00"]
["01-13-00-01",2,null,15,1,13,0,1,"01","13","00","01"]
["01-13-01-00",2,null,15,1,13,1,0,"01","13","01","00"]
["01-14-00-00",2,null,15,1,14,0,0,"01","14","00","00"]
["02-00-00-13",5,null,15,2,0,0,13,"02","00","00","13"]
["02-00-01-12",5,null,15,2,0,1,12,"02","00","01","12"]
["02-00-02-11",5,null,15,2,0,2,11,"02","00","02","11"]
["02-00-03-10",5,null,15,2,0,3,10,"02","00","03","10"]
["02-00-04-09",5,null,15,2,0,4,9,"02","00","04","09"]
["02-00-05-08",5,null,15,2,0,5,8,"02","00","05","08"]
["02-00-06-07",5,null,15,2,0,6,7,"02","00","06","07"]
["02-00-07-06",5,null,15,2,0,7,6,"02","00","07","06"]
["02-00-08-05",5,null,15,2,0,8,5,"02","00","08","05"]
["02-00-09-04",5,null,15,2,0,9,4,"02","00","09","04"]
["02-00-10-03",5,null,15,2,0,10,3,"02","00","10","03"]
["02-00-11-02",4,null,15,2,0,11,2,"02","00","11","02"]
["02-00-12-01",4,null,15,2,0,12,1,"02","00","12","01"]
["02-00-13-00",4,null,15,2,0,13,0,"02","00","13","00"]
["02-01-00-12",5,null,15,2,1,0,12,"02","01","00","12"]
["02-01-01-11",5,null,15,2,1,1,11,"02","01","01","11"]
["02-01-02-10",5,null,15,2,1,2,10,"02","01","02","10"]
[{"$f":"I3335&\"-\"&J3335&\"-\"&K3335&\"-\"&L3335","v":"02-01-03-09"},5,null,15,2,1,3,9,"02","01","03","09"]
["02-01-04-08",5,null,15,2,1,4,8,{"$f":"IF(LEN(E3336)=1,0&E3336,IF(LEN(E3336)=0,\"00\",RIGHT(E3336,2)))","v":"02"},{"$f":"IF(LEN(F3336)=1,0&F3336,IF(LEN(F3336)=0,\"00\",RIGHT(F3336,2)))","v":"01"},{"$f":"IF(LEN(G3336)=1,0&G3336,IF(LEN(G3336)=0,\"00\",RIGHT(G3336,2)))","v":"04"},{"$f":"IF(LEN(H3336)=1,0&H3336,IF(LEN(H3336)=0,\"00\",RIGHT(H3336,2)))","v":"08"}]
["02-01-05-07",5,null,15,2,1,5,7,"02","01","05","07"]
["02-01-06-06",5,null,15,2,1,6,6,"02","01","06","06"]
["02-01-07-05",5,null,15,2,1,7,5,"02","01","07","05"]
["02-01-08-04",4,null,15,2,1,8,4,"02","01","08","04"]
["02-01-09-03",4,null,15,2,1,9,3,"02","01","09","03"]
["02-01-10-02",4,null,15,2,1,10,2,"02","01","10","02"]
["02-01-11-01",4,null,15,2,1,11,1,"02","01","11","01"]
["02-01-12-00",4,null,15,2,1,12,0,"02","01","12","00"]
["02-02-00-11",5,null,15,2,2,0,11,"02","02","00","11"]
["02-02-01-10",5,null,15,2,2,1,10,"02","02","01","10"]
["02-02-02-09",5,null,15,2,2,2,9,"02","02","02","09"]
["02-02-03-08",5,null,15,2,2,3,8,"02","02","03","08"]
["02-02-04-07",5,null,15,2,2,4,7,"02","02","04","07"]
["02-02-05-06",5,null,15,2,2,5,6,"02","02","05","06"]
["02-02-06-05",4,null,15,2,2,6,5,"02","02","06","05"]
["02-02-07-04",4,null,15,2,2,7,4,"02","02","07","04"]
["02-02-08-03",4,null,15,2,2,8,3,"02","02","08","03"]
["02-02-09-02",4,null,15,2,2,9,2,"02","02","09","02"]
["02-02-10-01",4,null,15,2,2,10,1,"02","02","10","01"]
["02-02-11-00",4,null,15,2,2,11,0,"02","02","11","00"]
["02-03-00-10",5,null,15,2,3,0,10,"02","03","00","10"]
["02-03-01-09",5,null,15,2,3,1,9,"02","03","01","09"]
["02-03-02-08",5,null,15,2,3,2,8,"02","03","02","08"]
["02-03-03-07",4,null,15,2,3,3,7,"02","03","03","07"]
["02-03-04-06",4,null,15,2,3,4,6,"02","03","04","06"]
["02-03-05-05",4,null,15,2,3,5,5,"02","03","05","05"]
["02-03-06-04",4,null,15,2,3,6,4,"02","03","06","04"]
["02-03-07-03",4,null,15,2,3,7,3,"02","03","07","03"]
["02-03-08-02",4,null,15,2,3,8,2,"02","03","08","02"]
["02-03-09-01",4,null,15,2,3,9,1,"02","03","09","01"]
["02-03-10-00",4,null,15,2,3,10,0,"02","03","10","00"]
["02-04-00-09",5,null,15,2,4,0,9,"02","04","00","09"]
["02-04-01-08",4,null,15,2,4,1,8,"02","04","01","08"]
["02-04-02-07",4,null,15,2,4,2,7,"02","04","02","07"]
["02-04-03-06",4,null,15,2,4,3,6,"02","04","03","06"]
["02-04-04-05",4,null,15,2,4,4,5,"02","04","04","05"]
["02-04-05-04",4,null,15,2,4,5,4,"02","04","05","04"]
["02-04-06-03",4,null,15,2,4,6,3,"02","04","06","03"]
["02-04-07-02",4,null,15,2,4,7,2,"02","04","07","02"]
["02-04-08-01",4,null,15,2,4,8,1,"02","04","08","01"]
["02-04-09-00",4,null,15,2,4,9,0,"02","04","09","00"]
["02-05-00-08",4,null,15,2,5,0,8,"02","05","00","08"]
["02-05-01-07",4,null,15,2,5,1,7,"02","05","01","07"]
["02-05-02-06",4,null,15,2,5,2,6,"02","05","02","06"]
["02-05-03-05",4,null,15,2,5,3,5,"02","05","03","05"]
["02-05-04-04",4,null,15,2,5,4,4,"02","05","04","04"]
["02-05-05-03",4,null,15,2,5,5,3,"02","05","05","03"]
["02-05-06-02",4,null,15,2,5,6,2,"02","05","06","02"]
["02-05-07-01",4,null,15,2,5,7,1,"02","05","07","01"]
["02-05-08-00",4,null,15,2,5,8,0,"02","05","08","00"]
["02-06-00-07",3,null,15,2,6,0,7,"02","06","00","07"]
["02-06-01-06",3,null,15,2,6,1,6,"02","06","01","06"]
["02-06-02-05",3,null,15,2,6,2,5,"02","06","02","05"]
["02-06-03-04",3,null,15,2,6,3,4,"02","06","03","04"]
["02-06-04-03",3,null,15,2,6,4,3,"02","06","04","03"]
["02-06-05-02",3,null,15,2,6,5,2,"02","06","05","02"]
["02-06-06-01",3,null,15,2,6,6,1,"02","06","06","01"]
["02-06-07-00",3,null,15,2,6,7,0,"02","06","07","00"]
["02-07-00-06",3,null,15,2,7,0,6,"02","07","00","06"]
["02-07-01-05",3,null,15,2,7,1,5,"02","07","01","05"]
["02-07-02-04",3,null,15,2,7,2,4,"02","07","02","04"]
["02-07-03-03",3,null,15,2,7,3,3,"02","07","03","03"]
[{"$f":"I3399&\"-\"&J3399&\"-\"&K3399&\"-\"&L3399","v":"02-07-04-02"},3,null,15,2,7,4,2,"02","07","04","02"]
["02-07-05-01",3,null,15,2,7,5,1,{"$f":"IF(LEN(E3400)=1,0&E3400,IF(LEN(E3400)=0,\"00\",RIGHT(E3400,2)))","v":"02"},{"$f":"IF(LEN(F3400)=1,0&F3400,IF(LEN(F3400)=0,\"00\",RIGHT(F3400,2)))","v":"07"},{"$f":"IF(LEN(G3400)=1,0&G3400,IF(LEN(G3400)=0,\"00\",RIGHT(G3400,2)))","v":"05"},{"$f":"IF(LEN(H3400)=1,0&H3400,IF(LEN(H3400)=0,\"00\",RIGHT(H3400,2)))","v":"01"}]
["02-07-06-00",3,null,15,2,7,6,0,"02","07","06","00"]
["02-08-00-05",3,null,15,2,8,0,5,"02","08","00","05"]
["02-08-01-04",3,null,15,2,8,1,4,"02","08","01","04"]
["02-08-02-03",3,null,15,2,8,2,3,"02","08","02","03"]
["02-08-03-02",3,null,15,2,8,3,2,"02","08","03","02"]
["02-08-04-01",3,null,15,2,8,4,1,"02","08","04","01"]
["02-08-05-00",3,null,15,2,8,5,0,"02","08","05","00"]
["02-09-00-04",3,null,15,2,9,0,4,"02","09","00","04"]
["02-09-01-03",3,null,15,2,9,1,3,"02","09","01","03"]
["02-09-02-02",3,null,15,2,9,2,2,"02","09","02","02"]
["02-09-03-01",3,null,15,2,9,3,1,"02","09","03","01"]
["02-09-04-00",3,null,15,2,9,4,0,"02","09","04","00"]
["02-10-00-03",3,null,15,2,10,0,3,"02","10","00","03"]
["02-10-01-02",2,null,15,2,10,1,2,"02","10","01","02"]
["02-10-02-01",2,null,15,2,10,2,1,"02","10","02","01"]
["02-10-03-00",2,null,15,2,10,3,0,"02","10","03","00"]
["02-11-00-02",2,null,15,2,11,0,2,"02","11","00","02"]
["02-11-01-01",2,null,15,2,11,1,1,"02","11","01","01"]
["02-11-02-00",2,null,15,2,11,2,0,"02","11","02","00"]
["02-12-00-01",2,null,15,2,12,0,1,"02","12","00","01"]
["02-12-01-00",2,null,15,2,12,1,0,"02","12","01","00"]
["02-13-00-00",2,null,15,2,13,0,0,"02","13","00","00"]
["03-00-00-12",5,null,15,3,0,0,12,"03","00","00","12"]
["03-00-01-11",5,null,15,3,0,1,11,"03","00","01","11"]
["03-00-02-10",5,null,15,3,0,2,10,"03","00","02","10"]
["03-00-03-09",5,null,15,3,0,3,9,"03","00","03","09"]
["03-00-04-08",5,null,15,3,0,4,8,"03","00","04","08"]
["03-00-05-07",5,null,15,3,0,5,7,"03","00","05","07"]
["03-00-06-06",5,null,15,3,0,6,6,"03","00","06","06"]
["03-00-07-05",4,null,15,3,0,7,5,"03","00","07","05"]
["03-00-08-04",4,null,15,3,0,8,4,"03","00","08","04"]
["03-00-09-03",4,null,15,3,0,9,3,"03","00","09","03"]
["03-00-10-02",4,null,15,3,0,10,2,"03","00","10","02"]
["03-00-11-01",4,null,15,3,0,11,1,"03","00","11","01"]
["03-00-12-00",4,null,15,3,0,12,0,"03","00","12","00"]
["03-01-00-11",5,null,15,3,1,0,11,"03","01","00","11"]
["03-01-01-10",5,null,15,3,1,1,10,"03","01","01","10"]
["03-01-02-09",5,null,15,3,1,2,9,"03","01","02","09"]
["03-01-03-08",5,null,15,3,1,3,8,"03","01","03","08"]
["03-01-04-07",4,null,15,3,1,4,7,"03","01","04","07"]
["03-01-05-06",4,null,15,3,1,5,6,"03","01","05","06"]
["03-01-06-05",4,null,15,3,1,6,5,"03","01","06","05"]
["03-01-07-04",4,null,15,3,1,7,4,"03","01","07","04"]
["03-01-08-03",4,null,15,3,1,8,3,"03","01","08","03"]
["03-01-09-02",4,null,15,3,1,9,2,"03","01","09","02"]
["03-01-10-01",4,null,15,3,1,10,1,"03","01","10","01"]
["03-01-11-00",4,null,15,3,1,11,0,"03","01","11","00"]
["03-02-00-10",5,null,15,3,2,0,10,"03","02","00","10"]
["03-02-01-09",5,null,15,3,2,1,9,"03","02","01","09"]
["03-02-02-08",4,null,15,3,2,2,8,"03","02","02","08"]
["03-02-03-07",4,null,15,3,2,3,7,"03","02","03","07"]
["03-02-04-06",4,null,15,3,2,4,6,"03","02","04","06"]
["03-02-05-05",4,null,15,3,2,5,5,"03","02","05","05"]
["03-02-06-04",4,null,15,3,2,6,4,"03","02","06","04"]
["03-02-07-03",4,null,15,3,2,7,3,"03","02","07","03"]
["03-02-08-02",4,null,15,3,2,8,2,"03","02","08","02"]
["03-02-09-01",4,null,15,3,2,9,1,"03","02","09","01"]
["03-02-10-00",4,null,15,3,2,10,0,"03","02","10","00"]
["03-03-00-09",4,null,15,3,3,0,9,"03","03","00","09"]
["03-03-01-08",4,null,15,3,3,1,8,"03","03","01","08"]
["03-03-02-07",4,null,15,3,3,2,7,"03","03","02","07"]
["03-03-03-06",4,null,15,3,3,3,6,"03","03","03","06"]
[{"$f":"I3463&\"-\"&J3463&\"-\"&K3463&\"-\"&L3463","v":"03-03-04-05"},4,null,15,3,3,4,5,"03","03","04","05"]
["03-03-05-04",4,null,15,3,3,5,4,{"$f":"IF(LEN(E3464)=1,0&E3464,IF(LEN(E3464)=0,\"00\",RIGHT(E3464,2)))","v":"03"},{"$f":"IF(LEN(F3464)=1,0&F3464,IF(LEN(F3464)=0,\"00\",RIGHT(F3464,2)))","v":"03"},{"$f":"IF(LEN(G3464)=1,0&G3464,IF(LEN(G3464)=0,\"00\",RIGHT(G3464,2)))","v":"05"},{"$f":"IF(LEN(H3464)=1,0&H3464,IF(LEN(H3464)=0,\"00\",RIGHT(H3464,2)))","v":"04"}]
["03-03-06-03",4,null,15,3,3,6,3,"03","03","06","03"]
["03-03-07-02",4,null,15,3,3,7,2,"03","03","07","02"]
["03-03-08-01",4,null,15,3,3,8,1,"03","03","08","01"]
["03-03-09-00",4,null,15,3,3,9,0,"03","03","09","00"]
["03-04-00-08",4,null,15,3,4,0,8,"03","04","00","08"]
["03-04-01-07",4,null,15,3,4,1,7,"03","04","01","07"]
["03-04-02-06",4,null,15,3,4,2,6,"03","04","02","06"]
["03-04-03-05",4,null,15,3,4,3,5,"03","04","03","05"]
["03-04-04-04",4,null,15,3,4,4,4,"03","04","04","04"]
["03-04-05-03",4,null,15,3,4,5,3,"03","04","05","03"]
["03-04-06-02",4,null,15,3,4,6,2,"03","04","06","02"]
["03-04-07-01",4,null,15,3,4,7,1,"03","04","07","01"]
["03-04-08-00",4,null,15,3,4,8,0,"03","04","08","00"]
["03-05-00-07",3,null,15,3,5,0,7,"03","05","00","07"]
["03-05-01-06",3,null,15,3,5,1,6,"03","05","01","06"]
["03-05-02-05",3,null,15,3,5,2,5,"03","05","02","05"]
["03-05-03-04",3,null,15,3,5,3,4,"03","05","03","04"]
["03-05-04-03",3,null,15,3,5,4,3,"03","05","04","03"]
["03-05-05-02",3,null,15,3,5,5,2,"03","05","05","02"]
["03-05-06-01",3,null,15,3,5,6,1,"03","05","06","01"]
["03-05-07-00",3,null,15,3,5,7,0,"03","05","07","00"]
["03-06-00-06",3,null,15,3,6,0,6,"03","06","00","06"]
["03-06-01-05",3,null,15,3,6,1,5,"03","06","01","05"]
["03-06-02-04",3,null,15,3,6,2,4,"03","06","02","04"]
["03-06-03-03",3,null,15,3,6,3,3,"03","06","03","03"]
["03-06-04-02",3,null,15,3,6,4,2,"03","06","04","02"]
["03-06-05-01",3,null,15,3,6,5,1,"03","06","05","01"]
["03-06-06-00",3,null,15,3,6,6,0,"03","06","06","00"]
["03-07-00-05",3,null,15,3,7,0,5,"03","07","00","05"]
["03-07-01-04",3,null,15,3,7,1,4,"03","07","01","04"]
["03-07-02-03",3,null,15,3,7,2,3,"03","07","02","03"]
["03-07-03-02",3,null,15,3,7,3,2,"03","07","03","02"]
["03-07-04-01",3,null,15,3,7,4,1,"03","07","04","01"]
["03-07-05-00",3,null,15,3,7,5,0,"03","07","05","00"]
["03-08-00-04",3,null,15,3,8,0,4,"03","08","00","04"]
["03-08-01-03",3,null,15,3,8,1,3,"03","08","01","03"]
["03-08-02-02",3,null,15,3,8,2,2,"03","08","02","02"]
["03-08-03-01",3,null,15,3,8,3,1,"03","08","03","01"]
["03-08-04-00",3,null,15,3,8,4,0,"03","08","04","00"]
["03-09-00-03",3,null,15,3,9,0,3,"03","09","00","03"]
["03-09-01-02",2,null,15,3,9,1,2,"03","09","01","02"]
["03-09-02-01",2,null,15,3,9,2,1,"03","09","02","01"]
["03-09-03-00",2,null,15,3,9,3,0,"03","09","03","00"]
["03-10-00-02",2,null,15,3,10,0,2,"03","10","00","02"]
["03-10-01-01",2,null,15,3,10,1,1,"03","10","01","01"]
["03-10-02-00",2,null,15,3,10,2,0,"03","10","02","00"]
["03-11-00-01",2,null,15,3,11,0,1,"03","11","00","01"]
["03-11-01-00",2,null,15,3,11,1,0,"03","11","01","00"]
["03-12-00-00",2,null,15,3,12,0,0,"03","12","00","00"]
["04-00-00-11",5,null,15,4,0,0,11,"04","00","00","11"]
["04-00-01-10",5,null,15,4,0,1,10,"04","00","01","10"]
["04-00-02-09",5,null,15,4,0,2,9,"04","00","02","09"]
["04-00-03-08",4,null,15,4,0,3,8,"04","00","03","08"]
["04-00-04-07",4,null,15,4,0,4,7,"04","00","04","07"]
["04-00-05-06",4,null,15,4,0,5,6,"04","00","05","06"]
["04-00-06-05",4,null,15,4,0,6,5,"04","00","06","05"]
["04-00-07-04",4,null,15,4,0,7,4,"04","00","07","04"]
["04-00-08-03",4,null,15,4,0,8,3,"04","00","08","03"]
["04-00-09-02",4,null,15,4,0,9,2,"04","00","09","02"]
["04-00-10-01",4,null,15,4,0,10,1,"04","00","10","01"]
["04-00-11-00",4,null,15,4,0,11,0,"04","00","11","00"]
["04-01-00-10",4,null,15,4,1,0,10,"04","01","00","10"]
[{"$f":"I3527&\"-\"&J3527&\"-\"&K3527&\"-\"&L3527","v":"04-01-01-09"},4,null,15,4,1,1,9,"04","01","01","09"]
["04-01-02-08",4,null,15,4,1,2,8,{"$f":"IF(LEN(E3528)=1,0&E3528,IF(LEN(E3528)=0,\"00\",RIGHT(E3528,2)))","v":"04"},{"$f":"IF(LEN(F3528)=1,0&F3528,IF(LEN(F3528)=0,\"00\",RIGHT(F3528,2)))","v":"01"},{"$f":"IF(LEN(G3528)=1,0&G3528,IF(LEN(G3528)=0,\"00\",RIGHT(G3528,2)))","v":"02"},{"$f":"IF(LEN(H3528)=1,0&H3528,IF(LEN(H3528)=0,\"00\",RIGHT(H3528,2)))","v":"08"}]
["04-01-03-07",4,null,15,4,1,3,7,"04","01","03","07"]
["04-01-04-06",4,null,15,4,1,4,6,"04","01","04","06"]
["04-01-05-05",4,null,15,4,1,5,5,"04","01","05","05"]
["04-01-06-04",4,null,15,4,1,6,4,"04","01","06","04"]
["04-01-07-03",4,null,15,4,1,7,3,"04","01","07","03"]
["04-01-08-02",4,null,15,4,1,8,2,"04","01","08","02"]
["04-01-09-01",4,null,15,4,1,9,1,"04","01","09","01"]
["04-01-10-00",4,null,15,4,1,10,0,"04","01","10","00"]
["04-02-00-09",4,null,15,4,2,0,9,"04","02","00","09"]
["04-02-01-08",4,null,15,4,2,1,8,"04","02","01","08"]
["04-02-02-07",4,null,15,4,2,2,7,"04","02","02","07"]
["04-02-03-06",4,null,15,4,2,3,6,"04","02","03","06"]
["04-02-04-05",4,null,15,4,2,4,5,"04","02","04","05"]
["04-02-05-04",4,null,15,4,2,5,4,"04","02","05","04"]
["04-02-06-03",4,null,15,4,2,6,3,"04","02","06","03"]
["04-02-07-02",4,null,15,4,2,7,2,"04","02","07","02"]
["04-02-08-01",4,null,15,4,2,8,1,"04","02","08","01"]
["04-02-09-00",4,null,15,4,2,9,0,"04","02","09","00"]
["04-03-00-08",4,null,15,4,3,0,8,"04","03","00","08"]
["04-03-01-07",4,null,15,4,3,1,7,"04","03","01","07"]
["04-03-02-06",4,null,15,4,3,2,6,"04","03","02","06"]
["04-03-03-05",4,null,15,4,3,3,5,"04","03","03","05"]
["04-03-04-04",4,null,15,4,3,4,4,"04","03","04","04"]
["04-03-05-03",4,null,15,4,3,5,3,"04","03","05","03"]
["04-03-06-02",4,null,15,4,3,6,2,"04","03","06","02"]
["04-03-07-01",4,null,15,4,3,7,1,"04","03","07","01"]
["04-03-08-00",4,null,15,4,3,8,0,"04","03","08","00"]
["04-04-00-07",3,null,15,4,4,0,7,"04","04","00","07"]
["04-04-01-06",3,null,15,4,4,1,6,"04","04","01","06"]
["04-04-02-05",3,null,15,4,4,2,5,"04","04","02","05"]
["04-04-03-04",3,null,15,4,4,3,4,"04","04","03","04"]
["04-04-04-03",3,null,15,4,4,4,3,"04","04","04","03"]
["04-04-05-02",3,null,15,4,4,5,2,"04","04","05","02"]
["04-04-06-01",3,null,15,4,4,6,1,"04","04","06","01"]
["04-04-07-00",3,null,15,4,4,7,0,"04","04","07","00"]
["04-05-00-06",3,null,15,4,5,0,6,"04","05","00","06"]
["04-05-01-05",3,null,15,4,5,1,5,"04","05","01","05"]
["04-05-02-04",3,null,15,4,5,2,4,"04","05","02","04"]
["04-05-03-03",3,null,15,4,5,3,3,"04","05","03","03"]
["04-05-04-02",3,null,15,4,5,4,2,"04","05","04","02"]
["04-05-05-01",3,null,15,4,5,5,1,"04","05","05","01"]
["04-05-06-00",3,null,15,4,5,6,0,"04","05","06","00"]
["04-06-00-05",3,null,15,4,6,0,5,"04","06","00","05"]
["04-06-01-04",3,null,15,4,6,1,4,"04","06","01","04"]
["04-06-02-03",3,null,15,4,6,2,3,"04","06","02","03"]
["04-06-03-02",3,null,15,4,6,3,2,"04","06","03","02"]
["04-06-04-01",3,null,15,4,6,4,1,"04","06","04","01"]
["04-06-05-00",3,null,15,4,6,5,0,"04","06","05","00"]
["04-07-00-04",3,null,15,4,7,0,4,"04","07","00","04"]
["04-07-01-03",3,null,15,4,7,1,3,"04","07","01","03"]
["04-07-02-02",3,null,15,4,7,2,2,"04","07","02","02"]
["04-07-03-01",3,null,15,4,7,3,1,"04","07","03","01"]
["04-07-04-00",3,null,15,4,7,4,0,"04","07","04","00"]
["04-08-00-03",3,null,15,4,8,0,3,"04","08","00","03"]
["04-08-01-02",2,null,15,4,8,1,2,"04","08","01","02"]
["04-08-02-01",2,null,15,4,8,2,1,"04","08","02","01"]
["04-08-03-00",2,null,15,4,8,3,0,"04","08","03","00"]
["04-09-00-02",2,null,15,4,9,0,2,"04","09","00","02"]
["04-09-01-01",2,null,15,4,9,1,1,"04","09","01","01"]
["04-09-02-00",2,null,15,4,9,2,0,"04","09","02","00"]
["04-10-00-01",2,null,15,4,10,0,1,"04","10","00","01"]
["04-10-01-00",2,null,15,4,10,1,0,"04","10","01","00"]
[{"$f":"I3591&\"-\"&J3591&\"-\"&K3591&\"-\"&L3591","v":"04-11-00-00"},2,null,15,4,11,0,0,"04","11","00","00"]
["05-00-00-10",4,null,15,5,0,0,10,{"$f":"IF(LEN(E3592)=1,0&E3592,IF(LEN(E3592)=0,\"00\",RIGHT(E3592,2)))","v":"05"},{"$f":"IF(LEN(F3592)=1,0&F3592,IF(LEN(F3592)=0,\"00\",RIGHT(F3592,2)))","v":"00"},{"$f":"IF(LEN(G3592)=1,0&G3592,IF(LEN(G3592)=0,\"00\",RIGHT(G3592,2)))","v":"00"},{"$f":"IF(LEN(H3592)=1,0&H3592,IF(LEN(H3592)=0,\"00\",RIGHT(H3592,2)))","v":"10"}]
["05-00-01-09",4,null,15,5,0,1,9,"05","00","01","09"]
["05-00-02-08",4,null,15,5,0,2,8,"05","00","02","08"]
["05-00-03-07",4,null,15,5,0,3,7,"05","00","03","07"]
["05-00-04-06",4,null,15,5,0,4,6,"05","00","04","06"]
["05-00-05-05",4,null,15,5,0,5,5,"05","00","05","05"]
["05-00-06-04",4,null,15,5,0,6,4,"05","00","06","04"]
["05-00-07-03",4,null,15,5,0,7,3,"05","00","07","03"]
["05-00-08-02",4,null,15,5,0,8,2,"05","00","08","02"]
["05-00-09-01",4,null,15,5,0,9,1,"05","00","09","01"]
["05-00-10-00",4,null,15,5,0,10,0,"05","00","10","00"]
["05-01-00-09",4,null,15,5,1,0,9,"05","01","00","09"]
["05-01-01-08",4,null,15,5,1,1,8,"05","01","01","08"]
["05-01-02-07",4,null,15,5,1,2,7,"05","01","02","07"]
["05-01-03-06",4,null,15,5,1,3,6,"05","01","03","06"]
["05-01-04-05",4,null,15,5,1,4,5,"05","01","04","05"]
["05-01-05-04",4,null,15,5,1,5,4,"05","01","05","04"]
["05-01-06-03",4,null,15,5,1,6,3,"05","01","06","03"]
["05-01-07-02",4,null,15,5,1,7,2,"05","01","07","02"]
["05-01-08-01",4,null,15,5,1,8,1,"05","01","08","01"]
["05-01-09-00",4,null,15,5,1,9,0,"05","01","09","00"]
["05-02-00-08",4,null,15,5,2,0,8,"05","02","00","08"]
["05-02-01-07",4,null,15,5,2,1,7,"05","02","01","07"]
["05-02-02-06",4,null,15,5,2,2,6,"05","02","02","06"]
["05-02-03-05",4,null,15,5,2,3,5,"05","02","03","05"]
["05-02-04-04",4,null,15,5,2,4,4,"05","02","04","04"]
["05-02-05-03",4,null,15,5,2,5,3,"05","02","05","03"]
["05-02-06-02",4,null,15,5,2,6,2,"05","02","06","02"]
["05-02-07-01",4,null,15,5,2,7,1,"05","02","07","01"]
["05-02-08-00",4,null,15,5,2,8,0,"05","02","08","00"]
["05-03-00-07",3,null,15,5,3,0,7,"05","03","00","07"]
["05-03-01-06",3,null,15,5,3,1,6,"05","03","01","06"]
["05-03-02-05",3,null,15,5,3,2,5,"05","03","02","05"]
["05-03-03-04",3,null,15,5,3,3,4,"05","03","03","04"]
["05-03-04-03",3,null,15,5,3,4,3,"05","03","04","03"]
["05-03-05-02",3,null,15,5,3,5,2,"05","03","05","02"]
["05-03-06-01",3,null,15,5,3,6,1,"05","03","06","01"]
["05-03-07-00",3,null,15,5,3,7,0,"05","03","07","00"]
["05-04-00-06",3,null,15,5,4,0,6,"05","04","00","06"]
["05-04-01-05",3,null,15,5,4,1,5,"05","04","01","05"]
["05-04-02-04",3,null,15,5,4,2,4,"05","04","02","04"]
["05-04-03-03",3,null,15,5,4,3,3,"05","04","03","03"]
["05-04-04-02",3,null,15,5,4,4,2,"05","04","04","02"]
["05-04-05-01",3,null,15,5,4,5,1,"05","04","05","01"]
["05-04-06-00",3,null,15,5,4,6,0,"05","04","06","00"]
["05-05-00-05",3,null,15,5,5,0,5,"05","05","00","05"]
["05-05-01-04",3,null,15,5,5,1,4,"05","05","01","04"]
["05-05-02-03",3,null,15,5,5,2,3,"05","05","02","03"]
["05-05-03-02",3,null,15,5,5,3,2,"05","05","03","02"]
["05-05-04-01",3,null,15,5,5,4,1,"05","05","04","01"]
["05-05-05-00",3,null,15,5,5,5,0,"05","05","05","00"]
["05-06-00-04",3,null,15,5,6,0,4,"05","06","00","04"]
["05-06-01-03",3,null,15,5,6,1,3,"05","06","01","03"]
["05-06-02-02",3,null,15,5,6,2,2,"05","06","02","02"]
["05-06-03-01",3,null,15,5,6,3,1,"05","06","03","01"]
["05-06-04-00",3,null,15,5,6,4,0,"05","06","04","00"]
["05-07-00-03",3,null,15,5,7,0,3,"05","07","00","03"]
["05-07-01-02",2,null,15,5,7,1,2,"05","07","01","02"]
["05-07-02-01",2,null,15,5,7,2,1,"05","07","02","01"]
["05-07-03-00",2,null,15,5,7,3,0,"05","07","03","00"]
["05-08-00-02",2,null,15,5,8,0,2,"05","08","00","02"]
["05-08-01-01",2,null,15,5,8,1,1,"05","08","01","01"]
["05-08-02-00",2,null,15,5,8,2,0,"05","08","02","00"]
[{"$f":"I3655&\"-\"&J3655&\"-\"&K3655&\"-\"&L3655","v":"05-09-00-01"},2,null,15,5,9,0,1,"05","09","00","01"]
["05-09-01-00",2,null,15,5,9,1,0,{"$f":"IF(LEN(E3656)=1,0&E3656,IF(LEN(E3656)=0,\"00\",RIGHT(E3656,2)))","v":"05"},{"$f":"IF(LEN(F3656)=1,0&F3656,IF(LEN(F3656)=0,\"00\",RIGHT(F3656,2)))","v":"09"},{"$f":"IF(LEN(G3656)=1,0&G3656,IF(LEN(G3656)=0,\"00\",RIGHT(G3656,2)))","v":"01"},{"$f":"IF(LEN(H3656)=1,0&H3656,IF(LEN(H3656)=0,\"00\",RIGHT(H3656,2)))","v":"00"}]
["05-10-00-00",2,null,15,5,10,0,0,"05","10","00","00"]
["06-00-00-09",4,null,15,6,0,0,9,"06","00","00","09"]
["06-00-01-08",4,null,15,6,0,1,8,"06","00","01","08"]
["06-00-02-07",4,null,15,6,0,2,7,"06","00","02","07"]
["06-00-03-06",4,null,15,6,0,3,6,"06","00","03","06"]
["06-00-04-05",4,null,15,6,0,4,5,"06","00","04","05"]
["06-00-05-04",4,null,15,6,0,5,4,"06","00","05","04"]
["06-00-06-03",4,null,15,6,0,6,3,"06","00","06","03"]
["06-00-07-02",4,null,15,6,0,7,2,"06","00","07","02"]
["06-00-08-01",4,null,15,6,0,8,1,"06","00","08","01"]
["06-00-09-00",4,null,15,6,0,9,0,"06","00","09","00"]
["06-01-00-08",4,null,15,6,1,0,8,"06","01","00","08"]
["06-01-01-07",4,null,15,6,1,1,7,"06","01","01","07"]
["06-01-02-06",4,null,15,6,1,2,6,"06","01","02","06"]
["06-01-03-05",4,null,15,6,1,3,5,"06","01","03","05"]
["06-01-04-04",4,null,15,6,1,4,4,"06","01","04","04"]
["06-01-05-03",4,null,15,6,1,5,3,"06","01","05","03"]
["06-01-06-02",4,null,15,6,1,6,2,"06","01","06","02"]
["06-01-07-01",3,null,15,6,1,7,1,"06","01","07","01"]
["06-01-08-00",3,null,15,6,1,8,0,"06","01","08","00"]
["06-02-00-07",3,null,15,6,2,0,7,"06","02","00","07"]
["06-02-01-06",3,null,15,6,2,1,6,"06","02","01","06"]
["06-02-02-05",3,null,15,6,2,2,5,"06","02","02","05"]
["06-02-03-04",3,null,15,6,2,3,4,"06","02","03","04"]
["06-02-04-03",3,null,15,6,2,4,3,"06","02","04","03"]
["06-02-05-02",3,null,15,6,2,5,2,"06","02","05","02"]
["06-02-06-01",3,null,15,6,2,6,1,"06","02","06","01"]
["06-02-07-00",3,null,15,6,2,7,0,"06","02","07","00"]
["06-03-00-06",3,null,15,6,3,0,6,"06","03","00","06"]
["06-03-01-05",3,null,15,6,3,1,5,"06","03","01","05"]
["06-03-02-04",3,null,15,6,3,2,4,"06","03","02","04"]
["06-03-03-03",3,null,15,6,3,3,3,"06","03","03","03"]
["06-03-04-02",3,null,15,6,3,4,2,"06","03","04","02"]
["06-03-05-01",3,null,15,6,3,5,1,"06","03","05","01"]
["06-03-06-00",3,null,15,6,3,6,0,"06","03","06","00"]
["06-04-00-05",3,null,15,6,4,0,5,"06","04","00","05"]
["06-04-01-04",3,null,15,6,4,1,4,"06","04","01","04"]
["06-04-02-03",3,null,15,6,4,2,3,"06","04","02","03"]
["06-04-03-02",3,null,15,6,4,3,2,"06","04","03","02"]
["06-04-04-01",3,null,15,6,4,4,1,"06","04","04","01"]
["06-04-05-00",3,null,15,6,4,5,0,"06","04","05","00"]
["06-05-00-04",3,null,15,6,5,0,4,"06","05","00","04"]
["06-05-01-03",3,null,15,6,5,1,3,"06","05","01","03"]
["06-05-02-02",3,null,15,6,5,2,2,"06","05","02","02"]
["06-05-03-01",3,null,15,6,5,3,1,"06","05","03","01"]
["06-05-04-00",3,null,15,6,5,4,0,"06","05","04","00"]
["06-06-00-03",3,null,15,6,6,0,3,"06","06","00","03"]
["06-06-01-02",2,null,15,6,6,1,2,"06","06","01","02"]
["06-06-02-01",2,null,15,6,6,2,1,"06","06","02","01"]
["06-06-03-00",2,null,15,6,6,3,0,"06","06","03","00"]
["06-07-00-02",2,null,15,6,7,0,2,"06","07","00","02"]
["06-07-01-01",2,null,15,6,7,1,1,"06","07","01","01"]
["06-07-02-00",2,null,15,6,7,2,0,"06","07","02","00"]
["06-08-00-01",2,null,15,6,8,0,1,"06","08","00","01"]
["06-08-01-00",2,null,15,6,8,1,0,"06","08","01","00"]
["06-09-00-00",2,null,15,6,9,0,0,"06","09","00","00"]
["07-00-00-08",4,null,15,7,0,0,8,"07","00","00","08"]
["07-00-01-07",4,null,15,7,0,1,7,"07","00","01","07"]
["07-00-02-06",4,null,15,7,0,2,6,"07","00","02","06"]
["07-00-03-05",4,null,15,7,0,3,5,"07","00","03","05"]
["07-00-04-04",4,null,15,7,0,4,4,"07","00","04","04"]
["07-00-05-03",4,null,15,7,0,5,3,"07","00","05","03"]
[{"$f":"I3719&\"-\"&J3719&\"-\"&K3719&\"-\"&L3719","v":"07-00-06-02"},3,null,15,7,0,6,2,"07","00","06","02"]
["07-00-07-01",3,null,15,7,0,7,1,{"$f":"IF(LEN(E3720)=1,0&E3720,IF(LEN(E3720)=0,\"00\",RIGHT(E3720,2)))","v":"07"},{"$f":"IF(LEN(F3720)=1,0&F3720,IF(LEN(F3720)=0,\"00\",RIGHT(F3720,2)))","v":"00"},{"$f":"IF(LEN(G3720)=1,0&G3720,IF(LEN(G3720)=0,\"00\",RIGHT(G3720,2)))","v":"07"},{"$f":"IF(LEN(H3720)=1,0&H3720,IF(LEN(H3720)=0,\"00\",RIGHT(H3720,2)))","v":"01"}]
["07-00-08-00",3,null,15,7,0,8,0,"07","00","08","00"]
["07-01-00-07",3,null,15,7,1,0,7,"07","01","00","07"]
["07-01-01-06",3,null,15,7,1,1,6,"07","01","01","06"]
["07-01-02-05",3,null,15,7,1,2,5,"07","01","02","05"]
["07-01-03-04",3,null,15,7,1,3,4,"07","01","03","04"]
["07-01-04-03",3,null,15,7,1,4,3,"07","01","04","03"]
["07-01-05-02",3,null,15,7,1,5,2,"07","01","05","02"]
["07-01-06-01",3,null,15,7,1,6,1,"07","01","06","01"]
["07-01-07-00",3,null,15,7,1,7,0,"07","01","07","00"]
["07-02-00-06",3,null,15,7,2,0,6,"07","02","00","06"]
["07-02-01-05",3,null,15,7,2,1,5,"07","02","01","05"]
["07-02-02-04",3,null,15,7,2,2,4,"07","02","02","04"]
["07-02-03-03",3,null,15,7,2,3,3,"07","02","03","03"]
["07-02-04-02",3,null,15,7,2,4,2,"07","02","04","02"]
["07-02-05-01",3,null,15,7,2,5,1,"07","02","05","01"]
["07-02-06-00",3,null,15,7,2,6,0,"07","02","06","00"]
["07-03-00-05",3,null,15,7,3,0,5,"07","03","00","05"]
["07-03-01-04",3,null,15,7,3,1,4,"07","03","01","04"]
["07-03-02-03",3,null,15,7,3,2,3,"07","03","02","03"]
["07-03-03-02",3,null,15,7,3,3,2,"07","03","03","02"]
["07-03-04-01",3,null,15,7,3,4,1,"07","03","04","01"]
["07-03-05-00",3,null,15,7,3,5,0,"07","03","05","00"]
["07-04-00-04",3,null,15,7,4,0,4,"07","04","00","04"]
["07-04-01-03",3,null,15,7,4,1,3,"07","04","01","03"]
["07-04-02-02",3,null,15,7,4,2,2,"07","04","02","02"]
["07-04-03-01",3,null,15,7,4,3,1,"07","04","03","01"]
["07-04-04-00",3,null,15,7,4,4,0,"07","04","04","00"]
["07-05-00-03",3,null,15,7,5,0,3,"07","05","00","03"]
["07-05-01-02",2,null,15,7,5,1,2,"07","05","01","02"]
["07-05-02-01",2,null,15,7,5,2,1,"07","05","02","01"]
["07-05-03-00",2,null,15,7,5,3,0,"07","05","03","00"]
["07-06-00-02",2,null,15,7,6,0,2,"07","06","00","02"]
["07-06-01-01",2,null,15,7,6,1,1,"07","06","01","01"]
["07-06-02-00",2,null,15,7,6,2,0,"07","06","02","00"]
["07-07-00-01",2,null,15,7,7,0,1,"07","07","00","01"]
["07-07-01-00",2,null,15,7,7,1,0,"07","07","01","00"]
["07-08-00-00",2,null,15,7,8,0,0,"07","08","00","00"]
["08-00-00-07",3,null,15,8,0,0,7,"08","00","00","07"]
["08-00-01-06",3,null,15,8,0,1,6,"08","00","01","06"]
["08-00-02-05",3,null,15,8,0,2,5,"08","00","02","05"]
["08-00-03-04",3,null,15,8,0,3,4,"08","00","03","04"]
["08-00-04-03",3,null,15,8,0,4,3,"08","00","04","03"]
["08-00-05-02",3,null,15,8,0,5,2,"08","00","05","02"]
["08-00-06-01",3,null,15,8,0,6,1,"08","00","06","01"]
["08-00-07-00",3,null,15,8,0,7,0,"08","00","07","00"]
["08-01-00-06",3,null,15,8,1,0,6,"08","01","00","06"]
["08-01-01-05",3,null,15,8,1,1,5,"08","01","01","05"]
["08-01-02-04",3,null,15,8,1,2,4,"08","01","02","04"]
["08-01-03-03",3,null,15,8,1,3,3,"08","01","03","03"]
["08-01-04-02",3,null,15,8,1,4,2,"08","01","04","02"]
["08-01-05-01",3,null,15,8,1,5,1,"08","01","05","01"]
["08-01-06-00",3,null,15,8,1,6,0,"08","01","06","00"]
["08-02-00-05",3,null,15,8,2,0,5,"08","02","00","05"]
["08-02-01-04",3,null,15,8,2,1,4,"08","02","01","04"]
["08-02-02-03",3,null,15,8,2,2,3,"08","02","02","03"]
["08-02-03-02",3,null,15,8,2,3,2,"08","02","03","02"]
["08-02-04-01",3,null,15,8,2,4,1,"08","02","04","01"]
["08-02-05-00",3,null,15,8,2,5,0,"08","02","05","00"]
["08-03-00-04",3,null,15,8,3,0,4,"08","03","00","04"]
["08-03-01-03",3,null,15,8,3,1,3,"08","03","01","03"]
["08-03-02-02",3,null,15,8,3,2,2,"08","03","02","02"]
["08-03-03-01",3,null,15,8,3,3,1,"08","03","03","01"]
[{"$f":"I3783&\"-\"&J3783&\"-\"&K3783&\"-\"&L3783","v":"08-03-04-00"},3,null,15,8,3,4,0,"08","03","04","00"]
["08-04-00-03",3,null,15,8,4,0,3,{"$f":"IF(LEN(E3784)=1,0&E3784,IF(LEN(E3784)=0,\"00\",RIGHT(E3784,2)))","v":"08"},{"$f":"IF(LEN(F3784)=1,0&F3784,IF(LEN(F3784)=0,\"00\",RIGHT(F3784,2)))","v":"04"},{"$f":"IF(LEN(G3784)=1,0&G3784,IF(LEN(G3784)=0,\"00\",RIGHT(G3784,2)))","v":"00"},{"$f":"IF(LEN(H3784)=1,0&H3784,IF(LEN(H3784)=0,\"00\",RIGHT(H3784,2)))","v":"03"}]
["08-04-01-02",2,null,15,8,4,1,2,"08","04","01","02"]
["08-04-02-01",2,null,15,8,4,2,1,"08","04","02","01"]
["08-04-03-00",2,null,15,8,4,3,0,"08","04","03","00"]
["08-05-00-02",2,null,15,8,5,0,2,"08","05","00","02"]
["08-05-01-01",2,null,15,8,5,1,1,"08","05","01","01"]
["08-05-02-00",2,null,15,8,5,2,0,"08","05","02","00"]
["08-06-00-01",2,null,15,8,6,0,1,"08","06","00","01"]
["08-06-01-00",2,null,15,8,6,1,0,"08","06","01","00"]
["08-07-00-00",2,null,15,8,7,0,0,"08","07","00","00"]
["09-00-00-06",3,null,15,9,0,0,6,"09","00","00","06"]
["09-00-01-05",3,null,15,9,0,1,5,"09","00","01","05"]
["09-00-02-04",3,null,15,9,0,2,4,"09","00","02","04"]
["09-00-03-03",3,null,15,9,0,3,3,"09","00","03","03"]
["09-00-04-02",3,null,15,9,0,4,2,"09","00","04","02"]
["09-00-05-01",3,null,15,9,0,5,1,"09","00","05","01"]
["09-00-06-00",3,null,15,9,0,6,0,"09","00","06","00"]
["09-01-00-05",3,null,15,9,1,0,5,"09","01","00","05"]
["09-01-01-04",3,null,15,9,1,1,4,"09","01","01","04"]
["09-01-02-03",3,null,15,9,1,2,3,"09","01","02","03"]
["09-01-03-02",3,null,15,9,1,3,2,"09","01","03","02"]
["09-01-04-01",3,null,15,9,1,4,1,"09","01","04","01"]
["09-01-05-00",3,null,15,9,1,5,0,"09","01","05","00"]
["09-02-00-04",3,null,15,9,2,0,4,"09","02","00","04"]
["09-02-01-03",3,null,15,9,2,1,3,"09","02","01","03"]
["09-02-02-02",3,null,15,9,2,2,2,"09","02","02","02"]
["09-02-03-01",3,null,15,9,2,3,1,"09","02","03","01"]
["09-02-04-00",3,null,15,9,2,4,0,"09","02","04","00"]
["09-03-00-03",3,null,15,9,3,0,3,"09","03","00","03"]
["09-03-01-02",2,null,15,9,3,1,2,"09","03","01","02"]
["09-03-02-01",2,null,15,9,3,2,1,"09","03","02","01"]
["09-03-03-00",2,null,15,9,3,3,0,"09","03","03","00"]
["09-04-00-02",2,null,15,9,4,0,2,"09","04","00","02"]
["09-04-01-01",2,null,15,9,4,1,1,"09","04","01","01"]
["09-04-02-00",2,null,15,9,4,2,0,"09","04","02","00"]
["09-05-00-01",2,null,15,9,5,0,1,"09","05","00","01"]
["09-05-01-00",2,null,15,9,5,1,0,"09","05","01","00"]
["09-06-00-00",2,null,15,9,6,0,0,"09","06","00","00"]
["10-00-00-05",3,null,15,10,0,0,5,"10","00","00","05"]
["10-00-01-04",3,null,15,10,0,1,4,"10","00","01","04"]
["10-00-02-03",3,null,15,10,0,2,3,"10","00","02","03"]
["10-00-03-02",3,null,15,10,0,3,2,"10","00","03","02"]
["10-00-04-01",3,null,15,10,0,4,1,"10","00","04","01"]
["10-00-05-00",3,null,15,10,0,5,0,"10","00","05","00"]
["10-01-00-04",3,null,15,10,1,0,4,"10","01","00","04"]
["10-01-01-03",3,null,15,10,1,1,3,"10","01","01","03"]
["10-01-02-02",3,null,15,10,1,2,2,"10","01","02","02"]
["10-01-03-01",3,null,15,10,1,3,1,"10","01","03","01"]
["10-01-04-00",3,null,15,10,1,4,0,"10","01","04","00"]
["10-02-00-03",3,null,15,10,2,0,3,"10","02","00","03"]
["10-02-01-02",2,null,15,10,2,1,2,"10","02","01","02"]
["10-02-02-01",2,null,15,10,2,2,1,"10","02","02","01"]
["10-02-03-00",2,null,15,10,2,3,0,"10","02","03","00"]
["10-03-00-02",2,null,15,10,3,0,2,"10","03","00","02"]
["10-03-01-01",2,null,15,10,3,1,1,"10","03","01","01"]
["10-03-02-00",2,null,15,10,3,2,0,"10","03","02","00"]
["10-04-00-01",2,null,15,10,4,0,1,"10","04","00","01"]
["10-04-01-00",2,null,15,10,4,1,0,"10","04","01","00"]
["10-05-00-00",2,null,15,10,5,0,0,"10","05","00","00"]
["11-00-00-04",3,null,15,11,0,0,4,"11","00","00","04"]
["11-00-01-03",3,null,15,11,0,1,3,"11","00","01","03"]
["11-00-02-02",3,null,15,11,0,2,2,"11","00","02","02"]
["11-00-03-01",3,null,15,11,0,3,1,"11","00","03","01"]
[{"$f":"I3847&\"-\"&J3847&\"-\"&K3847&\"-\"&L3847","v":"11-00-04-00"},3,null,15,11,0,4,0,"11","00","04","00"]
["11-01-00-03",3,null,15,11,1,0,3,{"$f":"IF(LEN(E3848)=1,0&E3848,IF(LEN(E3848)=0,\"00\",RIGHT(E3848,2)))","v":"11"},{"$f":"IF(LEN(F3848)=1,0&F3848,IF(LEN(F3848)=0,\"00\",RIGHT(F3848,2)))","v":"01"},{"$f":"IF(LEN(G3848)=1,0&G3848,IF(LEN(G3848)=0,\"00\",RIGHT(G3848,2)))","v":"00"},{"$f":"IF(LEN(H3848)=1,0&H3848,IF(LEN(H3848)=0,\"00\",RIGHT(H3848,2)))","v":"03"}]
["11-01-01-02",2,null,15,11,1,1,2,"11","01","01","02"]
["11-01-02-01",2,null,15,11,1,2,1,"11","01","02","01"]
["11-01-03-00",2,null,15,11,1,3,0,"11","01","03","00"]
["11-02-00-02",2,null,15,11,2,0,2,"11","02","00","02"]
["11-02-01-01",2,null,15,11,2,1,1,"11","02","01","01"]
["11-02-02-00",2,null,15,11,2,2,0,"11","02","02","00"]
["11-03-00-01",2,null,15,11,3,0,1,"11","03","00","01"]
["11-03-01-00",2,null,15,11,3,1,0,"11","03","01","00"]
["11-04-00-00",2,null,15,11,4,0,0,"11","04","00","00"]
["12-00-00-03",3,null,15,12,0,0,3,"12","00","00","03"]
["12-00-01-02",2,null,15,12,0,1,2,"12","00","01","02"]
["12-00-02-01",2,null,15,12,0,2,1,"12","00","02","01"]
["12-00-03-00",2,null,15,12,0,3,0,"12","00","03","00"]
["12-01-00-02",2,null,15,12,1,0,2,"12","01","00","02"]
["12-01-01-01",2,null,15,12,1,1,1,"12","01","01","01"]
["12-01-02-00",2,null,15,12,1,2,0,"12","01","02","00"]
["12-02-00-01",2,null,15,12,2,0,1,"12","02","00","01"]
["12-02-01-00",2,null,15,12,2,1,0,"12","02","01","00"]
["12-03-00-00",2,null,15,12,3,0,0,"12","03","00","00"]
["13-00-00-02",2,null,15,13,0,0,2,"13","00","00","02"]
["13-00-01-01",2,null,15,13,0,1,1,"13","00","01","01"]
["13-00-02-00",2,null,15,13,0,2,0,"13","00","02","00"]
["13-01-00-01",2,null,15,13,1,0,1,"13","01","00","01"]
["13-01-01-00",2,null,15,13,1,1,0,"13","01","01","00"]
["13-02-00-00",2,null,15,13,2,0,0,"13","02","00","00"]
["14-00-00-01",2,null,15,14,0,0,1,"14","00","00","01"]
["14-00-01-00",2,null,15,14,0,1,0,"14","00","01","00"]
["14-01-00-00",2,null,15,14,1,0,0,"14","01","00","00"]
["15-00-00-00",1,null,15,15,0,0,0,"15","00","00","00"]
["00-00-00-16",7,null,16,0,0,0,16,"00","00","00","16"]
["00-00-01-15",6,null,16,0,0,1,15,"00","00","01","15"]
["00-00-02-14",6,null,16,0,0,2,14,"00","00","02","14"]
["00-00-03-13",6,null,16,0,0,3,13,"00","00","03","13"]
["00-00-04-12",6,null,16,0,0,4,12,"00","00","04","12"]
["00-00-05-11",6,null,16,0,0,5,11,"00","00","05","11"]
["00-00-06-10",6,null,16,0,0,6,10,"00","00","06","10"]
["00-00-07-09",6,null,16,0,0,7,9,"00","00","07","09"]
["00-00-08-08",6,null,16,0,0,8,8,"00","00","08","08"]
["00-00-09-07",5,null,16,0,0,9,7,"00","00","09","07"]
["00-00-10-06",5,null,16,0,0,10,6,"00","00","10","06"]
["00-00-11-05",5,null,16,0,0,11,5,"00","00","11","05"]
["00-00-12-04",5,null,16,0,0,12,4,"00","00","12","04"]
["00-00-13-03",4,null,16,0,0,13,3,"00","00","13","03"]
["00-00-14-02",4,null,16,0,0,14,2,"00","00","14","02"]
["00-00-15-01",4,null,16,0,0,15,1,"00","00","15","01"]
["00-00-16-00",4,null,16,0,0,16,0,"00","00","16","00"]
["00-01-00-15",5,null,16,0,1,0,15,"00","01","00","15"]
["00-01-01-14",5,null,16,0,1,1,14,"00","01","01","14"]
["00-01-02-13",5,null,16,0,1,2,13,"00","01","02","13"]
["00-01-03-12",5,null,16,0,1,3,12,"00","01","03","12"]
["00-01-04-11",5,null,16,0,1,4,11,"00","01","04","11"]
["00-01-05-10",5,null,16,0,1,5,10,"00","01","05","10"]
["00-01-06-09",5,null,16,0,1,6,9,"00","01","06","09"]
["00-01-07-08",5,null,16,0,1,7,8,"00","01","07","08"]
["00-01-08-07",5,null,16,0,1,8,7,"00","01","08","07"]
["00-01-09-06",5,null,16,0,1,9,6,"00","01","09","06"]
["00-01-10-05",5,null,16,0,1,10,5,"00","01","10","05"]
["00-01-11-04",5,null,16,0,1,11,4,"00","01","11","04"]
["00-01-12-03",4,null,16,0,1,12,3,"00","01","12","03"]
["00-01-13-02",4,null,16,0,1,13,2,"00","01","13","02"]
["00-01-14-01",4,null,16,0,1,14,1,"00","01","14","01"]
["00-01-15-00",4,null,16,0,1,15,0,"00","01","15","00"]
[{"$f":"I3911&\"-\"&J3911&\"-\"&K3911&\"-\"&L3911","v":"00-02-00-14"},5,null,16,0,2,0,14,"00","02","00","14"]
["00-02-01-13",5,null,16,0,2,1,13,{"$f":"IF(LEN(E3912)=1,0&E3912,IF(LEN(E3912)=0,\"00\",RIGHT(E3912,2)))","v":"00"},{"$f":"IF(LEN(F3912)=1,0&F3912,IF(LEN(F3912)=0,\"00\",RIGHT(F3912,2)))","v":"02"},{"$f":"IF(LEN(G3912)=1,0&G3912,IF(LEN(G3912)=0,\"00\",RIGHT(G3912,2)))","v":"01"},{"$f":"IF(LEN(H3912)=1,0&H3912,IF(LEN(H3912)=0,\"00\",RIGHT(H3912,2)))","v":"13"}]
["00-02-02-12",5,null,16,0,2,2,12,"00","02","02","12"]
["00-02-03-11",5,null,16,0,2,3,11,"00","02","03","11"]
["00-02-04-10",5,null,16,0,2,4,10,"00","02","04","10"]
["00-02-05-09",5,null,16,0,2,5,9,"00","02","05","09"]
["00-02-06-08",5,null,16,0,2,6,8,"00","02","06","08"]
["00-02-07-07",5,null,16,0,2,7,7,"00","02","07","07"]
["00-02-08-06",5,null,16,0,2,8,6,"00","02","08","06"]
["00-02-09-05",5,null,16,0,2,9,5,"00","02","09","05"]
["00-02-10-04",5,null,16,0,2,10,4,"00","02","10","04"]
["00-02-11-03",4,null,16,0,2,11,3,"00","02","11","03"]
["00-02-12-02",4,null,16,0,2,12,2,"00","02","12","02"]
["00-02-13-01",4,null,16,0,2,13,1,"00","02","13","01"]
["00-02-14-00",4,null,16,0,2,14,0,"00","02","14","00"]
["00-03-00-13",5,null,16,0,3,0,13,"00","03","00","13"]
["00-03-01-12",5,null,16,0,3,1,12,"00","03","01","12"]
["00-03-02-11",5,null,16,0,3,2,11,"00","03","02","11"]
["00-03-03-10",5,null,16,0,3,3,10,"00","03","03","10"]
["00-03-04-09",5,null,16,0,3,4,9,"00","03","04","09"]
["00-03-05-08",5,null,16,0,3,5,8,"00","03","05","08"]
["00-03-06-07",5,null,16,0,3,6,7,"00","03","06","07"]
["00-03-07-06",5,null,16,0,3,7,6,"00","03","07","06"]
["00-03-08-05",5,null,16,0,3,8,5,"00","03","08","05"]
["00-03-09-04",5,null,16,0,3,9,4,"00","03","09","04"]
["00-03-10-03",4,null,16,0,3,10,3,"00","03","10","03"]
["00-03-11-02",4,null,16,0,3,11,2,"00","03","11","02"]
["00-03-12-01",4,null,16,0,3,12,1,"00","03","12","01"]
["00-03-13-00",4,null,16,0,3,13,0,"00","03","13","00"]
["00-04-00-12",5,null,16,0,4,0,12,"00","04","00","12"]
["00-04-01-11",5,null,16,0,4,1,11,"00","04","01","11"]
["00-04-02-10",5,null,16,0,4,2,10,"00","04","02","10"]
["00-04-03-09",5,null,16,0,4,3,9,"00","04","03","09"]
["00-04-04-08",5,null,16,0,4,4,8,"00","04","04","08"]
["00-04-05-07",5,null,16,0,4,5,7,"00","04","05","07"]
["00-04-06-06",5,null,16,0,4,6,6,"00","04","06","06"]
["00-04-07-05",5,null,16,0,4,7,5,"00","04","07","05"]
["00-04-08-04",5,null,16,0,4,8,4,"00","04","08","04"]
["00-04-09-03",4,null,16,0,4,9,3,"00","04","09","03"]
["00-04-10-02",4,null,16,0,4,10,2,"00","04","10","02"]
["00-04-11-01",4,null,16,0,4,11,1,"00","04","11","01"]
["00-04-12-00",4,null,16,0,4,12,0,"00","04","12","00"]
["00-05-00-11",5,null,16,0,5,0,11,"00","05","00","11"]
["00-05-01-10",5,null,16,0,5,1,10,"00","05","01","10"]
["00-05-02-09",5,null,16,0,5,2,9,"00","05","02","09"]
["00-05-03-08",5,null,16,0,5,3,8,"00","05","03","08"]
["00-05-04-07",5,null,16,0,5,4,7,"00","05","04","07"]
["00-05-05-06",5,null,16,0,5,5,6,"00","05","05","06"]
["00-05-06-05",5,null,16,0,5,6,5,"00","05","06","05"]
["00-05-07-04",5,null,16,0,5,7,4,"00","05","07","04"]
["00-05-08-03",4,null,16,0,5,8,3,"00","05","08","03"]
["00-05-09-02",4,null,16,0,5,9,2,"00","05","09","02"]
["00-05-10-01",4,null,16,0,5,10,1,"00","05","10","01"]
["00-05-11-00",4,null,16,0,5,11,0,"00","05","11","00"]
["00-06-00-10",5,null,16,0,6,0,10,"00","06","00","10"]
["00-06-01-09",5,null,16,0,6,1,9,"00","06","01","09"]
["00-06-02-08",5,null,16,0,6,2,8,"00","06","02","08"]
["00-06-03-07",5,null,16,0,6,3,7,"00","06","03","07"]
["00-06-04-06",5,null,16,0,6,4,6,"00","06","04","06"]
["00-06-05-05",4,null,16,0,6,5,5,"00","06","05","05"]
["00-06-06-04",4,null,16,0,6,6,4,"00","06","06","04"]
["00-06-07-03",4,null,16,0,6,7,3,"00","06","07","03"]
["00-06-08-02",4,null,16,0,6,8,2,"00","06","08","02"]
["00-06-09-01",4,null,16,0,6,9,1,"00","06","09","01"]
[{"$f":"I3975&\"-\"&J3975&\"-\"&K3975&\"-\"&L3975","v":"00-06-10-00"},4,null,16,0,6,10,0,"00","06","10","00"]
["00-07-00-09",5,null,16,0,7,0,9,{"$f":"IF(LEN(E3976)=1,0&E3976,IF(LEN(E3976)=0,\"00\",RIGHT(E3976,2)))","v":"00"},{"$f":"IF(LEN(F3976)=1,0&F3976,IF(LEN(F3976)=0,\"00\",RIGHT(F3976,2)))","v":"07"},{"$f":"IF(LEN(G3976)=1,0&G3976,IF(LEN(G3976)=0,\"00\",RIGHT(G3976,2)))","v":"00"},{"$f":"IF(LEN(H3976)=1,0&H3976,IF(LEN(H3976)=0,\"00\",RIGHT(H3976,2)))","v":"09"}]
["00-07-01-08",5,null,16,0,7,1,8,"00","07","01","08"]
["00-07-02-07",5,null,16,0,7,2,7,"00","07","02","07"]
["00-07-03-06",4,null,16,0,7,3,6,"00","07","03","06"]
["00-07-04-05",4,null,16,0,7,4,5,"00","07","04","05"]
["00-07-05-04",4,null,16,0,7,5,4,"00","07","05","04"]
["00-07-06-03",4,null,16,0,7,6,3,"00","07","06","03"]
["00-07-07-02",4,null,16,0,7,7,2,"00","07","07","02"]
["00-07-08-01",4,null,16,0,7,8,1,"00","07","08","01"]
["00-07-09-00",4,null,16,0,7,9,0,"00","07","09","00"]
["00-08-00-08",4,null,16,0,8,0,8,"00","08","00","08"]
["00-08-01-07",4,null,16,0,8,1,7,"00","08","01","07"]
["00-08-02-06",4,null,16,0,8,2,6,"00","08","02","06"]
["00-08-03-05",4,null,16,0,8,3,5,"00","08","03","05"]
["00-08-04-04",4,null,16,0,8,4,4,"00","08","04","04"]
["00-08-05-03",4,null,16,0,8,5,3,"00","08","05","03"]
["00-08-06-02",4,null,16,0,8,6,2,"00","08","06","02"]
["00-08-07-01",4,null,16,0,8,7,1,"00","08","07","01"]
["00-08-08-00",4,null,16,0,8,8,0,"00","08","08","00"]
["00-09-00-07",3,null,16,0,9,0,7,"00","09","00","07"]
["00-09-01-06",3,null,16,0,9,1,6,"00","09","01","06"]
["00-09-02-05",3,null,16,0,9,2,5,"00","09","02","05"]
["00-09-03-04",3,null,16,0,9,3,4,"00","09","03","04"]
["00-09-04-03",3,null,16,0,9,4,3,"00","09","04","03"]
["00-09-05-02",3,null,16,0,9,5,2,"00","09","05","02"]
["00-09-06-01",3,null,16,0,9,6,1,"00","09","06","01"]
["00-09-07-00",3,null,16,0,9,7,0,"00","09","07","00"]
["00-10-00-06",3,null,16,0,10,0,6,"00","10","00","06"]
["00-10-01-05",3,null,16,0,10,1,5,"00","10","01","05"]
["00-10-02-04",3,null,16,0,10,2,4,"00","10","02","04"]
["00-10-03-03",3,null,16,0,10,3,3,"00","10","03","03"]
["00-10-04-02",3,null,16,0,10,4,2,"00","10","04","02"]
["00-10-05-01",3,null,16,0,10,5,1,"00","10","05","01"]
["00-10-06-00",3,null,16,0,10,6,0,"00","10","06","00"]
["00-11-00-05",3,null,16,0,11,0,5,"00","11","00","05"]
["00-11-01-04",3,null,16,0,11,1,4,"00","11","01","04"]
["00-11-02-03",3,null,16,0,11,2,3,"00","11","02","03"]
["00-11-03-02",3,null,16,0,11,3,2,"00","11","03","02"]
["00-11-04-01",3,null,16,0,11,4,1,"00","11","04","01"]
["00-11-05-00",3,null,16,0,11,5,0,"00","11","05","00"]
["00-12-00-04",3,null,16,0,12,0,4,"00","12","00","04"]
["00-12-01-03",3,null,16,0,12,1,3,"00","12","01","03"]
["00-12-02-02",3,null,16,0,12,2,2,"00","12","02","02"]
["00-12-03-01",3,null,16,0,12,3,1,"00","12","03","01"]
["00-12-04-00",3,null,16,0,12,4,0,"00","12","04","00"]
["00-13-00-03",3,null,16,0,13,0,3,"00","13","00","03"]
["00-13-01-02",3,null,16,0,13,1,2,"00","13","01","02"]
["00-13-02-01",3,null,16,0,13,2,1,"00","13","02","01"]
["00-13-03-00",3,null,16,0,13,3,0,"00","13","03","00"]
["00-14-00-02",3,null,16,0,14,0,2,"00","14","00","02"]
["00-14-01-01",2,null,16,0,14,1,1,"00","14","01","01"]
["00-14-02-00",2,null,16,0,14,2,0,"00","14","02","00"]
["00-15-00-01",2,null,16,0,15,0,1,"00","15","00","01"]
["00-15-01-00",2,null,16,0,15,1,0,"00","15","01","00"]
["00-16-00-00",2,null,16,0,16,0,0,"00","16","00","00"]
["01-00-00-15",5,null,16,1,0,0,15,"01","00","00","15"]
["01-00-01-14",5,null,16,1,0,1,14,"01","00","01","14"]
["01-00-02-13",5,null,16,1,0,2,13,"01","00","02","13"]
["01-00-03-12",5,null,16,1,0,3,12,"01","00","03","12"]
["01-00-04-11",5,null,16,1,0,4,11,"01","00","04","11"]
["01-00-05-10",5,null,16,1,0,5,10,"01","00","05","10"]
["01-00-06-09",5,null,16,1,0,6,9,"01","00","06","09"]
["01-00-07-08",5,null,16,1,0,7,8,"01","00","07","08"]
[{"$f":"I4039&\"-\"&J4039&\"-\"&K4039&\"-\"&L4039","v":"01-00-08-07"},5,null,16,1,0,8,7,"01","00","08","07"]
["01-00-09-06",5,null,16,1,0,9,6,{"$f":"IF(LEN(E4040)=1,0&E4040,IF(LEN(E4040)=0,\"00\",RIGHT(E4040,2)))","v":"01"},{"$f":"IF(LEN(F4040)=1,0&F4040,IF(LEN(F4040)=0,\"00\",RIGHT(F4040,2)))","v":"00"},{"$f":"IF(LEN(G4040)=1,0&G4040,IF(LEN(G4040)=0,\"00\",RIGHT(G4040,2)))","v":"09"},{"$f":"IF(LEN(H4040)=1,0&H4040,IF(LEN(H4040)=0,\"00\",RIGHT(H4040,2)))","v":"06"}]
["01-00-10-05",5,null,16,1,0,10,5,"01","00","10","05"]
["01-00-11-04",5,null,16,1,0,11,4,"01","00","11","04"]
["01-00-12-03",4,null,16,1,0,12,3,"01","00","12","03"]
["01-00-13-02",4,null,16,1,0,13,2,"01","00","13","02"]
["01-00-14-01",4,null,16,1,0,14,1,"01","00","14","01"]
["01-00-15-00",4,null,16,1,0,15,0,"01","00","15","00"]
["01-01-00-14",5,null,16,1,1,0,14,"01","01","00","14"]
["01-01-01-13",5,null,16,1,1,1,13,"01","01","01","13"]
["01-01-02-12",5,null,16,1,1,2,12,"01","01","02","12"]
["01-01-03-11",5,null,16,1,1,3,11,"01","01","03","11"]
["01-01-04-10",5,null,16,1,1,4,10,"01","01","04","10"]
["01-01-05-09",5,null,16,1,1,5,9,"01","01","05","09"]
["01-01-06-08",5,null,16,1,1,6,8,"01","01","06","08"]
["01-01-07-07",5,null,16,1,1,7,7,"01","01","07","07"]
["01-01-08-06",5,null,16,1,1,8,6,"01","01","08","06"]
["01-01-09-05",5,null,16,1,1,9,5,"01","01","09","05"]
["01-01-10-04",5,null,16,1,1,10,4,"01","01","10","04"]
["01-01-11-03",4,null,16,1,1,11,3,"01","01","11","03"]
["01-01-12-02",4,null,16,1,1,12,2,"01","01","12","02"]
["01-01-13-01",4,null,16,1,1,13,1,"01","01","13","01"]
["01-01-14-00",4,null,16,1,1,14,0,"01","01","14","00"]
["01-02-00-13",5,null,16,1,2,0,13,"01","02","00","13"]
["01-02-01-12",5,null,16,1,2,1,12,"01","02","01","12"]
["01-02-02-11",5,null,16,1,2,2,11,"01","02","02","11"]
["01-02-03-10",5,null,16,1,2,3,10,"01","02","03","10"]
["01-02-04-09",5,null,16,1,2,4,9,"01","02","04","09"]
["01-02-05-08",5,null,16,1,2,5,8,"01","02","05","08"]
["01-02-06-07",5,null,16,1,2,6,7,"01","02","06","07"]
["01-02-07-06",5,null,16,1,2,7,6,"01","02","07","06"]
["01-02-08-05",5,null,16,1,2,8,5,"01","02","08","05"]
["01-02-09-04",5,null,16,1,2,9,4,"01","02","09","04"]
["01-02-10-03",4,null,16,1,2,10,3,"01","02","10","03"]
["01-02-11-02",4,null,16,1,2,11,2,"01","02","11","02"]
["01-02-12-01",4,null,16,1,2,12,1,"01","02","12","01"]
["01-02-13-00",4,null,16,1,2,13,0,"01","02","13","00"]
["01-03-00-12",5,null,16,1,3,0,12,"01","03","00","12"]
["01-03-01-11",5,null,16,1,3,1,11,"01","03","01","11"]
["01-03-02-10",5,null,16,1,3,2,10,"01","03","02","10"]
["01-03-03-09",5,null,16,1,3,3,9,"01","03","03","09"]
["01-03-04-08",5,null,16,1,3,4,8,"01","03","04","08"]
["01-03-05-07",5,null,16,1,3,5,7,"01","03","05","07"]
["01-03-06-06",5,null,16,1,3,6,6,"01","03","06","06"]
["01-03-07-05",5,null,16,1,3,7,5,"01","03","07","05"]
["01-03-08-04",5,null,16,1,3,8,4,"01","03","08","04"]
["01-03-09-03",4,null,16,1,3,9,3,"01","03","09","03"]
["01-03-10-02",4,null,16,1,3,10,2,"01","03","10","02"]
["01-03-11-01",4,null,16,1,3,11,1,"01","03","11","01"]
["01-03-12-00",4,null,16,1,3,12,0,"01","03","12","00"]
["01-04-00-11",5,null,16,1,4,0,11,"01","04","00","11"]
["01-04-01-10",5,null,16,1,4,1,10,"01","04","01","10"]
["01-04-02-09",5,null,16,1,4,2,9,"01","04","02","09"]
["01-04-03-08",5,null,16,1,4,3,8,"01","04","03","08"]
["01-04-04-07",5,null,16,1,4,4,7,"01","04","04","07"]
["01-04-05-06",5,null,16,1,4,5,6,"01","04","05","06"]
["01-04-06-05",4,null,16,1,4,6,5,"01","04","06","05"]
["01-04-07-04",4,null,16,1,4,7,4,"01","04","07","04"]
["01-04-08-03",4,null,16,1,4,8,3,"01","04","08","03"]
["01-04-09-02",4,null,16,1,4,9,2,"01","04","09","02"]
["01-04-10-01",4,null,16,1,4,10,1,"01","04","10","01"]
["01-04-11-00",4,null,16,1,4,11,0,"01","04","11","00"]
["01-05-00-10",5,null,16,1,5,0,10,"01","05","00","10"]
["01-05-01-09",5,null,16,1,5,1,9,"01","05","01","09"]
[{"$f":"I4103&\"-\"&J4103&\"-\"&K4103&\"-\"&L4103","v":"01-05-02-08"},5,null,16,1,5,2,8,"01","05","02","08"]
["01-05-03-07",5,null,16,1,5,3,7,{"$f":"IF(LEN(E4104)=1,0&E4104,IF(LEN(E4104)=0,\"00\",RIGHT(E4104,2)))","v":"01"},{"$f":"IF(LEN(F4104)=1,0&F4104,IF(LEN(F4104)=0,\"00\",RIGHT(F4104,2)))","v":"05"},{"$f":"IF(LEN(G4104)=1,0&G4104,IF(LEN(G4104)=0,\"00\",RIGHT(G4104,2)))","v":"03"},{"$f":"IF(LEN(H4104)=1,0&H4104,IF(LEN(H4104)=0,\"00\",RIGHT(H4104,2)))","v":"07"}]
["01-05-04-06",4,null,16,1,5,4,6,"01","05","04","06"]
["01-05-05-05",4,null,16,1,5,5,5,"01","05","05","05"]
["01-05-06-04",4,null,16,1,5,6,4,"01","05","06","04"]
["01-05-07-03",4,null,16,1,5,7,3,"01","05","07","03"]
["01-05-08-02",4,null,16,1,5,8,2,"01","05","08","02"]
["01-05-09-01",4,null,16,1,5,9,1,"01","05","09","01"]
["01-05-10-00",4,null,16,1,5,10,0,"01","05","10","00"]
["01-06-00-09",5,null,16,1,6,0,9,"01","06","00","09"]
["01-06-01-08",4,null,16,1,6,1,8,"01","06","01","08"]
["01-06-02-07",4,null,16,1,6,2,7,"01","06","02","07"]
["01-06-03-06",4,null,16,1,6,3,6,"01","06","03","06"]
["01-06-04-05",4,null,16,1,6,4,5,"01","06","04","05"]
["01-06-05-04",4,null,16,1,6,5,4,"01","06","05","04"]
["01-06-06-03",4,null,16,1,6,6,3,"01","06","06","03"]
["01-06-07-02",4,null,16,1,6,7,2,"01","06","07","02"]
["01-06-08-01",4,null,16,1,6,8,1,"01","06","08","01"]
["01-06-09-00",4,null,16,1,6,9,0,"01","06","09","00"]
["01-07-00-08",4,null,16,1,7,0,8,"01","07","00","08"]
["01-07-01-07",4,null,16,1,7,1,7,"01","07","01","07"]
["01-07-02-06",4,null,16,1,7,2,6,"01","07","02","06"]
["01-07-03-05",4,null,16,1,7,3,5,"01","07","03","05"]
["01-07-04-04",4,null,16,1,7,4,4,"01","07","04","04"]
["01-07-05-03",4,null,16,1,7,5,3,"01","07","05","03"]
["01-07-06-02",4,null,16,1,7,6,2,"01","07","06","02"]
["01-07-07-01",4,null,16,1,7,7,1,"01","07","07","01"]
["01-07-08-00",4,null,16,1,7,8,0,"01","07","08","00"]
["01-08-00-07",3,null,16,1,8,0,7,"01","08","00","07"]
["01-08-01-06",3,null,16,1,8,1,6,"01","08","01","06"]
["01-08-02-05",3,null,16,1,8,2,5,"01","08","02","05"]
["01-08-03-04",3,null,16,1,8,3,4,"01","08","03","04"]
["01-08-04-03",3,null,16,1,8,4,3,"01","08","04","03"]
["01-08-05-02",3,null,16,1,8,5,2,"01","08","05","02"]
["01-08-06-01",3,null,16,1,8,6,1,"01","08","06","01"]
["01-08-07-00",3,null,16,1,8,7,0,"01","08","07","00"]
["01-09-00-06",3,null,16,1,9,0,6,"01","09","00","06"]
["01-09-01-05",3,null,16,1,9,1,5,"01","09","01","05"]
["01-09-02-04",3,null,16,1,9,2,4,"01","09","02","04"]
["01-09-03-03",3,null,16,1,9,3,3,"01","09","03","03"]
["01-09-04-02",3,null,16,1,9,4,2,"01","09","04","02"]
["01-09-05-01",3,null,16,1,9,5,1,"01","09","05","01"]
["01-09-06-00",3,null,16,1,9,6,0,"01","09","06","00"]
["01-10-00-05",3,null,16,1,10,0,5,"01","10","00","05"]
["01-10-01-04",3,null,16,1,10,1,4,"01","10","01","04"]
["01-10-02-03",3,null,16,1,10,2,3,"01","10","02","03"]
["01-10-03-02",3,null,16,1,10,3,2,"01","10","03","02"]
["01-10-04-01",3,null,16,1,10,4,1,"01","10","04","01"]
["01-10-05-00",3,null,16,1,10,5,0,"01","10","05","00"]
["01-11-00-04",3,null,16,1,11,0,4,"01","11","00","04"]
["01-11-01-03",3,null,16,1,11,1,3,"01","11","01","03"]
["01-11-02-02",3,null,16,1,11,2,2,"01","11","02","02"]
["01-11-03-01",3,null,16,1,11,3,1,"01","11","03","01"]
["01-11-04-00",3,null,16,1,11,4,0,"01","11","04","00"]
["01-12-00-03",3,null,16,1,12,0,3,"01","12","00","03"]
["01-12-01-02",3,null,16,1,12,1,2,"01","12","01","02"]
["01-12-02-01",2,null,16,1,12,2,1,"01","12","02","01"]
["01-12-03-00",2,null,16,1,12,3,0,"01","12","03","00"]
["01-13-00-02",2,null,16,1,13,0,2,"01","13","00","02"]
["01-13-01-01",2,null,16,1,13,1,1,"01","13","01","01"]
["01-13-02-00",2,null,16,1,13,2,0,"01","13","02","00"]
["01-14-00-01",2,null,16,1,14,0,1,"01","14","00","01"]
["01-14-01-00",2,null,16,1,14,1,0,"01","14","01","00"]
["01-15-00-00",2,null,16,1,15,0,0,"01","15","00","00"]
[{"$f":"I4167&\"-\"&J4167&\"-\"&K4167&\"-\"&L4167","v":"02-00-00-14"},5,null,16,2,0,0,14,"02","00","00","14"]
["02-00-01-13",5,null,16,2,0,1,13,{"$f":"IF(LEN(E4168)=1,0&E4168,IF(LEN(E4168)=0,\"00\",RIGHT(E4168,2)))","v":"02"},{"$f":"IF(LEN(F4168)=1,0&F4168,IF(LEN(F4168)=0,\"00\",RIGHT(F4168,2)))","v":"00"},{"$f":"IF(LEN(G4168)=1,0&G4168,IF(LEN(G4168)=0,\"00\",RIGHT(G4168,2)))","v":"01"},{"$f":"IF(LEN(H4168)=1,0&H4168,IF(LEN(H4168)=0,\"00\",RIGHT(H4168,2)))","v":"13"}]
["02-00-02-12",5,null,16,2,0,2,12,"02","00","02","12"]
["02-00-03-11",5,null,16,2,0,3,11,"02","00","03","11"]
["02-00-04-10",5,null,16,2,0,4,10,"02","00","04","10"]
["02-00-05-09",5,null,16,2,0,5,9,"02","00","05","09"]
["02-00-06-08",5,null,16,2,0,6,8,"02","00","06","08"]
["02-00-07-07",5,null,16,2,0,7,7,"02","00","07","07"]
["02-00-08-06",5,null,16,2,0,8,6,"02","00","08","06"]
["02-00-09-05",5,null,16,2,0,9,5,"02","00","09","05"]
["02-00-10-04",5,null,16,2,0,10,4,"02","00","10","04"]
["02-00-11-03",4,null,16,2,0,11,3,"02","00","11","03"]
["02-00-12-02",4,null,16,2,0,12,2,"02","00","12","02"]
["02-00-13-01",4,null,16,2,0,13,1,"02","00","13","01"]
["02-00-14-00",4,null,16,2,0,14,0,"02","00","14","00"]
["02-01-00-13",5,null,16,2,1,0,13,"02","01","00","13"]
["02-01-01-12",5,null,16,2,1,1,12,"02","01","01","12"]
["02-01-02-11",5,null,16,2,1,2,11,"02","01","02","11"]
["02-01-03-10",5,null,16,2,1,3,10,"02","01","03","10"]
["02-01-04-09",5,null,16,2,1,4,9,"02","01","04","09"]
["02-01-05-08",5,null,16,2,1,5,8,"02","01","05","08"]
["02-01-06-07",5,null,16,2,1,6,7,"02","01","06","07"]
["02-01-07-06",5,null,16,2,1,7,6,"02","01","07","06"]
["02-01-08-05",5,null,16,2,1,8,5,"02","01","08","05"]
["02-01-09-04",5,null,16,2,1,9,4,"02","01","09","04"]
["02-01-10-03",4,null,16,2,1,10,3,"02","01","10","03"]
["02-01-11-02",4,null,16,2,1,11,2,"02","01","11","02"]
["02-01-12-01",4,null,16,2,1,12,1,"02","01","12","01"]
["02-01-13-00",4,null,16,2,1,13,0,"02","01","13","00"]
["02-02-00-12",5,null,16,2,2,0,12,"02","02","00","12"]
["02-02-01-11",5,null,16,2,2,1,11,"02","02","01","11"]
["02-02-02-10",5,null,16,2,2,2,10,"02","02","02","10"]
["02-02-03-09",5,null,16,2,2,3,9,"02","02","03","09"]
["02-02-04-08",5,null,16,2,2,4,8,"02","02","04","08"]
["02-02-05-07",5,null,16,2,2,5,7,"02","02","05","07"]
["02-02-06-06",5,null,16,2,2,6,6,"02","02","06","06"]
["02-02-07-05",4,null,16,2,2,7,5,"02","02","07","05"]
["02-02-08-04",4,null,16,2,2,8,4,"02","02","08","04"]
["02-02-09-03",4,null,16,2,2,9,3,"02","02","09","03"]
["02-02-10-02",4,null,16,2,2,10,2,"02","02","10","02"]
["02-02-11-01",4,null,16,2,2,11,1,"02","02","11","01"]
["02-02-12-00",4,null,16,2,2,12,0,"02","02","12","00"]
["02-03-00-11",5,null,16,2,3,0,11,"02","03","00","11"]
["02-03-01-10",5,null,16,2,3,1,10,"02","03","01","10"]
["02-03-02-09",5,null,16,2,3,2,9,"02","03","02","09"]
["02-03-03-08",5,null,16,2,3,3,8,"02","03","03","08"]
["02-03-04-07",5,null,16,2,3,4,7,"02","03","04","07"]
["02-03-05-06",4,null,16,2,3,5,6,"02","03","05","06"]
["02-03-06-05",4,null,16,2,3,6,5,"02","03","06","05"]
["02-03-07-04",4,null,16,2,3,7,4,"02","03","07","04"]
["02-03-08-03",4,null,16,2,3,8,3,"02","03","08","03"]
["02-03-09-02",4,null,16,2,3,9,2,"02","03","09","02"]
["02-03-10-01",4,null,16,2,3,10,1,"02","03","10","01"]
["02-03-11-00",4,null,16,2,3,11,0,"02","03","11","00"]
["02-04-00-10",5,null,16,2,4,0,10,"02","04","00","10"]
["02-04-01-09",5,null,16,2,4,1,9,"02","04","01","09"]
["02-04-02-08",4,null,16,2,4,2,8,"02","04","02","08"]
["02-04-03-07",4,null,16,2,4,3,7,"02","04","03","07"]
["02-04-04-06",4,null,16,2,4,4,6,"02","04","04","06"]
["02-04-05-05",4,null,16,2,4,5,5,"02","04","05","05"]
["02-04-06-04",4,null,16,2,4,6,4,"02","04","06","04"]
["02-04-07-03",4,null,16,2,4,7,3,"02","04","07","03"]
["02-04-08-02",4,null,16,2,4,8,2,"02","04","08","02"]
["02-04-09-01",4,null,16,2,4,9,1,"02","04","09","01"]
[{"$f":"I4231&\"-\"&J4231&\"-\"&K4231&\"-\"&L4231","v":"02-04-10-00"},4,null,16,2,4,10,0,"02","04","10","00"]
["02-05-00-09",4,null,16,2,5,0,9,{"$f":"IF(LEN(E4232)=1,0&E4232,IF(LEN(E4232)=0,\"00\",RIGHT(E4232,2)))","v":"02"},{"$f":"IF(LEN(F4232)=1,0&F4232,IF(LEN(F4232)=0,\"00\",RIGHT(F4232,2)))","v":"05"},{"$f":"IF(LEN(G4232)=1,0&G4232,IF(LEN(G4232)=0,\"00\",RIGHT(G4232,2)))","v":"00"},{"$f":"IF(LEN(H4232)=1,0&H4232,IF(LEN(H4232)=0,\"00\",RIGHT(H4232,2)))","v":"09"}]
["02-05-01-08",4,null,16,2,5,1,8,"02","05","01","08"]
["02-05-02-07",4,null,16,2,5,2,7,"02","05","02","07"]
["02-05-03-06",4,null,16,2,5,3,6,"02","05","03","06"]
["02-05-04-05",4,null,16,2,5,4,5,"02","05","04","05"]
["02-05-05-04",4,null,16,2,5,5,4,"02","05","05","04"]
["02-05-06-03",4,null,16,2,5,6,3,"02","05","06","03"]
["02-05-07-02",4,null,16,2,5,7,2,"02","05","07","02"]
["02-05-08-01",4,null,16,2,5,8,1,"02","05","08","01"]
["02-05-09-00",4,null,16,2,5,9,0,"02","05","09","00"]
["02-06-00-08",4,null,16,2,6,0,8,"02","06","00","08"]
["02-06-01-07",4,null,16,2,6,1,7,"02","06","01","07"]
["02-06-02-06",4,null,16,2,6,2,6,"02","06","02","06"]
["02-06-03-05",4,null,16,2,6,3,5,"02","06","03","05"]
["02-06-04-04",4,null,16,2,6,4,4,"02","06","04","04"]
["02-06-05-03",4,null,16,2,6,5,3,"02","06","05","03"]
["02-06-06-02",4,null,16,2,6,6,2,"02","06","06","02"]
["02-06-07-01",4,null,16,2,6,7,1,"02","06","07","01"]
["02-06-08-00",4,null,16,2,6,8,0,"02","06","08","00"]
["02-07-00-07",3,null,16,2,7,0,7,"02","07","00","07"]
["02-07-01-06",3,null,16,2,7,1,6,"02","07","01","06"]
["02-07-02-05",3,null,16,2,7,2,5,"02","07","02","05"]
["02-07-03-04",3,null,16,2,7,3,4,"02","07","03","04"]
["02-07-04-03",3,null,16,2,7,4,3,"02","07","04","03"]
["02-07-05-02",3,null,16,2,7,5,2,"02","07","05","02"]
["02-07-06-01",3,null,16,2,7,6,1,"02","07","06","01"]
["02-07-07-00",3,null,16,2,7,7,0,"02","07","07","00"]
["02-08-00-06",3,null,16,2,8,0,6,"02","08","00","06"]
["02-08-01-05",3,null,16,2,8,1,5,"02","08","01","05"]
["02-08-02-04",3,null,16,2,8,2,4,"02","08","02","04"]
["02-08-03-03",3,null,16,2,8,3,3,"02","08","03","03"]
["02-08-04-02",3,null,16,2,8,4,2,"02","08","04","02"]
["02-08-05-01",3,null,16,2,8,5,1,"02","08","05","01"]
["02-08-06-00",3,null,16,2,8,6,0,"02","08","06","00"]
["02-09-00-05",3,null,16,2,9,0,5,"02","09","00","05"]
["02-09-01-04",3,null,16,2,9,1,4,"02","09","01","04"]
["02-09-02-03",3,null,16,2,9,2,3,"02","09","02","03"]
["02-09-03-02",3,null,16,2,9,3,2,"02","09","03","02"]
["02-09-04-01",3,null,16,2,9,4,1,"02","09","04","01"]
["02-09-05-00",3,null,16,2,9,5,0,"02","09","05","00"]
["02-10-00-04",3,null,16,2,10,0,4,"02","10","00","04"]
["02-10-01-03",3,null,16,2,10,1,3,"02","10","01","03"]
["02-10-02-02",3,null,16,2,10,2,2,"02","10","02","02"]
["02-10-03-01",2,null,16,2,10,3,1,"02","10","03","01"]
["02-10-04-00",2,null,16,2,10,4,0,"02","10","04","00"]
["02-11-00-03",3,null,16,2,11,0,3,"02","11","00","03"]
["02-11-01-02",2,null,16,2,11,1,2,"02","11","01","02"]
["02-11-02-01",2,null,16,2,11,2,1,"02","11","02","01"]
["02-11-03-00",2,null,16,2,11,3,0,"02","11","03","00"]
["02-12-00-02",2,null,16,2,12,0,2,"02","12","00","02"]
["02-12-01-01",2,null,16,2,12,1,1,"02","12","01","01"]
["02-12-02-00",2,null,16,2,12,2,0,"02","12","02","00"]
["02-13-00-01",2,null,16,2,13,0,1,"02","13","00","01"]
["02-13-01-00",2,null,16,2,13,1,0,"02","13","01","00"]
["02-14-00-00",2,null,16,2,14,0,0,"02","14","00","00"]
["03-00-00-13",5,null,16,3,0,0,13,"03","00","00","13"]
["03-00-01-12",5,null,16,3,0,1,12,"03","00","01","12"]
["03-00-02-11",5,null,16,3,0,2,11,"03","00","02","11"]
["03-00-03-10",5,null,16,3,0,3,10,"03","00","03","10"]
["03-00-04-09",5,null,16,3,0,4,9,"03","00","04","09"]
["03-00-05-08",5,null,16,3,0,5,8,"03","00","05","08"]
["03-00-06-07",5,null,16,3,0,6,7,"03","00","06","07"]
["03-00-07-06",5,null,16,3,0,7,6,"03","00","07","06"]
[{"$f":"I4295&\"-\"&J4295&\"-\"&K4295&\"-\"&L4295","v":"03-00-08-05"},4,null,16,3,0,8,5,"03","00","08","05"]
["03-00-09-04",4,null,16,3,0,9,4,{"$f":"IF(LEN(E4296)=1,0&E4296,IF(LEN(E4296)=0,\"00\",RIGHT(E4296,2)))","v":"03"},{"$f":"IF(LEN(F4296)=1,0&F4296,IF(LEN(F4296)=0,\"00\",RIGHT(F4296,2)))","v":"00"},{"$f":"IF(LEN(G4296)=1,0&G4296,IF(LEN(G4296)=0,\"00\",RIGHT(G4296,2)))","v":"09"},{"$f":"IF(LEN(H4296)=1,0&H4296,IF(LEN(H4296)=0,\"00\",RIGHT(H4296,2)))","v":"04"}]
["03-00-10-03",4,null,16,3,0,10,3,"03","00","10","03"]
["03-00-11-02",4,null,16,3,0,11,2,"03","00","11","02"]
["03-00-12-01",4,null,16,3,0,12,1,"03","00","12","01"]
["03-00-13-00",4,null,16,3,0,13,0,"03","00","13","00"]
["03-01-00-12",5,null,16,3,1,0,12,"03","01","00","12"]
["03-01-01-11",5,null,16,3,1,1,11,"03","01","01","11"]
["03-01-02-10",5,null,16,3,1,2,10,"03","01","02","10"]
["03-01-03-09",5,null,16,3,1,3,9,"03","01","03","09"]
["03-01-04-08",5,null,16,3,1,4,8,"03","01","04","08"]
["03-01-05-07",5,null,16,3,1,5,7,"03","01","05","07"]
["03-01-06-06",4,null,16,3,1,6,6,"03","01","06","06"]
["03-01-07-05",4,null,16,3,1,7,5,"03","01","07","05"]
["03-01-08-04",4,null,16,3,1,8,4,"03","01","08","04"]
["03-01-09-03",4,null,16,3,1,9,3,"03","01","09","03"]
["03-01-10-02",4,null,16,3,1,10,2,"03","01","10","02"]
["03-01-11-01",4,null,16,3,1,11,1,"03","01","11","01"]
["03-01-12-00",4,null,16,3,1,12,0,"03","01","12","00"]
["03-02-00-11",5,null,16,3,2,0,11,"03","02","00","11"]
["03-02-01-10",5,null,16,3,2,1,10,"03","02","01","10"]
["03-02-02-09",5,null,16,3,2,2,9,"03","02","02","09"]
["03-02-03-08",4,null,16,3,2,3,8,"03","02","03","08"]
["03-02-04-07",4,null,16,3,2,4,7,"03","02","04","07"]
["03-02-05-06",4,null,16,3,2,5,6,"03","02","05","06"]
["03-02-06-05",4,null,16,3,2,6,5,"03","02","06","05"]
["03-02-07-04",4,null,16,3,2,7,4,"03","02","07","04"]
["03-02-08-03",4,null,16,3,2,8,3,"03","02","08","03"]
["03-02-09-02",4,null,16,3,2,9,2,"03","02","09","02"]
["03-02-10-01",4,null,16,3,2,10,1,"03","02","10","01"]
["03-02-11-00",4,null,16,3,2,11,0,"03","02","11","00"]
["03-03-00-10",5,null,16,3,3,0,10,"03","03","00","10"]
["03-03-01-09",4,null,16,3,3,1,9,"03","03","01","09"]
["03-03-02-08",4,null,16,3,3,2,8,"03","03","02","08"]
["03-03-03-07",4,null,16,3,3,3,7,"03","03","03","07"]
["03-03-04-06",4,null,16,3,3,4,6,"03","03","04","06"]
["03-03-05-05",4,null,16,3,3,5,5,"03","03","05","05"]
["03-03-06-04",4,null,16,3,3,6,4,"03","03","06","04"]
["03-03-07-03",4,null,16,3,3,7,3,"03","03","07","03"]
["03-03-08-02",4,null,16,3,3,8,2,"03","03","08","02"]
["03-03-09-01",4,null,16,3,3,9,1,"03","03","09","01"]
["03-03-10-00",4,null,16,3,3,10,0,"03","03","10","00"]
["03-04-00-09",4,null,16,3,4,0,9,"03","04","00","09"]
["03-04-01-08",4,null,16,3,4,1,8,"03","04","01","08"]
["03-04-02-07",4,null,16,3,4,2,7,"03","04","02","07"]
["03-04-03-06",4,null,16,3,4,3,6,"03","04","03","06"]
["03-04-04-05",4,null,16,3,4,4,5,"03","04","04","05"]
["03-04-05-04",4,null,16,3,4,5,4,"03","04","05","04"]
["03-04-06-03",4,null,16,3,4,6,3,"03","04","06","03"]
["03-04-07-02",4,null,16,3,4,7,2,"03","04","07","02"]
["03-04-08-01",4,null,16,3,4,8,1,"03","04","08","01"]
["03-04-09-00",4,null,16,3,4,9,0,"03","04","09","00"]
["03-05-00-08",4,null,16,3,5,0,8,"03","05","00","08"]
["03-05-01-07",4,null,16,3,5,1,7,"03","05","01","07"]
["03-05-02-06",4,null,16,3,5,2,6,"03","05","02","06"]
["03-05-03-05",4,null,16,3,5,3,5,"03","05","03","05"]
["03-05-04-04",4,null,16,3,5,4,4,"03","05","04","04"]
["03-05-05-03",4,null,16,3,5,5,3,"03","05","05","03"]
["03-05-06-02",4,null,16,3,5,6,2,"03","05","06","02"]
["03-05-07-01",4,null,16,3,5,7,1,"03","05","07","01"]
["03-05-08-00",4,null,16,3,5,8,0,"03","05","08","00"]
["03-06-00-07",3,null,16,3,6,0,7,"03","06","00","07"]
["03-06-01-06",3,null,16,3,6,1,6,"03","06","01","06"]
["03-06-02-05",3,null,16,3,6,2,5,"03","06","02","05"]
[{"$f":"I4359&\"-\"&J4359&\"-\"&K4359&\"-\"&L4359","v":"03-06-03-04"},3,null,16,3,6,3,4,"03","06","03","04"]
["03-06-04-03",3,null,16,3,6,4,3,{"$f":"IF(LEN(E4360)=1,0&E4360,IF(LEN(E4360)=0,\"00\",RIGHT(E4360,2)))","v":"03"},{"$f":"IF(LEN(F4360)=1,0&F4360,IF(LEN(F4360)=0,\"00\",RIGHT(F4360,2)))","v":"06"},{"$f":"IF(LEN(G4360)=1,0&G4360,IF(LEN(G4360)=0,\"00\",RIGHT(G4360,2)))","v":"04"},{"$f":"IF(LEN(H4360)=1,0&H4360,IF(LEN(H4360)=0,\"00\",RIGHT(H4360,2)))","v":"03"}]
["03-06-05-02",3,null,16,3,6,5,2,"03","06","05","02"]
["03-06-06-01",3,null,16,3,6,6,1,"03","06","06","01"]
["03-06-07-00",3,null,16,3,6,7,0,"03","06","07","00"]
["03-07-00-06",3,null,16,3,7,0,6,"03","07","00","06"]
["03-07-01-05",3,null,16,3,7,1,5,"03","07","01","05"]
["03-07-02-04",3,null,16,3,7,2,4,"03","07","02","04"]
["03-07-03-03",3,null,16,3,7,3,3,"03","07","03","03"]
["03-07-04-02",3,null,16,3,7,4,2,"03","07","04","02"]
["03-07-05-01",3,null,16,3,7,5,1,"03","07","05","01"]
["03-07-06-00",3,null,16,3,7,6,0,"03","07","06","00"]
["03-08-00-05",3,null,16,3,8,0,5,"03","08","00","05"]
["03-08-01-04",3,null,16,3,8,1,4,"03","08","01","04"]
["03-08-02-03",3,null,16,3,8,2,3,"03","08","02","03"]
["03-08-03-02",3,null,16,3,8,3,2,"03","08","03","02"]
["03-08-04-01",3,null,16,3,8,4,1,"03","08","04","01"]
["03-08-05-00",3,null,16,3,8,5,0,"03","08","05","00"]
["03-09-00-04",3,null,16,3,9,0,4,"03","09","00","04"]
["03-09-01-03",3,null,16,3,9,1,3,"03","09","01","03"]
["03-09-02-02",2,null,16,3,9,2,2,"03","09","02","02"]
["03-09-03-01",2,null,16,3,9,3,1,"03","09","03","01"]
["03-09-04-00",2,null,16,3,9,4,0,"03","09","04","00"]
["03-10-00-03",2,null,16,3,10,0,3,"03","10","00","03"]
["03-10-01-02",2,null,16,3,10,1,2,"03","10","01","02"]
["03-10-02-01",2,null,16,3,10,2,1,"03","10","02","01"]
["03-10-03-00",2,null,16,3,10,3,0,"03","10","03","00"]
["03-11-00-02",2,null,16,3,11,0,2,"03","11","00","02"]
["03-11-01-01",2,null,16,3,11,1,1,"03","11","01","01"]
["03-11-02-00",2,null,16,3,11,2,0,"03","11","02","00"]
["03-12-00-01",2,null,16,3,12,0,1,"03","12","00","01"]
["03-12-01-00",2,null,16,3,12,1,0,"03","12","01","00"]
["03-13-00-00",2,null,16,3,13,0,0,"03","13","00","00"]
["04-00-00-12",5,null,16,4,0,0,12,"04","00","00","12"]
["04-00-01-11",5,null,16,4,0,1,11,"04","00","01","11"]
["04-00-02-10",5,null,16,4,0,2,10,"04","00","02","10"]
["04-00-03-09",5,null,16,4,0,3,9,"04","00","03","09"]
["04-00-04-08",4,null,16,4,0,4,8,"04","00","04","08"]
["04-00-05-07",4,null,16,4,0,5,7,"04","00","05","07"]
["04-00-06-06",4,null,16,4,0,6,6,"04","00","06","06"]
["04-00-07-05",4,null,16,4,0,7,5,"04","00","07","05"]
["04-00-08-04",4,null,16,4,0,8,4,"04","00","08","04"]
["04-00-09-03",4,null,16,4,0,9,3,"04","00","09","03"]
["04-00-10-02",4,null,16,4,0,10,2,"04","00","10","02"]
["04-00-11-01",4,null,16,4,0,11,1,"04","00","11","01"]
["04-00-12-00",4,null,16,4,0,12,0,"04","00","12","00"]
["04-01-00-11",5,null,16,4,1,0,11,"04","01","00","11"]
["04-01-01-10",5,null,16,4,1,1,10,"04","01","01","10"]
["04-01-02-09",4,null,16,4,1,2,9,"04","01","02","09"]
["04-01-03-08",4,null,16,4,1,3,8,"04","01","03","08"]
["04-01-04-07",4,null,16,4,1,4,7,"04","01","04","07"]
["04-01-05-06",4,null,16,4,1,5,6,"04","01","05","06"]
["04-01-06-05",4,null,16,4,1,6,5,"04","01","06","05"]
["04-01-07-04",4,null,16,4,1,7,4,"04","01","07","04"]
["04-01-08-03",4,null,16,4,1,8,3,"04","01","08","03"]
["04-01-09-02",4,null,16,4,1,9,2,"04","01","09","02"]
["04-01-10-01",4,null,16,4,1,10,1,"04","01","10","01"]
["04-01-11-00",4,null,16,4,1,11,0,"04","01","11","00"]
["04-02-00-10",4,null,16,4,2,0,10,"04","02","00","10"]
["04-02-01-09",4,null,16,4,2,1,9,"04","02","01","09"]
["04-02-02-08",4,null,16,4,2,2,8,"04","02","02","08"]
["04-02-03-07",4,null,16,4,2,3,7,"04","02","03","07"]
["04-02-04-06",4,null,16,4,2,4,6,"04","02","04","06"]
["04-02-05-05",4,null,16,4,2,5,5,"04","02","05","05"]
[{"$f":"I4423&\"-\"&J4423&\"-\"&K4423&\"-\"&L4423","v":"04-02-06-04"},4,null,16,4,2,6,4,"04","02","06","04"]
["04-02-07-03",4,null,16,4,2,7,3,{"$f":"IF(LEN(E4424)=1,0&E4424,IF(LEN(E4424)=0,\"00\",RIGHT(E4424,2)))","v":"04"},{"$f":"IF(LEN(F4424)=1,0&F4424,IF(LEN(F4424)=0,\"00\",RIGHT(F4424,2)))","v":"02"},{"$f":"IF(LEN(G4424)=1,0&G4424,IF(LEN(G4424)=0,\"00\",RIGHT(G4424,2)))","v":"07"},{"$f":"IF(LEN(H4424)=1,0&H4424,IF(LEN(H4424)=0,\"00\",RIGHT(H4424,2)))","v":"03"}]
["04-02-08-02",4,null,16,4,2,8,2,"04","02","08","02"]
["04-02-09-01",4,null,16,4,2,9,1,"04","02","09","01"]
["04-02-10-00",4,null,16,4,2,10,0,"04","02","10","00"]
["04-03-00-09",4,null,16,4,3,0,9,"04","03","00","09"]
["04-03-01-08",4,null,16,4,3,1,8,"04","03","01","08"]
["04-03-02-07",4,null,16,4,3,2,7,"04","03","02","07"]
["04-03-03-06",4,null,16,4,3,3,6,"04","03","03","06"]
["04-03-04-05",4,null,16,4,3,4,5,"04","03","04","05"]
["04-03-05-04",4,null,16,4,3,5,4,"04","03","05","04"]
["04-03-06-03",4,null,16,4,3,6,3,"04","03","06","03"]
["04-03-07-02",4,null,16,4,3,7,2,"04","03","07","02"]
["04-03-08-01",4,null,16,4,3,8,1,"04","03","08","01"]
["04-03-09-00",4,null,16,4,3,9,0,"04","03","09","00"]
["04-04-00-08",4,null,16,4,4,0,8,"04","04","00","08"]
["04-04-01-07",4,null,16,4,4,1,7,"04","04","01","07"]
["04-04-02-06",4,null,16,4,4,2,6,"04","04","02","06"]
["04-04-03-05",4,null,16,4,4,3,5,"04","04","03","05"]
["04-04-04-04",4,null,16,4,4,4,4,"04","04","04","04"]
["04-04-05-03",4,null,16,4,4,5,3,"04","04","05","03"]
["04-04-06-02",4,null,16,4,4,6,2,"04","04","06","02"]
["04-04-07-01",4,null,16,4,4,7,1,"04","04","07","01"]
["04-04-08-00",4,null,16,4,4,8,0,"04","04","08","00"]
["04-05-00-07",3,null,16,4,5,0,7,"04","05","00","07"]
["04-05-01-06",3,null,16,4,5,1,6,"04","05","01","06"]
["04-05-02-05",3,null,16,4,5,2,5,"04","05","02","05"]
["04-05-03-04",3,null,16,4,5,3,4,"04","05","03","04"]
["04-05-04-03",3,null,16,4,5,4,3,"04","05","04","03"]
["04-05-05-02",3,null,16,4,5,5,2,"04","05","05","02"]
["04-05-06-01",3,null,16,4,5,6,1,"04","05","06","01"]
["04-05-07-00",3,null,16,4,5,7,0,"04","05","07","00"]
["04-06-00-06",3,null,16,4,6,0,6,"04","06","00","06"]
["04-06-01-05",3,null,16,4,6,1,5,"04","06","01","05"]
["04-06-02-04",3,null,16,4,6,2,4,"04","06","02","04"]
["04-06-03-03",3,null,16,4,6,3,3,"04","06","03","03"]
["04-06-04-02",3,null,16,4,6,4,2,"04","06","04","02"]
["04-06-05-01",3,null,16,4,6,5,1,"04","06","05","01"]
["04-06-06-00",3,null,16,4,6,6,0,"04","06","06","00"]
["04-07-00-05",3,null,16,4,7,0,5,"04","07","00","05"]
["04-07-01-04",3,null,16,4,7,1,4,"04","07","01","04"]
["04-07-02-03",3,null,16,4,7,2,3,"04","07","02","03"]
["04-07-03-02",3,null,16,4,7,3,2,"04","07","03","02"]
["04-07-04-01",3,null,16,4,7,4,1,"04","07","04","01"]
["04-07-05-00",3,null,16,4,7,5,0,"04","07","05","00"]
["04-08-00-04",3,null,16,4,8,0,4,"04","08","00","04"]
["04-08-01-03",2,null,16,4,8,1,3,"04","08","01","03"]
["04-08-02-02",2,null,16,4,8,2,2,"04","08","02","02"]
["04-08-03-01",2,null,16,4,8,3,1,"04","08","03","01"]
["04-08-04-00",2,null,16,4,8,4,0,"04","08","04","00"]
["04-09-00-03",2,null,16,4,9,0,3,"04","09","00","03"]
["04-09-01-02",2,null,16,4,9,1,2,"04","09","01","02"]
["04-09-02-01",2,null,16,4,9,2,1,"04","09","02","01"]
["04-09-03-00",2,null,16,4,9,3,0,"04","09","03","00"]
["04-10-00-02",2,null,16,4,10,0,2,"04","10","00","02"]
["04-10-01-01",2,null,16,4,10,1,1,"04","10","01","01"]
["04-10-02-00",2,null,16,4,10,2,0,"04","10","02","00"]
["04-11-00-01",2,null,16,4,11,0,1,"04","11","00","01"]
["04-11-01-00",2,null,16,4,11,1,0,"04","11","01","00"]
["04-12-00-00",2,null,16,4,12,0,0,"04","12","00","00"]
["05-00-00-11",4,null,16,5,0,0,11,"05","00","00","11"]
["05-00-01-10",4,null,16,5,0,1,10,"05","00","01","10"]
["05-00-02-09",4,null,16,5,0,2,9,"05","00","02","09"]
["05-00-03-08",4,null,16,5,0,3,8,"05","00","03","08"]
[{"$f":"I4487&\"-\"&J4487&\"-\"&K4487&\"-\"&L4487","v":"05-00-04-07"},4,null,16,5,0,4,7,"05","00","04","07"]
["05-00-05-06",4,null,16,5,0,5,6,{"$f":"IF(LEN(E4488)=1,0&E4488,IF(LEN(E4488)=0,\"00\",RIGHT(E4488,2)))","v":"05"},{"$f":"IF(LEN(F4488)=1,0&F4488,IF(LEN(F4488)=0,\"00\",RIGHT(F4488,2)))","v":"00"},{"$f":"IF(LEN(G4488)=1,0&G4488,IF(LEN(G4488)=0,\"00\",RIGHT(G4488,2)))","v":"05"},{"$f":"IF(LEN(H4488)=1,0&H4488,IF(LEN(H4488)=0,\"00\",RIGHT(H4488,2)))","v":"06"}]
["05-00-06-05",4,null,16,5,0,6,5,"05","00","06","05"]
["05-00-07-04",4,null,16,5,0,7,4,"05","00","07","04"]
["05-00-08-03",4,null,16,5,0,8,3,"05","00","08","03"]
["05-00-09-02",4,null,16,5,0,9,2,"05","00","09","02"]
["05-00-10-01",4,null,16,5,0,10,1,"05","00","10","01"]
["05-00-11-00",4,null,16,5,0,11,0,"05","00","11","00"]
["05-01-00-10",4,null,16,5,1,0,10,"05","01","00","10"]
["05-01-01-09",4,null,16,5,1,1,9,"05","01","01","09"]
["05-01-02-08",4,null,16,5,1,2,8,"05","01","02","08"]
["05-01-03-07",4,null,16,5,1,3,7,"05","01","03","07"]
["05-01-04-06",4,null,16,5,1,4,6,"05","01","04","06"]
["05-01-05-05",4,null,16,5,1,5,5,"05","01","05","05"]
["05-01-06-04",4,null,16,5,1,6,4,"05","01","06","04"]
["05-01-07-03",4,null,16,5,1,7,3,"05","01","07","03"]
["05-01-08-02",4,null,16,5,1,8,2,"05","01","08","02"]
["05-01-09-01",4,null,16,5,1,9,1,"05","01","09","01"]
["05-01-10-00",4,null,16,5,1,10,0,"05","01","10","00"]
["05-02-00-09",4,null,16,5,2,0,9,"05","02","00","09"]
["05-02-01-08",4,null,16,5,2,1,8,"05","02","01","08"]
["05-02-02-07",4,null,16,5,2,2,7,"05","02","02","07"]
["05-02-03-06",4,null,16,5,2,3,6,"05","02","03","06"]
["05-02-04-05",4,null,16,5,2,4,5,"05","02","04","05"]
["05-02-05-04",4,null,16,5,2,5,4,"05","02","05","04"]
["05-02-06-03",4,null,16,5,2,6,3,"05","02","06","03"]
["05-02-07-02",4,null,16,5,2,7,2,"05","02","07","02"]
["05-02-08-01",4,null,16,5,2,8,1,"05","02","08","01"]
["05-02-09-00",4,null,16,5,2,9,0,"05","02","09","00"]
["05-03-00-08",4,null,16,5,3,0,8,"05","03","00","08"]
["05-03-01-07",4,null,16,5,3,1,7,"05","03","01","07"]
["05-03-02-06",4,null,16,5,3,2,6,"05","03","02","06"]
["05-03-03-05",4,null,16,5,3,3,5,"05","03","03","05"]
["05-03-04-04",4,null,16,5,3,4,4,"05","03","04","04"]
["05-03-05-03",4,null,16,5,3,5,3,"05","03","05","03"]
["05-03-06-02",4,null,16,5,3,6,2,"05","03","06","02"]
["05-03-07-01",4,null,16,5,3,7,1,"05","03","07","01"]
["05-03-08-00",4,null,16,5,3,8,0,"05","03","08","00"]
["05-04-00-07",3,null,16,5,4,0,7,"05","04","00","07"]
["05-04-01-06",3,null,16,5,4,1,6,"05","04","01","06"]
["05-04-02-05",3,null,16,5,4,2,5,"05","04","02","05"]
["05-04-03-04",3,null,16,5,4,3,4,"05","04","03","04"]
["05-04-04-03",3,null,16,5,4,4,3,"05","04","04","03"]
["05-04-05-02",3,null,16,5,4,5,2,"05","04","05","02"]
["05-04-06-01",3,null,16,5,4,6,1,"05","04","06","01"]
["05-04-07-00",3,null,16,5,4,7,0,"05","04","07","00"]
["05-05-00-06",3,null,16,5,5,0,6,"05","05","00","06"]
["05-05-01-05",3,null,16,5,5,1,5,"05","05","01","05"]
["05-05-02-04",3,null,16,5,5,2,4,"05","05","02","04"]
["05-05-03-03",3,null,16,5,5,3,3,"05","05","03","03"]
["05-05-04-02",3,null,16,5,5,4,2,"05","05","04","02"]
["05-05-05-01",3,null,16,5,5,5,1,"05","05","05","01"]
["05-05-06-00",3,null,16,5,5,6,0,"05","05","06","00"]
["05-06-00-05",3,null,16,5,6,0,5,"05","06","00","05"]
["05-06-01-04",3,null,16,5,6,1,4,"05","06","01","04"]
["05-06-02-03",3,null,16,5,6,2,3,"05","06","02","03"]
["05-06-03-02",3,null,16,5,6,3,2,"05","06","03","02"]
["05-06-04-01",3,null,16,5,6,4,1,"05","06","04","01"]
["05-06-05-00",3,null,16,5,6,5,0,"05","06","05","00"]
["05-07-00-04",3,null,16,5,7,0,4,"05","07","00","04"]
["05-07-01-03",2,null,16,5,7,1,3,"05","07","01","03"]
["05-07-02-02",2,null,16,5,7,2,2,"05","07","02","02"]
["05-07-03-01",2,null,16,5,7,3,1,"05","07","03","01"]
["05-07-04-00",2,null,16,5,7,4,0,"05","07","04","00"]
[{"$f":"I4551&\"-\"&J4551&\"-\"&K4551&\"-\"&L4551","v":"05-08-00-03"},2,null,16,5,8,0,3,"05","08","00","03"]
["05-08-01-02",2,null,16,5,8,1,2,{"$f":"IF(LEN(E4552)=1,0&E4552,IF(LEN(E4552)=0,\"00\",RIGHT(E4552,2)))","v":"05"},{"$f":"IF(LEN(F4552)=1,0&F4552,IF(LEN(F4552)=0,\"00\",RIGHT(F4552,2)))","v":"08"},{"$f":"IF(LEN(G4552)=1,0&G4552,IF(LEN(G4552)=0,\"00\",RIGHT(G4552,2)))","v":"01"},{"$f":"IF(LEN(H4552)=1,0&H4552,IF(LEN(H4552)=0,\"00\",RIGHT(H4552,2)))","v":"02"}]
["05-08-02-01",2,null,16,5,8,2,1,"05","08","02","01"]
["05-08-03-00",2,null,16,5,8,3,0,"05","08","03","00"]
["05-09-00-02",2,null,16,5,9,0,2,"05","09","00","02"]
["05-09-01-01",2,null,16,5,9,1,1,"05","09","01","01"]
["05-09-02-00",2,null,16,5,9,2,0,"05","09","02","00"]
["05-10-00-01",2,null,16,5,10,0,1,"05","10","00","01"]
["05-10-01-00",2,null,16,5,10,1,0,"05","10","01","00"]
["05-11-00-00",2,null,16,5,11,0,0,"05","11","00","00"]
["06-00-00-10",4,null,16,6,0,0,10,"06","00","00","10"]
["06-00-01-09",4,null,16,6,0,1,9,"06","00","01","09"]
["06-00-02-08",4,null,16,6,0,2,8,"06","00","02","08"]
["06-00-03-07",4,null,16,6,0,3,7,"06","00","03","07"]
["06-00-04-06",4,null,16,6,0,4,6,"06","00","04","06"]
["06-00-05-05",4,null,16,6,0,5,5,"06","00","05","05"]
["06-00-06-04",4,null,16,6,0,6,4,"06","00","06","04"]
["06-00-07-03",4,null,16,6,0,7,3,"06","00","07","03"]
["06-00-08-02",4,null,16,6,0,8,2,"06","00","08","02"]
["06-00-09-01",4,null,16,6,0,9,1,"06","00","09","01"]
["06-00-10-00",4,null,16,6,0,10,0,"06","00","10","00"]
["06-01-00-09",4,null,16,6,1,0,9,"06","01","00","09"]
["06-01-01-08",4,null,16,6,1,1,8,"06","01","01","08"]
["06-01-02-07",4,null,16,6,1,2,7,"06","01","02","07"]
["06-01-03-06",4,null,16,6,1,3,6,"06","01","03","06"]
["06-01-04-05",4,null,16,6,1,4,5,"06","01","04","05"]
["06-01-05-04",4,null,16,6,1,5,4,"06","01","05","04"]
["06-01-06-03",4,null,16,6,1,6,3,"06","01","06","03"]
["06-01-07-02",4,null,16,6,1,7,2,"06","01","07","02"]
["06-01-08-01",4,null,16,6,1,8,1,"06","01","08","01"]
["06-01-09-00",4,null,16,6,1,9,0,"06","01","09","00"]
["06-02-00-08",4,null,16,6,2,0,8,"06","02","00","08"]
["06-02-01-07",4,null,16,6,2,1,7,"06","02","01","07"]
["06-02-02-06",4,null,16,6,2,2,6,"06","02","02","06"]
["06-02-03-05",4,null,16,6,2,3,5,"06","02","03","05"]
["06-02-04-04",4,null,16,6,2,4,4,"06","02","04","04"]
["06-02-05-03",4,null,16,6,2,5,3,"06","02","05","03"]
["06-02-06-02",4,null,16,6,2,6,2,"06","02","06","02"]
["06-02-07-01",3,null,16,6,2,7,1,"06","02","07","01"]
["06-02-08-00",3,null,16,6,2,8,0,"06","02","08","00"]
["06-03-00-07",3,null,16,6,3,0,7,"06","03","00","07"]
["06-03-01-06",3,null,16,6,3,1,6,"06","03","01","06"]
["06-03-02-05",3,null,16,6,3,2,5,"06","03","02","05"]
["06-03-03-04",3,null,16,6,3,3,4,"06","03","03","04"]
["06-03-04-03",3,null,16,6,3,4,3,"06","03","04","03"]
["06-03-05-02",3,null,16,6,3,5,2,"06","03","05","02"]
["06-03-06-01",3,null,16,6,3,6,1,"06","03","06","01"]
["06-03-07-00",3,null,16,6,3,7,0,"06","03","07","00"]
["06-04-00-06",3,null,16,6,4,0,6,"06","04","00","06"]
["06-04-01-05",3,null,16,6,4,1,5,"06","04","01","05"]
["06-04-02-04",3,null,16,6,4,2,4,"06","04","02","04"]
["06-04-03-03",3,null,16,6,4,3,3,"06","04","03","03"]
["06-04-04-02",3,null,16,6,4,4,2,"06","04","04","02"]
["06-04-05-01",3,null,16,6,4,5,1,"06","04","05","01"]
["06-04-06-00",3,null,16,6,4,6,0,"06","04","06","00"]
["06-05-00-05",3,null,16,6,5,0,5,"06","05","00","05"]
["06-05-01-04",3,null,16,6,5,1,4,"06","05","01","04"]
["06-05-02-03",3,null,16,6,5,2,3,"06","05","02","03"]
["06-05-03-02",3,null,16,6,5,3,2,"06","05","03","02"]
["06-05-04-01",3,null,16,6,5,4,1,"06","05","04","01"]
["06-05-05-00",3,null,16,6,5,5,0,"06","05","05","00"]
["06-06-00-04",3,null,16,6,6,0,4,"06","06","00","04"]
["06-06-01-03",2,null,16,6,6,1,3,"06","06","01","03"]
["06-06-02-02",2,null,16,6,6,2,2,"06","06","02","02"]
[{"$f":"I4615&\"-\"&J4615&\"-\"&K4615&\"-\"&L4615","v":"06-06-03-01"},2,null,16,6,6,3,1,"06","06","03","01"]
["06-06-04-00",2,null,16,6,6,4,0,{"$f":"IF(LEN(E4616)=1,0&E4616,IF(LEN(E4616)=0,\"00\",RIGHT(E4616,2)))","v":"06"},{"$f":"IF(LEN(F4616)=1,0&F4616,IF(LEN(F4616)=0,\"00\",RIGHT(F4616,2)))","v":"06"},{"$f":"IF(LEN(G4616)=1,0&G4616,IF(LEN(G4616)=0,\"00\",RIGHT(G4616,2)))","v":"04"},{"$f":"IF(LEN(H4616)=1,0&H4616,IF(LEN(H4616)=0,\"00\",RIGHT(H4616,2)))","v":"00"}]
["06-07-00-03",2,null,16,6,7,0,3,"06","07","00","03"]
["06-07-01-02",2,null,16,6,7,1,2,"06","07","01","02"]
["06-07-02-01",2,null,16,6,7,2,1,"06","07","02","01"]
["06-07-03-00",2,null,16,6,7,3,0,"06","07","03","00"]
["06-08-00-02",2,null,16,6,8,0,2,"06","08","00","02"]
["06-08-01-01",2,null,16,6,8,1,1,"06","08","01","01"]
["06-08-02-00",2,null,16,6,8,2,0,"06","08","02","00"]
["06-09-00-01",2,null,16,6,9,0,1,"06","09","00","01"]
["06-09-01-00",2,null,16,6,9,1,0,"06","09","01","00"]
["06-10-00-00",2,null,16,6,10,0,0,"06","10","00","00"]
["07-00-00-09",4,null,16,7,0,0,9,"07","00","00","09"]
["07-00-01-08",4,null,16,7,0,1,8,"07","00","01","08"]
["07-00-02-07",4,null,16,7,0,2,7,"07","00","02","07"]
["07-00-03-06",4,null,16,7,0,3,6,"07","00","03","06"]
["07-00-04-05",4,null,16,7,0,4,5,"07","00","04","05"]
["07-00-05-04",4,null,16,7,0,5,4,"07","00","05","04"]
["07-00-06-03",4,null,16,7,0,6,3,"07","00","06","03"]
["07-00-07-02",4,null,16,7,0,7,2,"07","00","07","02"]
["07-00-08-01",3,null,16,7,0,8,1,"07","00","08","01"]
["07-00-09-00",3,null,16,7,0,9,0,"07","00","09","00"]
["07-01-00-08",4,null,16,7,1,0,8,"07","01","00","08"]
["07-01-01-07",4,null,16,7,1,1,7,"07","01","01","07"]
["07-01-02-06",4,null,16,7,1,2,6,"07","01","02","06"]
["07-01-03-05",4,null,16,7,1,3,5,"07","01","03","05"]
["07-01-04-04",4,null,16,7,1,4,4,"07","01","04","04"]
["07-01-05-03",4,null,16,7,1,5,3,"07","01","05","03"]
["07-01-06-02",3,null,16,7,1,6,2,"07","01","06","02"]
["07-01-07-01",3,null,16,7,1,7,1,"07","01","07","01"]
["07-01-08-00",3,null,16,7,1,8,0,"07","01","08","00"]
["07-02-00-07",3,null,16,7,2,0,7,"07","02","00","07"]
["07-02-01-06",3,null,16,7,2,1,6,"07","02","01","06"]
["07-02-02-05",3,null,16,7,2,2,5,"07","02","02","05"]
["07-02-03-04",3,null,16,7,2,3,4,"07","02","03","04"]
["07-02-04-03",3,null,16,7,2,4,3,"07","02","04","03"]
["07-02-05-02",3,null,16,7,2,5,2,"07","02","05","02"]
["07-02-06-01",3,null,16,7,2,6,1,"07","02","06","01"]
["07-02-07-00",3,null,16,7,2,7,0,"07","02","07","00"]
["07-03-00-06",3,null,16,7,3,0,6,"07","03","00","06"]
["07-03-01-05",3,null,16,7,3,1,5,"07","03","01","05"]
["07-03-02-04",3,null,16,7,3,2,4,"07","03","02","04"]
["07-03-03-03",3,null,16,7,3,3,3,"07","03","03","03"]
["07-03-04-02",3,null,16,7,3,4,2,"07","03","04","02"]
["07-03-05-01",3,null,16,7,3,5,1,"07","03","05","01"]
["07-03-06-00",3,null,16,7,3,6,0,"07","03","06","00"]
["07-04-00-05",3,null,16,7,4,0,5,"07","04","00","05"]
["07-04-01-04",3,null,16,7,4,1,4,"07","04","01","04"]
["07-04-02-03",3,null,16,7,4,2,3,"07","04","02","03"]
["07-04-03-02",3,null,16,7,4,3,2,"07","04","03","02"]
["07-04-04-01",3,null,16,7,4,4,1,"07","04","04","01"]
["07-04-05-00",3,null,16,7,4,5,0,"07","04","05","00"]
["07-05-00-04",3,null,16,7,5,0,4,"07","05","00","04"]
["07-05-01-03",2,null,16,7,5,1,3,"07","05","01","03"]
["07-05-02-02",2,null,16,7,5,2,2,"07","05","02","02"]
["07-05-03-01",2,null,16,7,5,3,1,"07","05","03","01"]
["07-05-04-00",2,null,16,7,5,4,0,"07","05","04","00"]
["07-06-00-03",2,null,16,7,6,0,3,"07","06","00","03"]
["07-06-01-02",2,null,16,7,6,1,2,"07","06","01","02"]
["07-06-02-01",2,null,16,7,6,2,1,"07","06","02","01"]
["07-06-03-00",2,null,16,7,6,3,0,"07","06","03","00"]
["07-07-00-02",2,null,16,7,7,0,2,"07","07","00","02"]
["07-07-01-01",2,null,16,7,7,1,1,"07","07","01","01"]
["07-07-02-00",2,null,16,7,7,2,0,"07","07","02","00"]
[{"$f":"I4679&\"-\"&J4679&\"-\"&K4679&\"-\"&L4679","v":"07-08-00-01"},2,null,16,7,8,0,1,"07","08","00","01"]
["07-08-01-00",2,null,16,7,8,1,0,{"$f":"IF(LEN(E4680)=1,0&E4680,IF(LEN(E4680)=0,\"00\",RIGHT(E4680,2)))","v":"07"},{"$f":"IF(LEN(F4680)=1,0&F4680,IF(LEN(F4680)=0,\"00\",RIGHT(F4680,2)))","v":"08"},{"$f":"IF(LEN(G4680)=1,0&G4680,IF(LEN(G4680)=0,\"00\",RIGHT(G4680,2)))","v":"01"},{"$f":"IF(LEN(H4680)=1,0&H4680,IF(LEN(H4680)=0,\"00\",RIGHT(H4680,2)))","v":"00"}]
["07-09-00-00",2,null,16,7,9,0,0,"07","09","00","00"]
["08-00-00-08",4,null,16,8,0,0,8,"08","00","00","08"]
["08-00-01-07",4,null,16,8,0,1,7,"08","00","01","07"]
["08-00-02-06",4,null,16,8,0,2,6,"08","00","02","06"]
["08-00-03-05",4,null,16,8,0,3,5,"08","00","03","05"]
["08-00-04-04",3,null,16,8,0,4,4,"08","00","04","04"]
["08-00-05-03",3,null,16,8,0,5,3,"08","00","05","03"]
["08-00-06-02",3,null,16,8,0,6,2,"08","00","06","02"]
["08-00-07-01",3,null,16,8,0,7,1,"08","00","07","01"]
["08-00-08-00",3,null,16,8,0,8,0,"08","00","08","00"]
["08-01-00-07",3,null,16,8,1,0,7,"08","01","00","07"]
["08-01-01-06",3,null,16,8,1,1,6,"08","01","01","06"]
["08-01-02-05",3,null,16,8,1,2,5,"08","01","02","05"]
["08-01-03-04",3,null,16,8,1,3,4,"08","01","03","04"]
["08-01-04-03",3,null,16,8,1,4,3,"08","01","04","03"]
["08-01-05-02",3,null,16,8,1,5,2,"08","01","05","02"]
["08-01-06-01",3,null,16,8,1,6,1,"08","01","06","01"]
["08-01-07-00",3,null,16,8,1,7,0,"08","01","07","00"]
["08-02-00-06",3,null,16,8,2,0,6,"08","02","00","06"]
["08-02-01-05",3,null,16,8,2,1,5,"08","02","01","05"]
["08-02-02-04",3,null,16,8,2,2,4,"08","02","02","04"]
["08-02-03-03",3,null,16,8,2,3,3,"08","02","03","03"]
["08-02-04-02",3,null,16,8,2,4,2,"08","02","04","02"]
["08-02-05-01",3,null,16,8,2,5,1,"08","02","05","01"]
["08-02-06-00",3,null,16,8,2,6,0,"08","02","06","00"]
["08-03-00-05",3,null,16,8,3,0,5,"08","03","00","05"]
["08-03-01-04",3,null,16,8,3,1,4,"08","03","01","04"]
["08-03-02-03",3,null,16,8,3,2,3,"08","03","02","03"]
["08-03-03-02",3,null,16,8,3,3,2,"08","03","03","02"]
["08-03-04-01",3,null,16,8,3,4,1,"08","03","04","01"]
["08-03-05-00",3,null,16,8,3,5,0,"08","03","05","00"]
["08-04-00-04",3,null,16,8,4,0,4,"08","04","00","04"]
["08-04-01-03",2,null,16,8,4,1,3,"08","04","01","03"]
["08-04-02-02",2,null,16,8,4,2,2,"08","04","02","02"]
["08-04-03-01",2,null,16,8,4,3,1,"08","04","03","01"]
["08-04-04-00",2,null,16,8,4,4,0,"08","04","04","00"]
["08-05-00-03",2,null,16,8,5,0,3,"08","05","00","03"]
["08-05-01-02",2,null,16,8,5,1,2,"08","05","01","02"]
["08-05-02-01",2,null,16,8,5,2,1,"08","05","02","01"]
["08-05-03-00",2,null,16,8,5,3,0,"08","05","03","00"]
["08-06-00-02",2,null,16,8,6,0,2,"08","06","00","02"]
["08-06-01-01",2,null,16,8,6,1,1,"08","06","01","01"]
["08-06-02-00",2,null,16,8,6,2,0,"08","06","02","00"]
["08-07-00-01",2,null,16,8,7,0,1,"08","07","00","01"]
["08-07-01-00",2,null,16,8,7,1,0,"08","07","01","00"]
["08-08-00-00",2,null,16,8,8,0,0,"08","08","00","00"]
["09-00-00-07",3,null,16,9,0,0,7,"09","00","00","07"]
["09-00-01-06",3,null,16,9,0,1,6,"09","00","01","06"]
["09-00-02-05",3,null,16,9,0,2,5,"09","00","02","05"]
["09-00-03-04",3,null,16,9,0,3,4,"09","00","03","04"]
["09-00-04-03",3,null,16,9,0,4,3,"09","00","04","03"]
["09-00-05-02",3,null,16,9,0,5,2,"09","00","05","02"]
["09-00-06-01",3,null,16,9,0,6,1,"09","00","06","01"]
["09-00-07-00",3,null,16,9,0,7,0,"09","00","07","00"]
["09-01-00-06",3,null,16,9,1,0,6,"09","01","00","06"]
["09-01-01-05",3,null,16,9,1,1,5,"09","01","01","05"]
["09-01-02-04",3,null,16,9,1,2,4,"09","01","02","04"]
["09-01-03-03",3,null,16,9,1,3,3,"09","01","03","03"]
["09-01-04-02",3,null,16,9,1,4,2,"09","01","04","02"]
["09-01-05-01",3,null,16,9,1,5,1,"09","01","05","01"]
["09-01-06-00",3,null,16,9,1,6,0,"09","01","06","00"]
["09-02-00-05",3,null,16,9,2,0,5,"09","02","00","05"]
[{"$f":"I4743&\"-\"&J4743&\"-\"&K4743&\"-\"&L4743","v":"09-02-01-04"},3,null,16,9,2,1,4,"09","02","01","04"]
["09-02-02-03",3,null,16,9,2,2,3,{"$f":"IF(LEN(E4744)=1,0&E4744,IF(LEN(E4744)=0,\"00\",RIGHT(E4744,2)))","v":"09"},{"$f":"IF(LEN(F4744)=1,0&F4744,IF(LEN(F4744)=0,\"00\",RIGHT(F4744,2)))","v":"02"},{"$f":"IF(LEN(G4744)=1,0&G4744,IF(LEN(G4744)=0,\"00\",RIGHT(G4744,2)))","v":"02"},{"$f":"IF(LEN(H4744)=1,0&H4744,IF(LEN(H4744)=0,\"00\",RIGHT(H4744,2)))","v":"03"}]
["09-02-03-02",3,null,16,9,2,3,2,"09","02","03","02"]
["09-02-04-01",3,null,16,9,2,4,1,"09","02","04","01"]
["09-02-05-00",3,null,16,9,2,5,0,"09","02","05","00"]
["09-03-00-04",3,null,16,9,3,0,4,"09","03","00","04"]
["09-03-01-03",2,null,16,9,3,1,3,"09","03","01","03"]
["09-03-02-02",2,null,16,9,3,2,2,"09","03","02","02"]
["09-03-03-01",2,null,16,9,3,3,1,"09","03","03","01"]
["09-03-04-00",2,null,16,9,3,4,0,"09","03","04","00"]
["09-04-00-03",2,null,16,9,4,0,3,"09","04","00","03"]
["09-04-01-02",2,null,16,9,4,1,2,"09","04","01","02"]
["09-04-02-01",2,null,16,9,4,2,1,"09","04","02","01"]
["09-04-03-00",2,null,16,9,4,3,0,"09","04","03","00"]
["09-05-00-02",2,null,16,9,5,0,2,"09","05","00","02"]
["09-05-01-01",2,null,16,9,5,1,1,"09","05","01","01"]
["09-05-02-00",2,null,16,9,5,2,0,"09","05","02","00"]
["09-06-00-01",2,null,16,9,6,0,1,"09","06","00","01"]
["09-06-01-00",2,null,16,9,6,1,0,"09","06","01","00"]
["09-07-00-00",2,null,16,9,7,0,0,"09","07","00","00"]
["10-00-00-06",3,null,16,10,0,0,6,"10","00","00","06"]
["10-00-01-05",3,null,16,10,0,1,5,"10","00","01","05"]
["10-00-02-04",3,null,16,10,0,2,4,"10","00","02","04"]
["10-00-03-03",3,null,16,10,0,3,3,"10","00","03","03"]
["10-00-04-02",3,null,16,10,0,4,2,"10","00","04","02"]
["10-00-05-01",3,null,16,10,0,5,1,"10","00","05","01"]
["10-00-06-00",3,null,16,10,0,6,0,"10","00","06","00"]
["10-01-00-05",3,null,16,10,1,0,5,"10","01","00","05"]
["10-01-01-04",3,null,16,10,1,1,4,"10","01","01","04"]
["10-01-02-03",3,null,16,10,1,2,3,"10","01","02","03"]
["10-01-03-02",3,null,16,10,1,3,2,"10","01","03","02"]
["10-01-04-01",3,null,16,10,1,4,1,"10","01","04","01"]
["10-01-05-00",3,null,16,10,1,5,0,"10","01","05","00"]
["10-02-00-04",3,null,16,10,2,0,4,"10","02","00","04"]
["10-02-01-03",2,null,16,10,2,1,3,"10","02","01","03"]
["10-02-02-02",2,null,16,10,2,2,2,"10","02","02","02"]
["10-02-03-01",2,null,16,10,2,3,1,"10","02","03","01"]
["10-02-04-00",2,null,16,10,2,4,0,"10","02","04","00"]
["10-03-00-03",2,null,16,10,3,0,3,"10","03","00","03"]
["10-03-01-02",2,null,16,10,3,1,2,"10","03","01","02"]
["10-03-02-01",2,null,16,10,3,2,1,"10","03","02","01"]
["10-03-03-00",2,null,16,10,3,3,0,"10","03","03","00"]
["10-04-00-02",2,null,16,10,4,0,2,"10","04","00","02"]
["10-04-01-01",2,null,16,10,4,1,1,"10","04","01","01"]
["10-04-02-00",2,null,16,10,4,2,0,"10","04","02","00"]
["10-05-00-01",2,null,16,10,5,0,1,"10","05","00","01"]
["10-05-01-00",2,null,16,10,5,1,0,"10","05","01","00"]
["10-06-00-00",2,null,16,10,6,0,0,"10","06","00","00"]
["11-00-00-05",3,null,16,11,0,0,5,"11","00","00","05"]
["11-00-01-04",3,null,16,11,0,1,4,"11","00","01","04"]
["11-00-02-03",3,null,16,11,0,2,3,"11","00","02","03"]
["11-00-03-02",3,null,16,11,0,3,2,"11","00","03","02"]
["11-00-04-01",3,null,16,11,0,4,1,"11","00","04","01"]
["11-00-05-00",3,null,16,11,0,5,0,"11","00","05","00"]
["11-01-00-04",3,null,16,11,1,0,4,"11","01","00","04"]
["11-01-01-03",2,null,16,11,1,1,3,"11","01","01","03"]
["11-01-02-02",2,null,16,11,1,2,2,"11","01","02","02"]
["11-01-03-01",2,null,16,11,1,3,1,"11","01","03","01"]
["11-01-04-00",2,null,16,11,1,4,0,"11","01","04","00"]
["11-02-00-03",2,null,16,11,2,0,3,"11","02","00","03"]
["11-02-01-02",2,null,16,11,2,1,2,"11","02","01","02"]
["11-02-02-01",2,null,16,11,2,2,1,"11","02","02","01"]
["11-02-03-00",2,null,16,11,2,3,0,"11","02","03","00"]
["11-03-00-02",2,null,16,11,3,0,2,"11","03","00","02"]
[{"$f":"I4807&\"-\"&J4807&\"-\"&K4807&\"-\"&L4807","v":"11-03-01-01"},2,null,16,11,3,1,1,"11","03","01","01"]
["11-03-02-00",2,null,16,11,3,2,0,{"$f":"IF(LEN(E4808)=1,0&E4808,IF(LEN(E4808)=0,\"00\",RIGHT(E4808,2)))","v":"11"},{"$f":"IF(LEN(F4808)=1,0&F4808,IF(LEN(F4808)=0,\"00\",RIGHT(F4808,2)))","v":"03"},{"$f":"IF(LEN(G4808)=1,0&G4808,IF(LEN(G4808)=0,\"00\",RIGHT(G4808,2)))","v":"02"},{"$f":"IF(LEN(H4808)=1,0&H4808,IF(LEN(H4808)=0,\"00\",RIGHT(H4808,2)))","v":"00"}]
["11-04-00-01",2,null,16,11,4,0,1,"11","04","00","01"]
["11-04-01-00",2,null,16,11,4,1,0,"11","04","01","00"]
["11-05-00-00",2,null,16,11,5,0,0,"11","05","00","00"]
["12-00-00-04",3,null,16,12,0,0,4,"12","00","00","04"]
["12-00-01-03",2,null,16,12,0,1,3,"12","00","01","03"]
["12-00-02-02",2,null,16,12,0,2,2,"12","00","02","02"]
["12-00-03-01",2,null,16,12,0,3,1,"12","00","03","01"]
["12-00-04-00",2,null,16,12,0,4,0,"12","00","04","00"]
["12-01-00-03",2,null,16,12,1,0,3,"12","01","00","03"]
["12-01-01-02",2,null,16,12,1,1,2,"12","01","01","02"]
["12-01-02-01",2,null,16,12,1,2,1,"12","01","02","01"]
["12-01-03-00",2,null,16,12,1,3,0,"12","01","03","00"]
["12-02-00-02",2,null,16,12,2,0,2,"12","02","00","02"]
["12-02-01-01",2,null,16,12,2,1,1,"12","02","01","01"]
["12-02-02-00",2,null,16,12,2,2,0,"12","02","02","00"]
["12-03-00-01",2,null,16,12,3,0,1,"12","03","00","01"]
["12-03-01-00",2,null,16,12,3,1,0,"12","03","01","00"]
["12-04-00-00",2,null,16,12,4,0,0,"12","04","00","00"]
["13-00-00-03",2,null,16,13,0,0,3,"13","00","00","03"]
["13-00-01-02",2,null,16,13,0,1,2,"13","00","01","02"]
["13-00-02-01",2,null,16,13,0,2,1,"13","00","02","01"]
["13-00-03-00",2,null,16,13,0,3,0,"13","00","03","00"]
["13-01-00-02",2,null,16,13,1,0,2,"13","01","00","02"]
["13-01-01-01",2,null,16,13,1,1,1,"13","01","01","01"]
["13-01-02-00",2,null,16,13,1,2,0,"13","01","02","00"]
["13-02-00-01",2,null,16,13,2,0,1,"13","02","00","01"]
["13-02-01-00",2,null,16,13,2,1,0,"13","02","01","00"]
["13-03-00-00",2,null,16,13,3,0,0,"13","03","00","00"]
["14-00-00-02",2,null,16,14,0,0,2,"14","00","00","02"]
["14-00-01-01",2,null,16,14,0,1,1,"14","00","01","01"]
["14-00-02-00",2,null,16,14,0,2,0,"14","00","02","00"]
["14-01-00-01",2,null,16,14,1,0,1,"14","01","00","01"]
["14-01-01-00",2,null,16,14,1,1,0,"14","01","01","00"]
["14-02-00-00",2,null,16,14,2,0,0,"14","02","00","00"]
["15-00-00-01",2,null,16,15,0,0,1,"15","00","00","01"]
["15-00-01-00",2,null,16,15,0,1,0,"15","00","01","00"]
["15-01-00-00",2,null,16,15,1,0,0,"15","01","00","00"]
["16-00-00-00",1,null,16,16,0,0,0,"16","00","00","00"]

{"sheet":"ElementRatingScale","index":11,"n_rows":12,"n_cols":5,"rows_kept":12,"cut":false,"hidden":true,"merged":[]}
["Element Rating","Description",null,"Brief Element Description","Element Rating"]
[1,"No - element not in place and not planning to work on it at this time",null,1,1]
[2,"No - element not in place but planning to work on it or getting started",null,2,2]
[3,"Yes - element partially implemented",null,3,3]
[4,"Yes - element fully implemented",null,4,4]
[]
[null,null,null,"Brief Element Description Plus","Element Rating"]
["Priority Rating",null,null,1,1]
["L","Low",null,2,2]
["M","Medium",null,3,3]
["H","High",null,4,4]
[null,null,null,"Not applicable",{"$f":"\"\"","v":""}]

{"sheet":"IndicatorRating","index":12,"n_rows":31,"n_cols":6,"rows_kept":31,"cut":false,"hidden":true,"merged":[[19,0,20,0],[1,0,2,0],[3,0,4,0],[5,0,9,0],[10,0,13,0],[14,0,16,0],[17,0,18,0],[28,5,28,6],[29,5,29,6],[30,5,30,6],[23,4,23,6],[24,5,24,6],[25,5,25,6],[26,5,26,6],[27,5,27,6]]}
["Quality Indicator Rating","Description"]
[1,"None of the elements are yet planned or in place.  "]
[null,"None of the elements are yet a 2 or higher."]
[2,"Most of the elements are not yet planned or in place. "]
[null,"Less than one half are 3’s; no 4’s. The rest are 1’s or 2’s."]
[3,"Some elements are in place, a few may be fully implemented."]
[null,"Half or less are 3s and 4s; or at least one is a 4."]
[null,"Does not have to have a 4."]
[null,"This is the lowest score with one 4."]
[null,"This is the highest score if no 4."]
[4,"At least half of the elements are in place, a few may be fully implemented."]
[null,"More than ½ are 3 or 4 combined. "]
[null,"Need at least one 4 to get “4” or higher on the scale."]
[null,"If fewer than 7 elements, one or more 1s; if 7 or more elements, 2 or more 1s"]
[5,"At least half of the elements are in place, some are fully implemented."]
[null,"More than half of the elements are 3 and/or 4s, at least 20% are 4s, no elements are rated 1 (if fewer than 7 elements) or one element could be rated 1 if there are 7 or more elements"]
[null,"This is the highest score with a 2."]
[6,"At least half of the elements are fully implemented, the rest are partially implemented."]
[null,"At least half the elements are 4 and the rest are 3."]
[7,"All elements are fully implemented."]
[null,"All element ratings are 4."]
[]
[]
[null,null,null,null,"Best Practice Theme Rating (Calculated)"]
[null,null,null,null,1,"None of the practices are yet planned or in place.  "]
[null,null,null,null,2,"Most of the practices are not yet planned or in place. "]
[null,null,null,null,3,"Some practices are in place; a few may be fully implemented."]
[null,null,null,null,4,"At least half of the practices are in place; a few may be fully implemented."]
[null,null,null,null,5,"At least half of the practices are in place; some are fully implemented."]
[null,null,null,null,6,"At least half of the practices are fully implemented; the rest are partially implemented."]
[null,null,null,null,7,"All practices are fully implemented."]