{"text_format":"1","workbook":"xlsx","n_sheets":13,"sheets":["programmer documentation","Instructions","Table of Contents","Child Find Best Practices","Theme Summary","Action Plan","Data","Help","ALLdata","QualityIndicators","QIRatingLookup","ElementRatingScale","IndicatorRating"],"not_rendered":{"charts":0,"images":11,"macros":1,"external_links":2,"defined_names":20,"comments":1,"pivot_tables":0},"unopened":[],"bounds":{"document_bytes":16777216,"sheet_cells":100000,"rows_first":2000,"rows_last":500,"rows_between":2000,"halvings":0,"cell_chars":16384,"cell_head_chars":4096},"cells_cut":0,"cells_raw":0,"read":"whole","date_system":"1900"}

{"sheet":"programmer documentation","index":0,"n_rows":16,"n_cols":6,"rows_kept":16,"cut":false,"hidden":true,"merged":[]}
[]
[null,"Version","Action","Date Saved"]
[null,"v01","Initial Release","2021-06-29"]
[null,"v02","[Instructions] fixed typos, added buttons, added Help content","2021-07-27"]
[null,null,"[Table of Contents] corrected content (out of order), link references, added Help",null,null,"Lorem ipsum dolor sit amet, consectetur adipiscing elit. Nulla pulvinar sit amet enim eu vulputate.  Donec pellentesque aliquam velit, a vehicula sem ornare id. Mauris at metus sit amet turpis viverra ultrices tincidunt ut neque. Aliquam erat volutpat. Ut semper pulvinar magna, laoreet accumsan leo facilisis ac. Praesent lobortis metus orci, non mattis turpis digniss im at. Nulla scelerisque rutrum efficitur. Pellentesque habitant morbi tristique senectus et netus et malesuada fames ac turpis egestas. Integer tempor posuere tincidunt. Etiam gravida nunc eros, id mollis nulla tincidunt sed. Ut eu sollicitudin enim. Fusce a mattis ex. Etiam varius ipsum orci, ac cursus dui fermentum non."]
[null,null,"[Child Find Best Practices] fixed typos"]
[null,null,"[Action Plan] Added row/column highlighting; shaded light yellow all editable cells"]
[null,null,"[Help] updated images, fixed links"]
{"$rows_left_out":9}
{"sheet":"Instructions","index":1,"n_rows":96,"n_cols":2,"rows_kept":96,"cut":false,"hidden":false,"merged":[[83,2,84,7],[70,0,72,0],[75,2,76,7],[77,2,78,7],[79,2,80,7],[81,2,82,7]]}
[null,"OSEP"]
[null,"Click to jump to instructions on this tab:"]
[]
[null,"Child Find Section II: Child Find Best Practices"]
[null,"Purpose"]
["\n\n\n\n\n","The purpose of Section II of the Part B, 619 Child Find Self-Assessment (CFSA) tool is to help Local Education Agencies (LEA) identify evidence-based practices to support their Child Find efforts. States can also use the CFSA to look across LEAs at what is happening at the local level or as part of a corrective action plan in an LEA. This section includes content that is not required by the IDEA but best practices that can help Part B, 619 programs efficiently and effectively identify and locate young children ages three through five with disabilities and their families.  "]
[null,"Completion of the CFSA is voluntary. A State may choose to request technical assistance from OSEP regarding its CFSA. To request technical assistance, or ask a question about the CFSA, please send an email to your OSEP State Lead and copy the email to OSEP’s Child Find Lead -- Brenda Wilkins at Brenda.Wilkins@ed.gov. You may also call Brenda Wilkins about the CFSA at 202-245-6920. TA center support is also available. To access TA support, contact Evelyn Shaw (evelyn.shaw@unc.edu, 919-962-2001). "]
["\n\n\n\n","It is recommended that LEAs and States review additional information about the efficiency and effectiveness of their Child Find systems and engage stakeholders in identifying root causes of any identified inefficiency or ineffectiveness. Completing the CFSA at regular timepoints can also allow LEAs and States to track progress resulting from improvement activities."]
{"$rows_left_out":89}
{"sheet":"Table of Contents","index":2,"n_rows":36,"n_cols":3,"rows_kept":36,"cut":false,"hidden":false,"merged":[[5,1,5,2],[21,1,21,2],[1,1,1,2],[25,1,25,2],[33,1,33,2],[3,1,3,2],[29,1,29,2]]}
[]
[null,"Table of Contents"]
[]
[null,"Instructions"]
[]
[null,"Child Find Best Practices"]
[]
[null,null,"Cross-Sector Collaboration"]
{"$rows_left_out":29}
{"sheet":"Child Find Best Practices","index":3,"n_rows":114,"n_cols":27,"rows_kept":114,"cut":false,"hidden":false,"merged":[[52,17,53,17],[53,5,53,8],[54,4,54,8],[54,10,55,10],[54,11,55,11],[54,13,55,13],[54,17,55,17],[55,5,55,8],[47,22,48,23],[48,4,48,8],[48,10,49,10],[48,11,49,11],[48,13,49,13],[48,17,49,17],[48,18,48,21],[49,5,49,8],[49,18,49,21],[71,17,72,17],[72,5,72,8],[46,4,46,8],[46,10,47,10],[46,11,47,11],[46,13,47,13],[46,17,47,17],[47,5,47,8],[50,4,50,8],[50,10,51,10],[50,11,51,11],[50,13,51,13],[50,17,51,17],[51,5,51,8],[52,4,52,8],[52,10,53,10],[52,11,53,11],[52,13,53,13],[67,17,68,17],[68,5,68,8],[69,4,69,8],[69,10,70,10],[69,11,70,11],[69,13,70,13],[69,17,70,17],[70,5,70,8],[22,13,23,13],[22,17,23,17],[23,5,23,8],[67,4,67,8],[67,10,68,10],[67,11,68,11],[65,17,66,17],[63,4,63,8],[63,10,64,10],[63,11,64,11],[63,13,64,13],[63,17,64,17],[64,5,64,8],[59,17,60,17],[60,5,60,8],[57,4,57,8],[59,4,59,8],[58,4,58,8],[44,4,44,8],[44,10,45,10],[44,11,45,11],[44,13,45,13],[112,4,112,8],[112,10,113,10],[112,11,113,11],[112,13,113,13],[112,17,113,17],[113,5,113,8],[88,4,88,8],[88,10,89,10],[88,11,89,11],[88,13,89,13],[88,17,89,17],[89,5,89,8],[90,4,90,8],[90,10,91,10],[90,11,91,11],[90,13,91,13],[90,17,91,17],[91,5,91,8],[110,4,110,8],[110,10,111,10],[110,11,111,11],[110,13,111,13],[110,17,111,17],[111,5,111,8],[108,4,108,8],[108,10,109,10],[108,11,109,11],[108,13,109,13],[108,17,109,17],[109,5,109,8],[104,17,105,17],[105,5,105,8],[105,22,106,23],[106,4,106,8],[106,10,107,10],[106,11,107,11],[106,13,107,13],[106,17,107,17],[106,18,106,21],[107,5,107,8],[107,18,107,21],[102,4,102,8],[104,4,104,8],[104,10,105,10],[104,11,105,11],[104,13,105,13],[103,4,103,8],[99,4,99,8],[99,10,100,10],[99,11,100,11],[99,13,100,13],[99,17,100,17],[100,5,100,8],[95,17,96,17],[96,5,96,8],[96,22,97,23],[97,4,97,8],[97,10,98,10],[97,11,98,11],[97,13,98,13],[97,17,98,17],[97,18,97,21],[98,5,98,8],[98,18,98,21],[93,4,93,8],[95,4,95,8],[95,10,96,10],[95,11,96,11],[95,13,96,13],[94,4,94,8],[86,4,86,8],[86,10,87,10],[86,11,87,11],[86,13,87,13],[86,17,87,17],[87,5,87,8],[82,4,82,8],[82,10,83,10],[82,11,83,11],[82,13,83,13],[82,17,83,17],[83,5,83,8],[80,4,80,8],[80,10,81,10],[80,11,81,11],[80,13,81,13],[80,17,81,17],[81,5,81,8],[84,4,84,8],[84,10,85,10],[84,11,85,11],[84,13,85,13],[84,17,85,17],[85,5,85,8],[76,17,77,17],[77,5,77,8],[77,22,78,23],[78,4,78,8],[78,10,79,10],[78,11,79,11],[78,13,79,13],[78,17,79,17],[78,18,78,21],[79,5,79,8],[79,18,79,21],[74,4,74,8],[76,4,76,8],[76,10,77,10],[76,11,77,11],[76,13,77,13],[75,4,75,8],[65,4,65,8],[65,10,66,10],[65,11,66,11],[65,13,66,13],[67,13,68,13],[71,4,71,8],[71,10,72,10],[71,11,72,11],[71,13,72,13],[66,5,66,8],[60,22,61,23],[61,4,61,8],[61,10,62,10],[61,11,62,11],[61,13,62,13],[61,17,62,17],[61,18,61,21],[62,5,62,8],[62,18,62,21],[59,10,60,10],[59,11,60,11],[59,13,60,13],[44,17,45,17],[45,5,45,8],[42,4,42,8],[42,10,43,10],[42,11,43,11],[42,13,43,13],[42,17,43,17],[43,5,43,8],[40,4,40,8],[40,10,41,10],[40,11,41,11],[40,13,41,13],[40,17,41,17],[41,5,41,8],[36,17,37,17],[37,5,37,8],[37,22,38,23],[38,4,38,8],[38,10,39,10],[38,11,39,11],[38,13,39,13],[38,17,39,17],[38,18,38,21],[39,5,39,8],[39,18,39,21],[34,4,34,8],[36,4,36,8],[36,10,37,10],[36,11,37,11],[36,13,37,13],[35,4,35,8],[31,4,31,8],[31,10,32,10],[31,11,32,11],[31,13,32,13],[22,4,22,8],[22,10,23,10],[22,11,23,11],[25,4,25,8],[26,4,26,8],[27,4,27,8],[27,10,28,10],[27,11,28,11],[28,22,29,23],[29,4,29,8],[29,10,30,10],[29,11,30,11],[29,13,30,13],[29,17,30,17],[29,18,29,21],[30,5,30,8],[30,18,30,21],[27,13,28,13],[17,5,17,8],[5,4,5,8],[16,4,16,8],[16,10,17,10],[14,17,15,17],[15,5,15,8],[14,10,15,10],[14,11,15,11],[31,17,32,17],[32,5,32,8],[27,17,28,17],[28,5,28,8],[18,4,18,8],[18,10,19,10],[18,11,19,11],[18,13,19,13],[18,17,19,17],[19,5,19,8],[20,4,20,8],[20,10,21,10],[20,11,21,11],[20,13,21,13],[20,17,21,17],[21,5,21,8],[6,17,7,17],[16,11,17,11],[16,13,17,13],[14,13,15,13],[8,18,8,21],[9,18,9,21],[6,10,7,10],[6,13,7,13],[8,13,9,13],[10,13,11,13],[12,13,13,13],[6,11,7,11],[16,17,17,17],[12,4,12,8],[4,4,4,8],[14,4,14,8],[6,4,6,8],[8,4,8,8],[3,23,4,23],[3,22,4,22],[7,22,8,23],[8,10,9,10],[8,11,9,11],[10,10,11,10],[10,11,11,11],[12,10,13,10],[12,11,13,11],[3,10,3,11],[8,17,9,17],[10,17,11,17],[12,17,13,17],[10,4,10,8],[7,5,7,8],[9,5,9,8],[11,5,11,8],[13,5,13,8],[3,18,3,21]]}
[{"$f":"D1&\"_\"&A2&\"_\"&TEXT(NOW(),\"DD-MMM-YYYY\")","v":"Child Find Best Practices_withEvidence_24-Feb-2022"},null,null,"Child Find Best Practices",null,null,null,null,null,null,null,null,null,null,null,null,null,null,null,null,null,null,null,null,null,{"$f":"E1&F1","v":""}]
["withEvidence",null,null,null,null,null,null,null,null,null,null,null,null,null,null,null,null,null,null,null,null,null,null,null,null,""]
[null,null,null,null,null,null,null,null,null,null,null,null,null,null,null,null,null,null,null,null,null,null,null,null,null,""]
[null,"Index",{"$f":"MID(CELL(\"Filename\",C1),FIND(\"]\",CELL(\"Filename\",C1))+1,255)","v":{"$error":"#VALUE!"}},null,null,null,null,null,null,null,"Rating",null,null,"Priority",null,null,null,null,null,null,null,null,null,null,null,""]
[null,{"$f":"IF(D5=\"\",\"\",IF(LEN(D5)>1,\"T-\"&\"BP\"&RIGHT(D5)&\"-0\",\"B-\"&MID(B3,3,3)&\"-\"&D5))","v":"T-BP1-0"},null,"Theme 1","Cross-Sector Collaboration",null,null,null,null,null,"Theme Rating: ",{"$f":"VLOOKUP(B5,ALLdata!A:H,8,FALSE)","v":0},null,null,null,null,{"$f":"IF(E5=\"Evidence:\",1,0)","v":0},null,null,null,null,null,null,null,null,{"$f":"E5&F5","v":"Cross-Sector Collaboration"},{"$f":"K5","v":"Theme Rating: "}]
[null,"",null,null,"The practices in this section focus on cross-sector collaboration to support states and Local Education Agencies (LEAs) in identifying young children who may be eligible for Part B services. Ongoing and effective collaborative relationships with local community agencies and early childhood programs supports the appropriate referral by families of young children to Part B. Effective collaborative relationships are those where there is ongoing communication and adherence to child find procedures.",null,null,null,null,null,null,null,null,null,null,null,1,null,null,null,null,null,null,null,null,"The practices in this section focus on cross-sector collaboration to support states and Local Education Agencies (LEAs) in identifying young children who may be eligible for Part B services. Ongoing and effective collaborative relationships with local community agencies and early childhood programs supports the appropriate referral by families of young children to Part B. Effective collaborative relationships are those where there is ongoing communication and adherence to child find procedures."]
[null,"B-BP1-a",null,"a","Leverage federal or state-funded early childhood systems initiatives and coordinate with collaborating agencies to promote child find awareness, screening, and referral efforts.",null,null,null,null,null,"Best Practice Rating:",null,null,null,null,null,0,null,null,null,null,null,null,null,null,"Leverage federal or state-funded early childhood systems initiatives and coordinate with collaborating agencies to promote child find awareness, screening, and referral efforts.",{"$f":"K7","v":"Best Practice Rating:"}]
[null,"",null,null,"Evidence:",null,null,null,null,null,null,null,null,null,null,null,1,null,null,null,null,null,null,null,null,"Evidence:"]
{"$rows_left_out":107}
{"sheet":"Theme Summary","index":4,"n_rows":33,"n_cols":30,"rows_kept":33,"cut":false,"hidden":false,"merged":[[30,2,30,8],[31,12,31,18],[32,2,32,8],[33,12,33,18],[19,12,19,18],[25,12,25,18],[26,2,26,8],[27,12,27,18],[28,2,28,8],[29,12,29,18],[20,2,20,8],[21,12,21,18],[22,2,22,8],[23,12,23,18],[24,2,24,8],[19,2,19,8],[7,2,7,8],[4,12,4,18],[0,26,0,28],[1,26,1,28],[0,21,0,24],[1,21,1,24],[0,19,2,19],[0,2,1,8],[1,9,1,18],[5,2,5,8],[3,2,3,8],[6,12,6,18],[8,12,8,18],[9,2,9,8],[11,2,11,8],[18,12,18,18],[16,12,16,18],[14,12,14,18],[12,12,12,18],[13,2,13,8],[15,2,15,8],[17,2,17,8],[10,12,10,18]]}
[null,null,"THEME SUMMARY",null,null,null,null,null,null,null,null,null,null,null,null,null,null,null,null,"Total # of Practices",null,"# of Practices in this theme",null,null,null,null,"# of Practices in this theme"]
[null,null,null,null,null,null,null,null,null,"Theme Rating",null,null,null,null,null,null,null,null,null,null,null,"with RATING…",null,null,null,null,"with PRIORITY…"]
[null,null,null,null,null,null,null,null,null,"Rating","Priority",null,1,2,3,4,5,6,7,null,null,1,2,3,4,null,"Low","Medium","High"]
[null,null,"Child Find Best Practices"]
[]
["T-BP1-0","BP 1",{"$f":"VLOOKUP(A6,ALLdata!A:F,6,FALSE)","v":"Cross-Sector Collaboration"},null,null,null,null,null,null,{"$f":"VLOOKUP(A6,ALLdata!A:H,8,FALSE)","v":0},{"$f":"VLOOKUP(A6,ALLdata!A:I,9,FALSE)","v":0},null,{"$f":"VLOOKUP($A6,ALLdata!$A:$I,8,FALSE)","v":0},{"$f":"VLOOKUP($A6,ALLdata!$A:$I,8,FALSE)","v":0},{"$f":"VLOOKUP($A6,ALLdata!$A:$I,8,FALSE)","v":0},{"$f":"VLOOKUP($A6,ALLdata!$A:$I,8,FALSE)","v":0},{"$f":"VLOOKUP($A6,ALLdata!$A:$I,8,FALSE)","v":0},{"$f":"VLOOKUP($A6,ALLdata!$A:$I,8,FALSE)","v":0},{"$f":"VLOOKUP($A6,ALLdata!$A:$I,8,FALSE)","v":0},{"$f":"COUNTIFS(ALLdata!B:B,\"BestPractice\",ALLdata!D:D,B6)","v":9},null,{"$f":"COUNTIFS(ALLdata!$B:$B,\"BestPractice\",ALLdata!$D:$D,$B6,ALLdata!$G:$G,V$3)","v":0},{"$f":"COUNTIFS(ALLdata!$B:$B,\"BestPractice\",ALLdata!$D:$D,$B6,ALLdata!$G:$G,W$3)","v":0},{"$f":"COUNTIFS(ALLdata!$B:$B,\"BestPractice\",ALLdata!$D:$D,$B6,ALLdata!$G:$G,X$3)","v":0},{"$f":"COUNTIFS(ALLdata!$B:$B,\"BestPractice\",ALLdata!$D:$D,$B6,ALLdata!$G:$G,Y$3)","v":0},null,{"$f":"COUNTIFS(ALLdata!$B:$B,\"BestPractice\",ALLdata!$D:$D,$B6,ALLdata!$I:$I,LEFT(AA$3))","v":0},{"$f":"COUNTIFS(ALLdata!$B:$B,\"BestPractice\",ALLdata!$D:$D,$B6,ALLdata!$I:$I,LEFT(AB$3))","v":0},{"$f":"COUNTIFS(ALLdata!$B:$B,\"BestPractice\",ALLdata!$D:$D,$B6,ALLdata!$I:$I,LEFT(AC$3))","v":0},{"$f":"IF(SUM(V6:Y6)=0,\"* Note: No BPs have been rated for this theme.\",\"\")","v":"* Note: No BPs have been rated for this theme."}]
[]
["T-BP2-0","BP 2",{"$f":"VLOOKUP(A8,ALLdata!A:F,6,FALSE)","v":"Identifying Children who are Underserved by Part B"},null,null,null,null,null,null,{"$f":"VLOOKUP(A8,ALLdata!A:H,8,FALSE)","v":0},{"$f":"VLOOKUP(A8,ALLdata!A:I,9,FALSE)","v":0},null,{"$f":"VLOOKUP($A8,ALLdata!$A:$I,8,FALSE)","v":0},{"$f":"VLOOKUP($A8,ALLdata!$A:$I,8,FALSE)","v":0},{"$f":"VLOOKUP($A8,ALLdata!$A:$I,8,FALSE)","v":0},{"$f":"VLOOKUP($A8,ALLdata!$A:$I,8,FALSE)","v":0},{"$f":"VLOOKUP($A8,ALLdata!$A:$I,8,FALSE)","v":0},{"$f":"VLOOKUP($A8,ALLdata!$A:$I,8,FALSE)","v":0},{"$f":"VLOOKUP($A8,ALLdata!$A:$I,8,FALSE)","v":0},{"$f":"COUNTIFS(ALLdata!B:B,\"BestPractice\",ALLdata!D:D,B8)","v":3},null,{"$f":"COUNTIFS(ALLdata!$B:$B,\"BestPractice\",ALLdata!$D:$D,$B8,ALLdata!$G:$G,V$3)","v":0},{"$f":"COUNTIFS(ALLdata!$B:$B,\"BestPractice\",ALLdata!$D:$D,$B8,ALLdata!$G:$G,W$3)","v":0},{"$f":"COUNTIFS(ALLdata!$B:$B,\"BestPractice\",ALLdata!$D:$D,$B8,ALLdata!$G:$G,X$3)","v":0},{"$f":"COUNTIFS(ALLdata!$B:$B,\"BestPractice\",ALLdata!$D:$D,$B8,ALLdata!$G:$G,Y$3)","v":0},null,{"$f":"COUNTIFS(ALLdata!$B:$B,\"BestPractice\",ALLdata!$D:$D,$B8,ALLdata!$I:$I,LEFT(AA$3))","v":0},{"$f":"COUNTIFS(ALLdata!$B:$B,\"BestPractice\",ALLdata!$D:$D,$B8,ALLdata!$I:$I,LEFT(AB$3))","v":0},{"$f":"COUNTIFS(ALLdata!$B:$B,\"BestPractice\",ALLdata!$D:$D,$B8,ALLdata!$I:$I,LEFT(AC$3))","v":0},{"$f":"IF(SUM(V8:Y8)=0,\"* Note: No BPs have been rated for this theme.\",\"\")","v":"* Note: No BPs have been rated for this theme."}]
{"$rows_left_out":26}
{"sheet":"Action Plan","index":5,"n_rows":257,"n_cols":17,"rows_kept":257,"cut":false,"hidden":false,"merged":[[7,1,26,1],[2,0,5,1],[6,0,11,0],[0,1,1,1],[3,14,3,16],[4,14,4,16],[3,8,4,12],[3,4,3,6],[4,4,4,6]]}
[null,"Action Plan"]
[]
[" jump to:"]
[null,null,null,null,"Planning Team Members",null,null,null,"Child Find Improvement Plan",null,null,null,null,null,"Stakeholder Involvement"]
[null,null,null,null,"State Child Find Planning Team Members, Role and Organization Represented",null,null,null,null,null,null,null,null,null,"Describe the stakeholders and how they will be involved in the self-assessment and improvement plan."]
[]
[null,null,null,null,"Child Find Planning Team Member","Role","Organization",null,"Outcomes of activities","Activities to improve Child Find","Resources Needed (fiscal, partners, personnel, materials)","Who Is Responsible ","Timeline (projected initiation & completion dates)",null,"Stakeholder(s)","How will they be involved?","Timeline"]
[null,"\nInstructions:\n\nFill out the charts to the right. Use as many rows as necessary.\n\nNOTE ON PRINTING: \nIf you would like to print, this page is set up to print each chart on its own page, going across.  You will want to print only the pages that have data in them - if you print this whole tab you may end up with many pages with no information.",1]
{"$rows_left_out":250}
{"sheet":"Data","index":6,"n_rows":54,"n_cols":14,"rows_kept":54,"cut":false,"hidden":false,"merged":[]}
["Index","Type","Component","ThemeNumber","BPNumber","Text","Rating","Priority","Date","Count_Expected","Count_Actual",null,null,"2021-11-22T13:31:20.330"]
["T-BP1-0","Theme","Collaboration","BP 1",0,"Cross-Sector Collaboration",0,0,"2021-11-22",9,0]
["T-BP2-0","Theme","Identification","BP 2",0,"Identifying Children who are Underserved by Part B",0,0,"2021-11-22",3,0]
["T-BP3-0","Theme","DataSystems","BP 3",0,"Data and Data Systems",4,0,"2021-11-22",10,6]
["T-BP4-0","Theme","Adequacy","BP 4",0,"Technical Adequacy of Screening Tools",0,0,"2021-11-22",7,0]
["T-BP5-0","Theme","Efficiency","BP 5",0,"Efficiency of Screening and Referral Process and Procedures",0,0,"2021-11-22",8,0]
["T-BP6-0","Theme","Ineligible","BP 6",0,"Responding When Children are Found Ineligible for Part B",0,0,"2021-11-22",3,0]
["T-BP7-0","Theme","Evaluation","BP 7",0,"Evaluation of Child Find",0,0,"2021-11-22",5,0]
{"$rows_left_out":47}
{"sheet":"Help","index":7,"n_rows":210,"n_cols":3,"rows_kept":210,"cut":false,"hidden":false,"merged":[[194,0,219,0],[194,1,195,1],[196,1,199,1],[200,1,205,1],[206,1,208,1],[209,1,219,1],[167,0,192,0],[167,1,168,1],[169,1,171,1],[172,1,176,1],[177,1,180,1],[181,1,184,1],[138,0,165,0],[138,1,139,1],[140,1,143,1],[144,1,165,1],[100,0,136,0],[100,1,101,1],[82,1,91,1],[92,1,93,1],[102,1,105,1],[106,1,135,1],[0,1,0,3],[1,2,1,3],[15,1,16,1],[17,1,18,1],[59,1,61,1],[21,1,23,1],[39,1,43,1],[79,1,81,1],[4,0,36,0],[4,1,5,1],[6,1,7,1],[9,1,10,1],[12,1,13,1]]}
[null,"Help!   Click a topic to view more information and some trouble-shooting ideas"]
[]
[]
[]
[null,"Enable Macros in Excel","For more on enabling macros, please see: https://powerspreadsheets.com/how-to-enablB-macros-excel/"]
[]
[null,"When you open this file, you should see a prompt at the top of the window to \"Enable Content.\""]
[]
{"$rows_left_out":203}
{"sheet":"ALLdata","index":8,"n_rows":61,"n_cols":18,"rows_kept":61,"cut":false,"hidden":true,"merged":[]}
["Index","Type","Component","QINumber","BestPracticeNumber","Text","BestPracticeRating","QIRating","Priority","Date","Count_Expected","Count_Actual",1,2,3,4,"Not Applicable","RatingToLookup"]
[{"$f":"\"T-\"&LEFT(D2,2)&RIGHT(D2)&\"-0\"","v":"T-BP1-0"},"Theme","Collaboration","BP 1",0,"Cross-Sector Collaboration","-",{"$f":"IF(L2<>0,VLOOKUP(R2,QIRatingLookup!A:B,2,FALSE),0)","v":0},{"$f":"IFERROR(VLOOKUP($A2,'Child Find Best Practices'!$B:$N,13,FALSE),\"\")","v":0},{"$f":"TODAY()","v":"2022-02-24"},{"$f":"COUNTIFS($B:$B,\"BestPractice\",$D:$D,$D2)","v":9},{"$f":"VALUE(M2)+VALUE(N2)+VALUE(O2)+VALUE(P2)+VALUE(Q2)","v":0},{"$f":"RIGHT(\"0\"&COUNTIFS($D:$D,$D2,$G:$G,M$1,$B:$B,\"BestPractice\"),2)","v":"00"},"00","00","00",null,{"$f":"M2&\"-\"&N2&\"-\"&O2&\"-\"&P2","v":"00-00-00-00"}]
["T-BP2-0","Theme","Identification","BP 2",0,"Identifying Children who are Underserved by Part B","-",{"$f":"IF(L3<>0,VLOOKUP(R3,QIRatingLookup!A:B,2,FALSE),0)","v":0},{"$f":"IFERROR(VLOOKUP($A3,'Child Find Best Practices'!$B:$N,13,FALSE),\"\")","v":0},{"$f":"TODAY()","v":"2022-02-24"},3,{"$f":"VALUE(M3)+VALUE(N3)+VALUE(O3)+VALUE(P3)+VALUE(Q3)","v":0},"00","00","00","00",null,{"$f":"M3&\"-\"&N3&\"-\"&O3&\"-\"&P3","v":"00-00-00-00"}]
["T-BP3-0","Theme","DataSystems","BP 3",0,"Data and Data Systems","-",{"$f":"IF(L4<>0,VLOOKUP(R4,QIRatingLookup!A:B,2,FALSE),0)","v":4},{"$f":"IFERROR(VLOOKUP($A4,'Child Find Best Practices'!$B:$N,13,FALSE),\"\")","v":0},"2022-02-24",10,{"$f":"VALUE(M4)+VALUE(N4)+VALUE(O4)+VALUE(P4)+VALUE(Q4)","v":6},"02","01","01","02",null,"02-01-01-02"]
["T-BP4-0","Theme","Adequacy","BP 4",0,"Technical Adequacy of Screening Tools","-",{"$f":"IF(L5<>0,VLOOKUP(R5,QIRatingLookup!A:B,2,FALSE),0)","v":0},{"$f":"IFERROR(VLOOKUP($A5,'Child Find Best Practices'!$B:$N,13,FALSE),\"\")","v":0},"2022-02-24",7,0,"00","00","00","00",null,"00-00-00-00"]
["T-BP5-0","Theme","Efficiency","BP 5",0,"Efficiency of Screening and Referral Process and Procedures","-",{"$f":"IF(L6<>0,VLOOKUP(R6,QIRatingLookup!A:B,2,FALSE),0)","v":0},{"$f":"IFERROR(VLOOKUP($A6,'Child Find Best Practices'!$B:$N,13,FALSE),\"\")","v":0},"2022-02-24",8,0,"00","00","00","00",null,"00-00-00-00"]
["T-BP6-0","Theme","Ineligible","BP 6",0,"Responding When Children are Found Ineligible for Part B","-",{"$f":"IF(L7<>0,VLOOKUP(R7,QIRatingLookup!A:B,2,FALSE),0)","v":0},{"$f":"IFERROR(VLOOKUP($A7,'Child Find Best Practices'!$B:$N,13,FALSE),\"\")","v":0},"2022-02-24",3,{"$f":"VALUE(M7)+VALUE(N7)+VALUE(O7)+VALUE(P7)+VALUE(Q7)","v":0},"00","00","00","00",null,{"$f":"M7&\"-\"&N7&\"-\"&O7&\"-\"&P7","v":"00-00-00-00"}]
["T-BP7-0","Theme","Evaluation","BP 7",0,"Evaluation of Child Find","-",{"$f":"IF(L8<>0,VLOOKUP(R8,QIRatingLookup!A:B,2,FALSE),0)","v":0},{"$f":"IFERROR(VLOOKUP($A8,'Child Find Best Practices'!$B:$N,13,FALSE),\"\")","v":0},"2022-02-24",5,0,"00","00","00","00",null,"00-00-00-00"]
{"$rows_left_out":54}
{"sheet":"QualityIndicators","index":9,"n_rows":8,"n_cols":2,"rows_kept":8,"cut":false,"hidden":true,"merged":[]}
["QualityIndicatorCode","QualityIndicatorText"]
["BP 1","Collaboration with primary referral sources"]
["BP 2","Identification of infants and toddlers who are underserved by Part C"]
["BP 3","Data Systems "]
["BP 4","Evaluation of Child Find"]
["BP 5","Technical Adequacy of Screening and Evaluation Tools"]
["BP 6","Efficiency of Screening, Referral, and Evaluation Process and Procedures"]
["BP 7","Responding to Children Found Ineligible for Early Intervention"]
{"$rows_left_out":1}
{"sheet":"QIRatingLookup","index":10,"n_rows":4846,"n_cols":12,"rows_kept":4846,"cut":false,"hidden":true,"merged":[]}
["Index","Rating",null,"Total","Number of 1s","Number of 2s","Number of 3s","Number of 4s","TEXT Number of 1s","TEXT Number of 2s","TEXT Number of 3s","TEXT Number of 4s"]
["INCOMPLETE",{"$f":"\"-\"","v":"-"}]
[{"$f":"I3&\"-\"&J3&\"-\"&K3&\"-\"&L3","v":"00-00-00-01"},7,null,1,0,0,0,1,{"$f":"IF(LEN(E3)=1,0&E3,IF(LEN(E3)=0,\"00\",RIGHT(E3,2)))","v":"00"},"00","00","01"]
[{"$f":"I4&\"-\"&J4&\"-\"&K4&\"-\"&L4","v":"00-00-01-00"},4,null,1,0,0,1,0,"00","00","01","00"]
[{"$f":"I5&\"-\"&J5&\"-\"&K5&\"-\"&L5","v":"00-01-00-00"},2,null,1,0,1,0,0,"00","01","00","00"]
[{"$f":"I6&\"-\"&J6&\"-\"&K6&\"-\"&L6","v":"01-00-00-00"},1,null,1,1,0,0,0,"01","00","00","00"]
[{"$f":"I7&\"-\"&J7&\"-\"&K7&\"-\"&L7","v":"00-00-00-02"},7,null,2,0,0,0,2,"00","00","00","02"]
["00-00-01-01",6,null,2,0,0,1,1,{"$f":"IF(LEN(E8)=1,0&E8,IF(LEN(E8)=0,\"00\",RIGHT(E8,2)))","v":"00"},{"$f":"IF(LEN(F8)=1,0&F8,IF(LEN(F8)=0,\"00\",RIGHT(F8,2)))","v":"00"},{"$f":"IF(LEN(G8)=1,0&G8,IF(LEN(G8)=0,\"00\",RIGHT(G8,2)))","v":"01"},{"$f":"IF(LEN(H8)=1,0&H8,IF(LEN(H8)=0,\"00\",RIGHT(H8,2)))","v":"01"}]
{"$rows_left_out":4839}
{"sheet":"ElementRatingScale","index":11,"n_rows":12,"n_cols":5,"rows_kept":12,"cut":false,"hidden":true,"merged":[]}
["Element Rating","Description",null,"Brief Element Description","Element Rating"]
[1,"No - element not in place and not planning to work on it at this time",null,1,1]
[2,"No - element not in place but planning to work on it or getting started",null,2,2]
[3,"Yes - element partially implemented",null,3,3]
[4,"Yes - element fully implemented",null,4,4]
[]
[null,null,null,"Brief Element Description Plus","Element Rating"]
["Priority Rating",null,null,1,1]
{"$rows_left_out":5}
{"sheet":"IndicatorRating","index":12,"n_rows":31,"n_cols":6,"rows_kept":31,"cut":false,"hidden":true,"merged":[[19,0,20,0],[1,0,2,0],[3,0,4,0],[5,0,9,0],[10,0,13,0],[14,0,16,0],[17,0,18,0],[28,5,28,6],[29,5,29,6],[30,5,30,6],[23,4,23,6],[24,5,24,6],[25,5,25,6],[26,5,26,6],[27,5,27,6]]}
["Quality Indicator Rating","Description"]
[1,"None of the elements are yet planned or in place.  "]
[null,"None of the elements are yet a 2 or higher."]
[2,"Most of the elements are not yet planned or in place. "]
[null,"Less than one half are 3’s; no 4’s. The rest are 1’s or 2’s."]
[3,"Some elements are in place, a few may be fully implemented."]
[null,"Half or less are 3s and 4s; or at least one is a 4."]
[null,"Does not have to have a 4."]
{"$rows_left_out":23}