{"text_format":"1","workbook":"xlsx","n_sheets":13,"sheets":["programmer documentation","Instructions","Table of Contents","Child Find Best Practices","Theme Summary","Action Plan","Data","Help","ALLdata","QualityIndicators","QIRatingLookup","ElementRatingScale","IndicatorRating"],"not_rendered":{"charts":0,"images":22,"macros":1,"external_links":2,"defined_names":17,"comments":1,"pivot_tables":0},"unopened":[],"bounds":{"document_bytes":16777216,"sheet_cells":100000,"rows_first":2000,"rows_last":500,"rows_between":2000,"halvings":0,"cell_chars":16384,"cell_head_chars":4096},"cells_cut":0,"cells_raw":0,"read":"whole","date_system":"1900"}

{"sheet":"programmer documentation","index":0,"n_rows":64,"n_cols":4,"rows_kept":64,"cut":false,"hidden":true,"merged":[[37,2,39,2],[47,2,48,2],[52,2,53,2],[49,2,50,2]]}
[]
[null,"Version","Action","Date Saved"]
[null,"v05","programmer documentation: Added this tab and this content. Including this statement. ;)","2018-06-22"]
[null,null,"Instructions: Updated Instructions (to include new content / icons)"]
[null,null,"Instructions: Verified printing layout"]
[null,null,"Table of Contents: minor formatting updating to make visually better"]
[null,null,"Child Find Best Practices: Added new item to Technical Adequacy of Screening and Evaluation Tools"]
[null,null,"ALLdata: Added new item to Technical Adequacy of Screening and Evaluation Tools"]
[null,null,"Child Find Best Practices: Added new item to Efficiency of Screening, Referral, and Evaluation Process and Procedures"]
[null,null,"ALLdata: Added new item to Efficiency of Screening, Referral, and Evaluation Process and Procedures"]
{"$rows_left_out":55}
{"sheet":"Instructions","index":1,"n_rows":246,"n_cols":8,"rows_kept":246,"cut":false,"hidden":false,"merged":[[60,2,60,4],[61,2,61,4],[55,2,55,4],[56,2,56,4],[57,2,57,4],[58,2,58,4],[59,2,59,4],[142,1,146,4],[148,1,149,4],[147,1,147,4],[138,1,139,4],[173,1,174,4],[150,1,154,4],[158,1,163,4],[167,1,172,4],[155,1,155,4],[156,1,157,4],[164,1,164,4],[165,1,166,4],[100,1,104,4],[82,1,90,4],[80,1,81,4],[140,1,141,4],[124,1,135,4],[136,1,137,4],[223,1,224,4],[177,1,182,4],[183,1,185,4],[192,1,192,4],[198,1,201,4],[216,1,220,4],[222,1,222,4],[186,1,190,4],[215,1,215,4],[202,1,202,4],[204,1,204,4],[205,1,213,4],[193,1,197,4],[1,3,3,4],[43,1,52,4],[42,1,42,4],[8,1,12,4],[13,1,17,4],[18,1,24,4],[5,1,5,4],[7,1,7,4],[6,1,6,4],[41,2,41,4],[25,2,25,4],[26,1,26,4],[27,1,40,4],[176,1,176,4],[123,1,123,4],[53,1,54,4],[109,1,111,4],[118,1,121,4],[112,1,117,4],[67,1,71,4],[76,1,79,4],[62,1,62,3],[105,1,108,4],[66,1,66,4],[64,1,64,4],[65,1,65,4],[72,1,75,4],[63,1,63,4],[91,1,98,4],[245,2,246,4],[242,1,243,4],[225,1,231,4],[232,1,234,4],[235,1,241,4]]}
[]
[null,null,null,"OSEP"]
[]
[]
[]
[null,"Child Find Section II: Child Find Best Practices"]
[null,null,null,null,null,null,null,"Instructions"]
[null,"Purpose",null,null,null,null,null,"Overview"]
[null,"The purpose of Section II of the Child Find Self-Assessment (CFSA) tool is to help states identify evidence-based practices to support their Child Find efforts. This section includes content that is not required by the IDEA, but can help Part C programs efficiently and effectively identify, locate, and evaluate infants and toddlers with disabilities and their families.  ",null,null,null,null,null,"There are 15 worksheets within the Self-Assessment workbooks, 11 of which are for rating the elements of quality: for each of the 5 ECTA components and the 6 Data subcomponents. The purpose of each worksheet is described below, as well as the instructions on how to use each."]
[]
{"$rows_left_out":237}
{"sheet":"Table of Contents","index":2,"n_rows":33,"n_cols":3,"rows_kept":33,"cut":false,"hidden":false,"merged":[[5,1,5,2],[21,1,21,2],[1,1,1,2],[25,1,25,2],[29,1,29,2],[3,1,3,2]]}
[]
[null,"Table of Contents"]
[]
[null,"Instructions"]
[]
[null,"Child Find Best Practices"]
[]
[null,null,"Collaboration with primary referral sources"]
[]
[null,null,"Identification of infants and toddlers who are underserved by Part C"]
{"$rows_left_out":24}
{"sheet":"Child Find Best Practices","index":3,"n_rows":107,"n_cols":27,"rows_kept":107,"cut":false,"hidden":false,"merged":[[94,17,95,17],[95,5,95,8],[0,3,1,5],[2,3,2,5],[3,4,3,5],[4,4,4,5],[5,4,5,5],[6,4,6,5],[7,4,7,5],[8,3,9,5],[23,17,24,17],[24,5,24,8],[26,4,26,8],[2,7,2,13],[3,8,3,13],[4,8,4,13],[12,4,12,8],[27,4,27,8],[28,4,28,8],[28,10,29,10],[28,11,29,11],[28,13,29,13],[23,4,23,8],[23,10,24,10],[10,18,10,21],[13,17,14,17],[15,17,16,17],[17,17,18,17],[19,17,20,17],[21,17,22,17],[15,18,15,21],[16,18,16,21],[13,10,14,10],[13,13,14,13],[15,13,16,13],[17,13,18,13],[19,13,20,13],[13,11,14,11],[10,23,11,23],[10,22,11,22],[14,22,15,23],[22,5,22,8],[15,10,16,10],[15,11,16,11],[17,10,18,10],[17,11,18,11],[19,10,20,10],[19,11,20,11],[21,10,22,10],[21,11,22,11],[19,4,19,8],[11,4,11,8],[21,4,21,8],[13,4,13,8],[15,4,15,8],[17,4,17,8],[14,5,14,8],[16,5,16,8],[18,5,18,8],[20,5,20,8],[9,10,10,11],[9,13,10,13],[23,11,24,11],[23,13,24,13],[21,13,22,13],[5,8,5,13],[6,8,6,13],[32,17,33,17],[33,5,33,8],[28,17,29,17],[29,5,29,8],[29,22,30,23],[30,4,30,8],[30,10,31,10],[30,11,31,11],[30,13,31,13],[30,17,31,17],[30,18,30,21],[31,5,31,8],[31,18,31,21],[35,4,35,8],[37,4,37,8],[37,10,38,10],[37,11,38,11],[37,13,38,13],[36,4,36,8],[32,4,32,8],[32,10,33,10],[32,11,33,11],[32,13,33,13],[37,17,38,17],[38,5,38,8],[38,22,39,23],[39,4,39,8],[39,10,40,10],[39,11,40,11],[39,13,40,13],[39,17,40,17],[39,18,39,21],[40,5,40,8],[40,18,40,21],[45,17,46,17],[46,5,46,8],[43,4,43,8],[43,10,44,10],[43,11,44,11],[43,13,44,13],[43,17,44,17],[44,5,44,8],[41,4,41,8],[41,10,42,10],[41,11,42,11],[41,13,42,13],[41,17,42,17],[42,5,42,8],[48,4,48,8],[50,4,50,8],[50,10,51,10],[50,11,51,11],[50,13,51,13],[49,4,49,8],[45,4,45,8],[45,10,46,10],[45,11,46,11],[45,13,46,13],[51,22,52,23],[52,4,52,8],[52,10,53,10],[52,11,53,11],[52,13,53,13],[52,17,53,17],[52,18,52,21],[53,5,53,8],[53,18,53,21],[56,17,57,17],[57,5,57,8],[54,4,54,8],[54,10,55,10],[54,11,55,11],[54,13,55,13],[54,17,55,17],[55,5,55,8],[50,17,51,17],[51,5,51,8],[59,4,59,8],[61,4,61,8],[61,10,62,10],[61,11,62,11],[61,13,62,13],[60,4,60,8],[56,4,56,8],[56,10,57,10],[56,11,57,11],[56,13,57,13],[61,17,62,17],[62,5,62,8],[62,22,63,23],[63,4,63,8],[63,10,64,10],[63,11,64,11],[63,13,64,13],[63,17,64,17],[63,18,63,21],[64,5,64,8],[64,18,64,21],[71,17,72,17],[72,5,72,8],[67,4,67,8],[67,10,68,10],[67,11,68,11],[67,13,68,13],[67,17,68,17],[68,5,68,8],[65,4,65,8],[65,10,66,10],[65,11,66,11],[65,13,66,13],[65,17,66,17],[66,5,66,8],[69,4,69,8],[69,10,70,10],[69,11,70,11],[69,13,70,13],[69,17,70,17],[70,5,70,8],[74,4,74,8],[76,4,76,8],[76,10,77,10],[76,11,77,11],[76,13,77,13],[75,4,75,8],[71,4,71,8],[71,10,72,10],[71,11,72,11],[71,13,72,13],[80,4,80,8],[80,10,81,10],[80,11,81,11],[80,13,81,13],[80,17,81,17],[81,5,81,8],[76,17,77,17],[77,5,77,8],[77,22,78,23],[78,4,78,8],[78,10,79,10],[78,11,79,11],[78,13,79,13],[78,17,79,17],[78,18,78,21],[79,5,79,8],[79,18,79,21],[84,4,84,8],[84,10,85,10],[84,11,85,11],[84,13,85,13],[84,17,85,17],[85,5,85,8],[82,4,82,8],[82,10,83,10],[82,11,83,11],[82,13,83,13],[82,17,83,17],[83,5,83,8],[92,17,93,17],[93,5,93,8],[88,4,88,8],[88,10,89,10],[88,11,89,11],[88,13,89,13],[88,17,89,17],[89,5,89,8],[86,4,86,8],[86,10,87,10],[86,11,87,11],[86,13,87,13],[86,17,87,17],[87,5,87,8],[90,4,90,8],[90,10,91,10],[90,11,91,11],[90,13,91,13],[90,17,91,17],[91,5,91,8],[97,4,97,8],[99,4,99,8],[99,10,100,10],[99,11,100,11],[99,13,100,13],[98,4,98,8],[92,4,92,8],[92,10,93,10],[92,11,93,11],[92,13,93,13],[94,4,94,8],[94,10,95,10],[94,11,95,11],[94,13,95,13],[99,17,100,17],[100,5,100,8],[100,22,101,23],[101,4,101,8],[101,10,102,10],[101,11,102,11],[101,13,102,13],[101,17,102,17],[101,18,101,21],[102,5,102,8],[102,18,102,21],[105,4,105,8],[105,10,106,10],[105,11,106,11],[105,13,106,13],[105,17,106,17],[106,5,106,8],[103,4,103,8],[103,10,104,10],[103,11,104,11],[103,13,104,13],[103,17,104,17],[104,5,104,8]]}
[{"$f":"D1&\"_\"&A2&\"_\"&TEXT(A3,\"DD-MMM-YYYY\")","v":"Child Find Best Practices_withEvidence_22-Feb-2019"},null,null,"Child Find Best Practices",null,null,null,null,null,null,null,null,null,null,null,null,null,null,null,null,null,null,null,null,null,{"$f":"E1&F1","v":""}]
["withEvidence",null,null,null,null,null,null,null,null,null,null,null,null,null,null,null,null,null,null,null,null,null,null,null,null,""]
[{"$f":"NOW()","v":"2019-02-22T10:22:51.500"},null,null,null,null,null,null,"Best Practice Rating (BPR)",null,null,null,null,null,null,null,null,null,null,null,null,null,null,null,null,null,""]
[null,null,null,null,null,null,null,1,"No - practice not in place and not planning to work on it at this time",null,null,null,null,null,null,null,null,null,null,null,null,null,null,null,null,""]
[null,null,null,null,null,null,null,2,"No - practice not in place but planning to work on it or getting started",null,null,null,null,null,null,null,null,null,null,null,null,null,null,null,null,""]
[null,null,null,null,null,null,null,3,"Yes - practice partially implemented",null,null,null,null,null,null,null,null,null,null,null,null,null,null,null,null,""]
[null,null,null,null,null,null,null,4,"Yes - practice fully implemented",null,null,null,null,null,null,null,null,null,null,null,null,null,null,null,null,""]
[null,null,null,null,null,null,null,null,null,null,null,null,null,null,null,null,null,null,null,null,null,null,null,null,null,""]
[null,null,null,"Child Find Best Practices",null,null,null,null,null,null,null,null,null,null,null,null,null,null,null,null,null,null,null,null,null,""]
[null,null,null,null,null,null,null,null,null,null,"Rating",null,null,"PRIORITY",null,null,null,null,null,null,null,null,null,null,null,""]
{"$rows_left_out":98}
{"sheet":"Theme Summary","index":4,"n_rows":33,"n_cols":30,"rows_kept":33,"cut":false,"hidden":false,"merged":[[8,12,8,18],[9,2,9,8],[11,2,11,8],[18,12,18,18],[16,12,16,18],[14,12,14,18],[12,12,12,18],[13,2,13,8],[15,2,15,8],[17,2,17,8],[10,12,10,18],[7,2,7,8],[4,12,4,18],[0,26,0,28],[1,26,1,28],[0,21,0,24],[1,21,1,24],[0,19,2,19],[0,2,1,8],[1,9,1,18],[5,2,5,8],[3,2,3,8],[6,12,6,18],[30,2,30,8],[31,12,31,18],[32,2,32,8],[33,12,33,18],[19,12,19,18],[25,12,25,18],[26,2,26,8],[27,12,27,18],[28,2,28,8],[29,12,29,18],[20,2,20,8],[21,12,21,18],[22,2,22,8],[23,12,23,18],[24,2,24,8],[19,2,19,8]]}
[null,null,"THEME SUMMARY",null,null,null,null,null,null,null,null,null,null,null,null,null,null,null,null,"Total # of Practices",null,"# of Practices in this theme",null,null,null,null,"# of Practices in this theme"]
[null,null,null,null,null,null,null,null,null,"Theme Rating",null,null,null,null,null,null,null,null,null,null,null,"with RATING…",null,null,null,null,"with PRIORITY…"]
[null,null,null,null,null,null,null,null,null,"Rating","Priority",null,1,2,3,4,5,6,7,null,null,1,2,3,4,null,"Low","Medium","High"]
[null,null,"Child Find Best Practices"]
[]
["Q-BP1-0","BP 1",{"$f":"VLOOKUP(A6,ALLdata!A:F,6,FALSE)","v":"Collaboration with primary referral sources"},null,null,null,null,null,null,{"$f":"VLOOKUP(A6,ALLdata!A:H,8,FALSE)","v":0},{"$f":"VLOOKUP(A6,ALLdata!A:I,9,FALSE)","v":0},null,{"$f":"VLOOKUP($A6,ALLdata!$A:$I,8,FALSE)","v":0},{"$f":"VLOOKUP($A6,ALLdata!$A:$I,8,FALSE)","v":0},{"$f":"VLOOKUP($A6,ALLdata!$A:$I,8,FALSE)","v":0},{"$f":"VLOOKUP($A6,ALLdata!$A:$I,8,FALSE)","v":0},{"$f":"VLOOKUP($A6,ALLdata!$A:$I,8,FALSE)","v":0},{"$f":"VLOOKUP($A6,ALLdata!$A:$I,8,FALSE)","v":0},{"$f":"VLOOKUP($A6,ALLdata!$A:$I,8,FALSE)","v":0},{"$f":"COUNTIFS(ALLdata!B:B,\"Element\",ALLdata!D:D,B6)","v":6},null,{"$f":"COUNTIFS(ALLdata!$B:$B,\"Element\",ALLdata!$D:$D,$B6,ALLdata!$G:$G,V$3)","v":0},{"$f":"COUNTIFS(ALLdata!$B:$B,\"Element\",ALLdata!$D:$D,$B6,ALLdata!$G:$G,W$3)","v":0},{"$f":"COUNTIFS(ALLdata!$B:$B,\"Element\",ALLdata!$D:$D,$B6,ALLdata!$G:$G,X$3)","v":0},{"$f":"COUNTIFS(ALLdata!$B:$B,\"Element\",ALLdata!$D:$D,$B6,ALLdata!$G:$G,Y$3)","v":0},null,{"$f":"COUNTIFS(ALLdata!$B:$B,\"Element\",ALLdata!$D:$D,$B6,ALLdata!$I:$I,LEFT(AA$3))","v":0},{"$f":"COUNTIFS(ALLdata!$B:$B,\"Element\",ALLdata!$D:$D,$B6,ALLdata!$I:$I,LEFT(AB$3))","v":0},{"$f":"COUNTIFS(ALLdata!$B:$B,\"Element\",ALLdata!$D:$D,$B6,ALLdata!$I:$I,LEFT(AC$3))","v":0},{"$f":"IF(SUM(V6:Y6)=0,\"* Note: No BPs have been rated for this theme.\",\"\")","v":"* Note: No BPs have been rated for this theme."}]
[]
["Q-BP2-0","BP 2",{"$f":"VLOOKUP(A8,ALLdata!A:F,6,FALSE)","v":"Identification of infants and toddlers who are underserved by Part C"},null,null,null,null,null,null,{"$f":"VLOOKUP(A8,ALLdata!A:H,8,FALSE)","v":0},{"$f":"VLOOKUP(A8,ALLdata!A:I,9,FALSE)","v":0},null,{"$f":"VLOOKUP($A8,ALLdata!$A:$I,8,FALSE)","v":0},{"$f":"VLOOKUP($A8,ALLdata!$A:$I,8,FALSE)","v":0},{"$f":"VLOOKUP($A8,ALLdata!$A:$I,8,FALSE)","v":0},{"$f":"VLOOKUP($A8,ALLdata!$A:$I,8,FALSE)","v":0},{"$f":"VLOOKUP($A8,ALLdata!$A:$I,8,FALSE)","v":0},{"$f":"VLOOKUP($A8,ALLdata!$A:$I,8,FALSE)","v":0},{"$f":"VLOOKUP($A8,ALLdata!$A:$I,8,FALSE)","v":0},{"$f":"COUNTIFS(ALLdata!B:B,\"Element\",ALLdata!D:D,B8)","v":3},null,{"$f":"COUNTIFS(ALLdata!$B:$B,\"Element\",ALLdata!$D:$D,$B8,ALLdata!$G:$G,V$3)","v":0},{"$f":"COUNTIFS(ALLdata!$B:$B,\"Element\",ALLdata!$D:$D,$B8,ALLdata!$G:$G,W$3)","v":0},{"$f":"COUNTIFS(ALLdata!$B:$B,\"Element\",ALLdata!$D:$D,$B8,ALLdata!$G:$G,X$3)","v":0},{"$f":"COUNTIFS(ALLdata!$B:$B,\"Element\",ALLdata!$D:$D,$B8,ALLdata!$G:$G,Y$3)","v":0},null,{"$f":"COUNTIFS(ALLdata!$B:$B,\"Element\",ALLdata!$D:$D,$B8,ALLdata!$I:$I,LEFT(AA$3))","v":0},{"$f":"COUNTIFS(ALLdata!$B:$B,\"Element\",ALLdata!$D:$D,$B8,ALLdata!$I:$I,LEFT(AB$3))","v":0},{"$f":"COUNTIFS(ALLdata!$B:$B,\"Element\",ALLdata!$D:$D,$B8,ALLdata!$I:$I,LEFT(AC$3))","v":0},{"$f":"IF(SUM(V8:Y8)=0,\"* Note: No BPs have been rated for this theme.\",\"\")","v":"* Note: No BPs have been rated for this theme."}]
[]
["Q-BP3-0","BP 3",{"$f":"VLOOKUP(A10,ALLdata!A:F,6,FALSE)","v":"Data Systems "},null,null,null,null,null,null,{"$f":"VLOOKUP(A10,ALLdata!A:H,8,FALSE)","v":0},{"$f":"VLOOKUP(A10,ALLdata!A:I,9,FALSE)","v":0},null,{"$f":"VLOOKUP($A10,ALLdata!$A:$I,8,FALSE)","v":0},{"$f":"VLOOKUP($A10,ALLdata!$A:$I,8,FALSE)","v":0},{"$f":"VLOOKUP($A10,ALLdata!$A:$I,8,FALSE)","v":0},{"$f":"VLOOKUP($A10,ALLdata!$A:$I,8,FALSE)","v":0},{"$f":"VLOOKUP($A10,ALLdata!$A:$I,8,FALSE)","v":0},{"$f":"VLOOKUP($A10,ALLdata!$A:$I,8,FALSE)","v":0},{"$f":"VLOOKUP($A10,ALLdata!$A:$I,8,FALSE)","v":0},{"$f":"COUNTIFS(ALLdata!B:B,\"Element\",ALLdata!D:D,B10)","v":5},null,{"$f":"COUNTIFS(ALLdata!$B:$B,\"Element\",ALLdata!$D:$D,$B10,ALLdata!$G:$G,V$3)","v":0},{"$f":"COUNTIFS(ALLdata!$B:$B,\"Element\",ALLdata!$D:$D,$B10,ALLdata!$G:$G,W$3)","v":0},{"$f":"COUNTIFS(ALLdata!$B:$B,\"Element\",ALLdata!$D:$D,$B10,ALLdata!$G:$G,X$3)","v":0},{"$f":"COUNTIFS(ALLdata!$B:$B,\"Element\",ALLdata!$D:$D,$B10,ALLdata!$G:$G,Y$3)","v":0},null,{"$f":"COUNTIFS(ALLdata!$B:$B,\"Element\",ALLdata!$D:$D,$B10,ALLdata!$I:$I,LEFT(AA$3))","v":0},{"$f":"COUNTIFS(ALLdata!$B:$B,\"Element\",ALLdata!$D:$D,$B10,ALLdata!$I:$I,LEFT(AB$3))","v":0},{"$f":"COUNTIFS(ALLdata!$B:$B,\"Element\",ALLdata!$D:$D,$B10,ALLdata!$I:$I,LEFT(AC$3))","v":0},{"$f":"IF(SUM(V10:Y10)=0,\"* Note: No BPs have been rated for this theme.\",\"\")","v":"* Note: No BPs have been rated for this theme."}]
{"$rows_left_out":24}
{"sheet":"Action Plan","index":5,"n_rows":257,"n_cols":17,"rows_kept":257,"cut":false,"hidden":false,"merged":[[7,1,26,1],[2,0,5,1],[6,0,11,0],[0,1,1,1],[3,14,3,16],[4,14,4,16],[3,8,4,12],[3,4,3,6],[4,4,4,6]]}
[null,"Action Plan"]
[]
[" jump to:"]
[null,null,null,null,"Planning Team Members",null,null,null,"Child Find Improvement Plan",null,null,null,null,null,"Stakeholder Involvement"]
[null,null,null,null,"State Child Find Planning Team Members, Role and Organization Represented",null,null,null,null,null,null,null,null,null,"Describe the stakeholders and how they will be involved in the self-assessment and improvement plan."]
[]
[null,null,null,null,"Child Find Planning Team Member","Role","Organization",null,"Outcomes of activities","Activities to improve Child Find","Resources Needed (fiscal, partners, personnel, materials)","Who Is Responsible ","Timeline (projected initiation & completion dates)",null,"Stakeholder(s)","How will they be involved?","Timeline"]
[null,"\nInstructions:\n\nFill out the charts to the right. Use as many rows as necessary.\n\nNOTE ON PRINTING: \nIf you would like to print, this page is set up to print each chart on its own page, going across.  You will want to print only the pages that have data in them - if you print this whole tab you may end up with many pages with no information.",1]
[null,null,2]
[null,null,3]
{"$rows_left_out":248}
{"sheet":"Data","index":6,"n_rows":47,"n_cols":14,"rows_kept":47,"cut":false,"hidden":false,"merged":[]}
["Index","Type","Component","ThemeNumber","BPNumber","Text","Rating","Priority","Date","Count_Expected","Count_Actual",null,null,"2019-02-06T14:19:14.370"]
["T-BP1-0","Theme","Collaboration","BP 1","-","Collaboration with primary referral sources","-","-","2019-02-06",6,0]
["T-BP2-0","Theme","Identification","BP 2","-","Identification of infants and toddlers who are underserved by Part C","-","-","2019-02-06",3,0]
["T-BP3-0","Theme","DataSystems","BP 3","-","Data Systems ","-","-","2019-02-06",5,0]
["T-BP4-0","Theme","Evaluation","BP 4","-","Evaluation of Child Find","-","-","2019-02-06",4,0]
["T-BP5-0","Theme","Adequacy","BP 5","-","Technical Adequacy of Screening and Evaluation Tools","-","-","2019-02-06",6,0]
["T-BP6-0","Theme","Efficiency","BP 6","-","Efficiency of Screening, Referral, and Evaluation Process and Procedures","-","-","2019-02-06",10,0]
["T-BP7-0","Theme","Ineligible","BP 7","-","Responding to Children Found Ineligible for Early Intervention","-","-","2019-02-06",4,0]
[]
["B-BP1-a","BestPractice","Collaboration","BP 1","a","Referral sources are provided with timely feedback including the status of the referral, outcomes of the referral, child engagement in services, and progress. ","-","-","2019-02-06"]
{"$rows_left_out":38}
{"sheet":"Help","index":7,"n_rows":199,"n_cols":13,"rows_kept":199,"cut":false,"hidden":false,"merged":[[4,0,36,0],[4,1,5,6],[6,1,7,6],[9,1,10,6],[12,1,13,6],[82,1,91,6],[92,1,93,6],[102,1,105,6],[106,1,126,6],[0,1,0,15],[1,1,1,2],[1,3,1,5],[1,6,1,8],[1,9,1,11],[15,1,16,6],[17,1,18,6],[59,1,61,6],[21,1,23,6],[39,1,43,6],[79,1,81,6],[1,12,1,14],[129,0,156,0],[129,1,130,6],[131,1,134,6],[135,1,156,6],[100,0,127,0],[100,1,101,6],[158,0,183,0],[158,1,159,6],[160,1,162,6],[163,1,167,6],[168,1,171,6],[172,1,175,6],[185,0,205,0],[185,1,186,6],[192,1,197,6],[187,1,191,6],[198,1,205,6]]}
[null,"Help!   Click a topic to view more information and some trouble-shooting ideas"]
[null,"Enable Macros",null,"Best Practices Buttons",null,null,"Entering Data",null,null,"Saving PDFs",null,null,"Data tab"]
[]
[]
[null,"Enable Macros in Excel",null,null,null,null,null,null,"For more on enabling macros, please see: https://powerspreadsheets.com/how-to-enable-macros-excel/"]
[]
[null,"When you open this file, you should see a prompt at the top of the window to \"Enable Content.\""]
[]
[]
[null,"If you see this button, click, \"Enable Content\" so that the macros will be allowed to work."]
{"$rows_left_out":190}
{"sheet":"ALLdata","index":8,"n_rows":54,"n_cols":18,"rows_kept":54,"cut":false,"hidden":true,"merged":[]}
["Index","Type","Component","QINumber","ElementNumber","Text","ElementRating","QIRating","Priority","Date","Count_Expected","Count_Actual",1,2,3,4,"Not Applicable","RatingToLookup"]
[{"$f":"\"Q-\"&LEFT(D2,2)&RIGHT(D2)&\"-0\"","v":"Q-BP1-0"},"QualityIndicator","Collaboration","BP 1",0,"Collaboration with primary referral sources","-",{"$f":"IF(L2<>0,VLOOKUP(R2,QIRatingLookup!A:B,2,FALSE),0)","v":0},{"$f":"IFERROR(VLOOKUP($A2,'Child Find Best Practices'!$B:$N,13,FALSE),\"\")","v":0},{"$f":"TODAY()","v":"2019-02-22"},{"$f":"COUNTIFS($B:$B,\"Element\",$D:$D,$D2)","v":6},{"$f":"VALUE(M2)+VALUE(N2)+VALUE(O2)+VALUE(P2)+VALUE(Q2)","v":0},{"$f":"IF(LEN(COUNTIFS($D:$D,$D2,$G:$G,M$1,$B:$B,\"Element\"))=1,\"0\",\"\")&COUNTIFS($D:$D,$D2,$G:$G,M$1,$B:$B,\"Element\")","v":"00"},"00","00","00",null,{"$f":"M2&\"-\"&N2&\"-\"&O2&\"-\"&P2","v":"00-00-00-00"}]
["Q-BP2-0","QualityIndicator","Identification","BP 2",0,"Identification of infants and toddlers who are underserved by Part C","-",{"$f":"IF(L3<>0,VLOOKUP(R3,QIRatingLookup!A:B,2,FALSE),0)","v":0},{"$f":"IFERROR(VLOOKUP($A3,'Child Find Best Practices'!$B:$N,13,FALSE),\"\")","v":0},{"$f":"TODAY()","v":"2019-02-22"},3,{"$f":"VALUE(M3)+VALUE(N3)+VALUE(O3)+VALUE(P3)+VALUE(Q3)","v":0},"00","00","00","00",null,{"$f":"M3&\"-\"&N3&\"-\"&O3&\"-\"&P3","v":"00-00-00-00"}]
["Q-BP3-0","QualityIndicator","DataSystems","BP 3",0,"Data Systems ","-",{"$f":"IF(L4<>0,VLOOKUP(R4,QIRatingLookup!A:B,2,FALSE),0)","v":0},{"$f":"IFERROR(VLOOKUP($A4,'Child Find Best Practices'!$B:$N,13,FALSE),\"\")","v":0},"2019-02-22",5,{"$f":"VALUE(M4)+VALUE(N4)+VALUE(O4)+VALUE(P4)+VALUE(Q4)","v":0},"00","00","00","00",null,"00-00-00-00"]
["Q-BP4-0","QualityIndicator","Evaluation","BP 4",0,"Evaluation of Child Find","-",{"$f":"IF(L5<>0,VLOOKUP(R5,QIRatingLookup!A:B,2,FALSE),0)","v":0},{"$f":"IFERROR(VLOOKUP($A5,'Child Find Best Practices'!$B:$N,13,FALSE),\"\")","v":0},"2019-02-22",4,0,"00","00","00","00",null,"00-00-00-00"]
["Q-BP5-0","QualityIndicator","Adequacy","BP 5",0,"Technical Adequacy of Screening and Evaluation Tools","-",{"$f":"IF(L6<>0,VLOOKUP(R6,QIRatingLookup!A:B,2,FALSE),0)","v":0},{"$f":"IFERROR(VLOOKUP($A6,'Child Find Best Practices'!$B:$N,13,FALSE),\"\")","v":0},"2019-02-22",6,0,"00","00","00","00",null,"00-00-00-00"]
["Q-BP6-0","QualityIndicator","Efficiency","BP 6",0,"Efficiency of Screening, Referral, and Evaluation Process and Procedures","-",{"$f":"IF(L7<>0,VLOOKUP(R7,QIRatingLookup!A:B,2,FALSE),0)","v":0},{"$f":"IFERROR(VLOOKUP($A7,'Child Find Best Practices'!$B:$N,13,FALSE),\"\")","v":0},"2019-02-22",10,{"$f":"VALUE(M7)+VALUE(N7)+VALUE(O7)+VALUE(P7)+VALUE(Q7)","v":0},"00","00","00","00",null,{"$f":"M7&\"-\"&N7&\"-\"&O7&\"-\"&P7","v":"00-00-00-00"}]
["Q-BP7-0","QualityIndicator","Ineligible","BP 7",0,"Responding to Children Found Ineligible for Early Intervention","-",{"$f":"IF(L8<>0,VLOOKUP(R8,QIRatingLookup!A:B,2,FALSE),0)","v":0},{"$f":"IFERROR(VLOOKUP($A8,'Child Find Best Practices'!$B:$N,13,FALSE),\"\")","v":0},"2019-02-22",4,0,"00","00","00","00",null,"00-00-00-00"]
[]
[]
{"$rows_left_out":45}
{"sheet":"QualityIndicators","index":9,"n_rows":8,"n_cols":2,"rows_kept":8,"cut":false,"hidden":true,"merged":[]}
["QualityIndicatorCode","QualityIndicatorText"]
["BP 1","Collaboration with primary referral sources"]
["BP 2","Identification of infants and toddlers who are underserved by Part C"]
["BP 3","Data Systems "]
["BP 4","Evaluation of Child Find"]
["BP 5","Technical Adequacy of Screening and Evaluation Tools"]
["BP 6","Efficiency of Screening, Referral, and Evaluation Process and Procedures"]
["BP 7","Responding to Children Found Ineligible for Early Intervention"]

{"sheet":"QIRatingLookup","index":10,"n_rows":4846,"n_cols":12,"rows_kept":4846,"cut":false,"hidden":true,"merged":[]}
["Index","Rating",null,"Total","Number of 1s","Number of 2s","Number of 3s","Number of 4s","TEXT Number of 1s","TEXT Number of 2s","TEXT Number of 3s","TEXT Number of 4s"]
["INCOMPLETE",{"$f":"\"-\"","v":"-"}]
[{"$f":"I3&\"-\"&J3&\"-\"&K3&\"-\"&L3","v":"00-00-00-01"},7,null,1,0,0,0,1,{"$f":"IF(LEN(E3)=1,0&E3,IF(LEN(E3)=0,\"00\",RIGHT(E3,2)))","v":"00"},"00","00","01"]
[{"$f":"I4&\"-\"&J4&\"-\"&K4&\"-\"&L4","v":"00-00-01-00"},4,null,1,0,0,1,0,"00","00","01","00"]
[{"$f":"I5&\"-\"&J5&\"-\"&K5&\"-\"&L5","v":"00-01-00-00"},2,null,1,0,1,0,0,"00","01","00","00"]
[{"$f":"I6&\"-\"&J6&\"-\"&K6&\"-\"&L6","v":"01-00-00-00"},1,null,1,1,0,0,0,"01","00","00","00"]
[{"$f":"I7&\"-\"&J7&\"-\"&K7&\"-\"&L7","v":"00-00-00-02"},7,null,2,0,0,0,2,"00","00","00","02"]
["00-00-01-01",6,null,2,0,0,1,1,{"$f":"IF(LEN(E8)=1,0&E8,IF(LEN(E8)=0,\"00\",RIGHT(E8,2)))","v":"00"},{"$f":"IF(LEN(F8)=1,0&F8,IF(LEN(F8)=0,\"00\",RIGHT(F8,2)))","v":"00"},{"$f":"IF(LEN(G8)=1,0&G8,IF(LEN(G8)=0,\"00\",RIGHT(G8,2)))","v":"01"},{"$f":"IF(LEN(H8)=1,0&H8,IF(LEN(H8)=0,\"00\",RIGHT(H8,2)))","v":"01"}]
["00-00-02-00",4,null,2,0,0,2,0,"00","00","02","00"]
["00-01-00-01",5,null,2,0,1,0,1,"00","01","00","01"]
{"$rows_left_out":4837}
{"sheet":"ElementRatingScale","index":11,"n_rows":12,"n_cols":5,"rows_kept":12,"cut":false,"hidden":true,"merged":[]}
["Element Rating","Description",null,"Brief Element Description","Element Rating"]
[1,"No - element not in place and not planning to work on it at this time",null,1,1]
[2,"No - element not in place but planning to work on it or getting started",null,2,2]
[3,"Yes - element partially implemented",null,3,3]
[4,"Yes - element fully implemented",null,4,4]
[]
[null,null,null,"Brief Element Description Plus","Element Rating"]
["Priority Rating",null,null,1,1]
["L","Low",null,2,2]
["M","Medium",null,3,3]
{"$rows_left_out":3}
{"sheet":"IndicatorRating","index":12,"n_rows":31,"n_cols":6,"rows_kept":31,"cut":false,"hidden":true,"merged":[[28,5,28,6],[29,5,29,6],[30,5,30,6],[23,4,23,6],[24,5,24,6],[25,5,25,6],[26,5,26,6],[27,5,27,6],[19,0,20,0],[1,0,2,0],[3,0,4,0],[5,0,9,0],[10,0,13,0],[14,0,16,0],[17,0,18,0]]}
["Quality Indicator Rating","Description"]
[1,"None of the elements are yet planned or in place.  "]
[null,"None of the elements are yet a 2 or higher."]
[2,"Most of the elements are not yet planned or in place. "]
[null,"Less than one half are 3’s; no 4’s. The rest are 1’s or 2’s."]
[3,"Some elements are in place, a few may be fully implemented."]
[null,"Half or less are 3s and 4s; or at least one is a 4."]
[null,"Does not have to have a 4."]
[null,"This is the lowest score with one 4."]
[null,"This is the highest score if no 4."]
{"$rows_left_out":21}