{"text_format":"1","workbook":"xlsx","n_sheets":13,"sheets":["programmer documentation","Instructions","Table of Contents","Child Find Best Practices","Theme Summary","Action Plan","Data","Help","ALLdata","QualityIndicators","QIRatingLookup","ElementRatingScale","IndicatorRating"],"not_rendered":{"charts":0,"images":22,"macros":1,"external_links":2,"defined_names":17,"comments":1,"pivot_tables":0},"unopened":[],"bounds":{"document_bytes":16777216,"sheet_cells":100000,"rows_first":2000,"rows_last":500,"rows_between":2000,"halvings":0,"cell_chars":16384,"cell_head_chars":4096},"cells_cut":0,"cells_raw":0,"read":"whole","date_system":"1900"}

{"sheet":"programmer documentation","index":0,"n_rows":64,"n_cols":4,"rows_kept":64,"cut":false,"hidden":true,"merged":[[37,2,39,2],[47,2,48,2],[52,2,53,2],[49,2,50,2]]}
[]
[null,"Version","Action","Date Saved"]
[null,"v05","programmer documentation: Added this tab and this content. Including this statement. ;)","2018-06-22"]
[null,null,"Instructions: Updated Instructions (to include new content / icons)"]
[null,null,"Instructions: Verified printing layout"]
[null,null,"Table of Contents: minor formatting updating to make visually better"]
[null,null,"Child Find Best Practices: Added new item to Technical Adequacy of Screening and Evaluation Tools"]
[null,null,"ALLdata: Added new item to Technical Adequacy of Screening and Evaluation Tools"]
[null,null,"Child Find Best Practices: Added new item to Efficiency of Screening, Referral, and Evaluation Process and Procedures"]
[null,null,"ALLdata: Added new item to Efficiency of Screening, Referral, and Evaluation Process and Procedures"]
[null,null,"Child Find Best Practices: Added small icons for Zika, Opiod, Maltreatment"]
[null,null,"Theme Summary: Corrected erroneous formulae in columns V:AC"]
[null,null,"Action Plan: Added new tab for more data collection"]
[null,null,"VBA code edit: tweaked code to remove bonus rows (from unused tabs) in \"Get Data\" macro"]
[null,null,"Instructions: Added \"DRAFT\" watermark (&[Picture] in header)"]
[null,null,"Table of Contents: Added \"DRAFT\" watermark (&[Picture] in header)"]
[null,null,"Child Find Best Practices: Added \"DRAFT\" watermark (&[Picture] in header)"]
[null,null,"Theme Summary: Added \"DRAFT\" watermark (&[Picture] in header)"]
[null,null,"Data: Added \"DRAFT\" watermark (&[Picture] in header)"]
[null,null,"Action Plan: Added \"DRAFT\" watermark (&[Picture] in header)"]
[]
[null,"v06","Action Plan: Reformatted, added links to jump to page sections and increased numbers of lines to enter text","2018-06-26"]
[null,null,"Action Plan: Moved page so that it's after the ThemeSummary tab"]
[null,null,"Instructions: Updated \"Data\" section to include a note about enabling macros and content."]
[null,null,"programmer documentation: Hid this tab ;)"]
[null,null,"Table of Contents: added content to reflect all tabs visible to user"]
[null,null,"misc: there were a bunch of extra pages of tabs (for a different set up?) that I deleted"]
[null,null,"misc: updated headers and printer settings to allow better printing (incl date-stamping printed pages)"]
[]
[null,"v07","Table of Contents: added hyperlinks to Best Practices","2018-09-05"]
[null,null,"Child Find Best Practices: added pdf buttons that call the Show/Hide Evidence so cells re-fitted for long text"]
[null,null,"Child Find Best Practices: upgraded appearance of Hide/Show Evidence buttons and ToC button"]
[null,null,"Instructions: rows 36-42 - added hyperlinks to Best Practices"]
[null,null,"Theme Summary: upgraded appearance of ToC button"]
[null,null,"ALLdata: added DefinedName \"Priorities\" which is built from all \"H\" priority best practices (red and purple font)"]
[null,null,"Action Plan: added High Priority Practices as a display always (left column) AND as a popup from button-click"]
[]
[null,"v09","Instructions: Added detailed instructions about printing each tab. Also made all changes from [https://docs.google.com/spreadsheets/d/1PMu1QgySxhfIDIhG4-hTWUOxnOvUeBO8I2aWczT_K4I/edit#gid=0]. Deleted a number of blank rows the bottom of the instructions so that scroll bar would correspond with text.","2018-09-18"]
[]
[]
[null,null,"misc: Added macro to resize rows in Action Plan. Added a \"Clear Data\" macro and a \"Sample Data\" macro. Buttons top of this page."]
[null,null,"Action Plan: Changed all rows in table so that they were not longer merged (so they resize automatically). Added resize button."]
[null,null,"Data: reset print area (there were a number of blank rows referenced)"]
[null,null,"ALLdata: changed Bs: 2b, 2c, 2a, 6d"]
[]
[null,"v10","Evelyn edits from email on Instructions","2018-09-18"]
[]
[null,"v11","ALLdata: Edited BP1-d (reworded). Mod to BP Ratings so that they do NOT have to be based on a complete set of individual BPs but will give an overall rating anyway.","2019-01-30"]
[]
[null,null,"Mod to pdf macro to include date in filename. \nOn printed pages also cleaned up headers to reference Feb 2019 instead of July 2018"]
[]
[null,null,"Help: Created Help tab with a few help topics."]
[null,null,"Theme Summary: moved ToC arrow, expanded column header for Theme Summary, and added notes to the right to alert the user that a theme hasn't been rated if no individual BPs are rated."]
[]
[null,null,"Changed \"Get Data\" buttons from ugly gray to the expected light yellow with blue font."]
[null,null,"Data: macros clean up \"Quality Indicator\" and \"Element\" references and make them \"Theme\" and \"Best Practices\""]
[]
[null,"v12","Margaret Gillis revised \"some text\" in Instructions and in Help (not sure what was done, though)","2019-02-06"]
[null,null,"AllData: Added BP6:j to chart."]
[null,null,"Child Find Best Practices: Added BP6:j to list "]
[null,null,"macro code: updated to adjust rows pasted from ALLData to \"Data\" when that button is clicked (macro is activated)"]
[]
[null,"v13","Instructions: Changed \"Indian\" to \"Native American\" under \"Special Populations\"","2019-02-22"]
[null,null,"Removed watermark (throughout)"]

{"sheet":"Instructions","index":1,"n_rows":246,"n_cols":8,"rows_kept":246,"cut":false,"hidden":false,"merged":[[60,2,60,4],[61,2,61,4],[55,2,55,4],[56,2,56,4],[57,2,57,4],[58,2,58,4],[59,2,59,4],[142,1,146,4],[148,1,149,4],[147,1,147,4],[138,1,139,4],[173,1,174,4],[150,1,154,4],[158,1,163,4],[167,1,172,4],[155,1,155,4],[156,1,157,4],[164,1,164,4],[165,1,166,4],[100,1,104,4],[82,1,90,4],[80,1,81,4],[140,1,141,4],[124,1,135,4],[136,1,137,4],[223,1,224,4],[177,1,182,4],[183,1,185,4],[192,1,192,4],[198,1,201,4],[216,1,220,4],[222,1,222,4],[186,1,190,4],[215,1,215,4],[202,1,202,4],[204,1,204,4],[205,1,213,4],[193,1,197,4],[1,3,3,4],[43,1,52,4],[42,1,42,4],[8,1,12,4],[13,1,17,4],[18,1,24,4],[5,1,5,4],[7,1,7,4],[6,1,6,4],[41,2,41,4],[25,2,25,4],[26,1,26,4],[27,1,40,4],[176,1,176,4],[123,1,123,4],[53,1,54,4],[109,1,111,4],[118,1,121,4],[112,1,117,4],[67,1,71,4],[76,1,79,4],[62,1,62,3],[105,1,108,4],[66,1,66,4],[64,1,64,4],[65,1,65,4],[72,1,75,4],[63,1,63,4],[91,1,98,4],[245,2,246,4],[242,1,243,4],[225,1,231,4],[232,1,234,4],[235,1,241,4]]}
[]
[null,null,null,"OSEP"]
[]
[]
[]
[null,"Child Find Section II: Child Find Best Practices"]
[null,null,null,null,null,null,null,"Instructions"]
[null,"Purpose",null,null,null,null,null,"Overview"]
[null,"The purpose of Section II of the Child Find Self-Assessment (CFSA) tool is to help states identify evidence-based practices to support their Child Find efforts. This section includes content that is not required by the IDEA, but can help Part C programs efficiently and effectively identify, locate, and evaluate infants and toddlers with disabilities and their families.  ",null,null,null,null,null,"There are 15 worksheets within the Self-Assessment workbooks, 11 of which are for rating the elements of quality: for each of the 5 ECTA components and the 6 Data subcomponents. The purpose of each worksheet is described below, as well as the instructions on how to use each."]
[]
[]
[]
[]
[null,"It is recommended that states review additional information about the efficiency and effectiveness of their Child Find systems and engage stakeholders in identifying root causes of any identified inefficiency or ineffectiveness. Compeleting the CFSA at regular timepoints can also allow States to track progress resulting from improvement activities.",null,null,null,null,null,0]
[]
[]
[]
[]
[null,"It is also recommended that states complete the first section of this tool, Section I:  Regulatory Requirements Specific to Child Find, before completing this section because Section I describes the required elements of a Comprehensive Child Find System. Completing Section I before Section II may help states identify areas for improvement in implementing regulations related to Child Find and may result in states identifying additional areas for improvement."]
[]
[]
[]
[]
[]
[]
[]
[null,"Who Completes the Self-Assessment?"]
[null,"The CFSA should be completed by individuals within the state Part C agency with knowledge of child find efforts, in collaboration with other individuals within and outside the agency, including collaborating organizations, agencies, and offices, and local programs. Space is provided in the Action Plan tab to document the names, roles, and organizations for those completing the self-assessment and action plan. It is important to note that for some of the best practices the Part C agency may not be the responsible entity. For example, best practice 6h describes referral and eligibility of children exposed to Zika virus. Determination of Zika exposure and referral to Part C would be the responsibility of physicians' offices, a primary referral source. In addition, pre-referral strategies (e.g. supporting families’ understanding of typical child behavior, developmental milestones, or the screening process) and universal screening may also be done by other entities, such as physicians' offices or Early Head Start. It will be helpful to have individuals representing those organizations involved with the self-assessment and planning to understand the true scope of child find activities within the state."]
[]
[]
[]
[]
[]
[]
[]
[]
[]
[]
[]
[]
[]
[]
[null,"Considerations"]
[null,"It is important to recognize that the outcome of improving a state Child Find system may to improve the efficiency of the child find process. Improvement activities targeting the efficiency of the process include: 1) ensuring that eligibility assessments are not conducted on children with diagnosed physical or mental conditions that have a high probability of leading to developmental delay and 2) improving the quality of referrals from primary referral sources so that children referred are likely to be found eligible.  States should ensure that efforts to improve child find are integrated with other statewide improvement efforts like the State Systemic Improvement Plans (SSIP).  Additionally, as with all Part C activities, respectful and appropriate communication with families is essential. "]
[]
[]
[]
[]
[]
[]
[]
[]
[]
[null,"This document groups best practices (BPs) by themes.  The themes covered in this document include:"]
[]
[null,null,"BP1 – Collaboration with primary referral sources"]
[null,null,"BP2 – Identification of infants and toddlers who are underserved by Part C"]
[null,null,"BP3 – Data systems "]
[null,null,"BP4 – Evaluation of child find "]
[null,null,"BP5 – Technical adequacy of screening and evaluation tools"]
[null,null,"BP6 – Efficiency of screening, referral, and evaluation processes and procedures"]
[null,null,"BP7 – Responding to children found ineligible for early intervention  "]
[]
[null,"Table of Contents",null,null,null,null,null,0]
[null,"This sheet lists all the themes in Section II of the CFSA. ",null,null,null,null,null,"Table of Contents"]
[null,null,null,null,null,null,null,"An alternative to using the links is simply to click on the worksheet tab at the bottom of the document."]
[null,"Child Find Best Practices Rating Worksheet",null,null,null,null,null,0]
[null,"Best Practices Ratings:  The worksheet titled Child Find Best Practices includes each theme and the associated BPs and is used to rate the BPs. Use the Best Practice Rating Scale to identify the rating that most appropriately describes the state’s implementation of each BP. The scale includes the following four options:",null,null,null,null,null,"Element Rating Worksheets"]
[]
[]
[]
[]
[null,"1 – No - practice not in place and not planning to work on it at this time\n2 – No - practice not in place but planning to work on it or getting started\n3 – Yes - practice partially implemented\n4 – Yes - practice fully implemented"]
[]
[]
[]
[null,"In the Rating column, provide the rating for each BP by entering the number (1 to 4) or by selecting the value from the dropdown list. The Best Practice Rating Scale is also presented at the top of the worksheet directly above the rating column.",null,null,null,null,null,"Element ratings:  Each of these 11 worksheets are used to rate the elements of quality (EQs) for each component/subcomponent.  The elements are organized by Quality Indicator (QI)."]
[]
[]
[]
[null,"It is not expected that states will be implementing every best practice, so ratings of 1 can be expected. "]
[]
[null,"As ratings for the BPs in a theme are entered, the theme rating is automatically calculated and displayed in the row for the respective theme (in the light blue cell). The theme summary rating represents the status of implementation of the BPs rated for each theme, based on the number of BPs that are not planned or in place, partially implemented, and fully implemented. This provides a high level view of each best practice theme. You can also assign a priority (high, medium, low) to the theme. A low BP rating and high priority rating suggests the best practice may be an area to focus improvement activities. However, there may be additional room for improvement for BPs with high ratings. ",null,null,null,null,null,"In the Rating column, enter the rating for each element by entering the number (1 to 4) or by selecting the value from the dropdown list.  The Elements of Quality Rating scale, 1 to 4, is presented at the top left and further explained in the self-assessment guidance document."]
[]
[]
[]
[]
[]
[]
[]
[]
[null,"Evidence:  Immediately below each BP is a text box (shaded light yellow) for documenting the evidence for the BP.  The text box will expand to the needed length. The evidence box is used to document your policies and procedures related to each best practice, providing support for your rating. This information is particularly helpful for tracking progress over time. In the evidence box you may include text from, links to, and/or comments about policies and procedures. This may include policies and procedures of agencies, organizations, or offices with whom Part C collaborates to conduct child find activities.",null,null,null,null,null,"Once all elements for a QI are entered, the QI rating is automatically calculated and displayed in the row for the respective QI (in the light blue cell)."]
[]
[]
[]
[]
[]
[]
[]
[]
[null,"There are two buttons at the top of the worksheet labeled “Show Evidence” and “Hide Evidence”. Clicking “Show Evidence” will resize the rows and display all the evidence; clicking “Hide Evidence” will hide all the evidence rows. Thus, the Child Find Best Practices Rating worksheet may be viewed and/or printed with or without the evidence displayed.",null,null,null,null,null,"Evidence:  Immediately below each element is a text box (shaded light orange) that can be used to document the evidence for the element.  The text box will expand to the needed length."]
[]
[]
[]
[]
[null,"Priority:  To the right of the Rating column is a column for indicating the priority of each BP and theme. The priority ratings can help states identify which BPs or themes should be the focus of their Child Find efforts. The priority scale includes the following three options:",null,null,null,null,null,"Also notice that there is a link back to the Table of Contents."]
[]
[]
[]
[null,"H – High\nM – Medium\nL – Low"]
[]
[]
[null,"In the Priority column, provide the priority rating for each BP and theme by entering the letter (H, M, or L in lower or upper case) or by selecting the letter from the dropdown list. The priority ratings are optional, and this column may be left blank. A list of the BPs marked as high priority is available in the Action Plan tab. Click \"Show High Priority BPs\" in the action plan tab to view the list. ",null,null,null,null,null,"Priority:  To the right of each cell for the element and QI rating is a cell to indicate the Priority of each element and QI.  The Priority rating is an optional feature and may be used for planning which elements or QIs to work on.  The Priority options are high, medium or low, or may be left blank.   "]
[]
[]
[]
[]
[]
[null,"It is recommended that states first enter the Best Practice Ratings for all themes that will be completed, and then go back and assign the priority ratings. This allows stakeholders to get an overall view of strengths and areas of need across multiple themes and BPs. ",null,null,null,null,null,"Priority:  To the right of each cell for the element and QI rating is a cell to indicate the Priority of each element and QI.  The Priority rating is an optional feature and may be used for planning which elements or QIs to work on.  The Priority options are high, medium or low, or may be left blank.   "]
[]
[]
[]
[null,null,null,null,null,null,null,0]
[null,"Special Child Find Populations"]
[null,"As noted in Section I, the regulations include mention of several specific populations of children to ensure all children who are potentially eligible for Part C services are identified and evaluated. These populations include children who are homeless, are wards of the state, and live in Native American tribal communities. Ratings for the BPs in Section II should consider inclusion of these populations. In addition, increases of the numbers of children who are potentially eligible for services due to exposure to Zika infection, child maltreatment, and opioid or other substance exposure have made these special populations of interest for consideration in child find efforts. Increased risk of delay or disability associated with Zika virus, child maltreatment, and opioid or substance exposure means infants and toddlers in these populations may qualify for services due to identified delays or risk factors. Section II provides additional support for child find activities for these three special populations:",null,null,null,null,null,"This sheet lists all of the data elements recommended for a Part C or 619 data system, as presented in element a of QI.4 in the System Design and Development subcomponent.  Choose yes or no to indicate whether your state data system contains each data element.  The table at the top of the page will then display the number and percentage of data elements overall, and by type of data (child-level, service provider/teacher-level, and EIS program/LEA-level)."]
[]
[]
[]
[]
[]
[]
[]
[]
[]
[]
[]
[null,"1 Children who have been maltreated",null,null,null,null,null,"QI Summary"]
[null,null,null,null,null,null,null,"The QI Summary tab displays a summary of the QI ratings for each of those completed.  "]
[null,"Children with opioid or other substance exposure",null,null,null,null,null,"QI Summary"]
[null,null,null,null,null,null,null,"The QI Summary tab displays a summary of the QI ratings for each of those completed.  "]
[null,"Children exposed to Zika infection ",null,null,null,null,null,"QI Summary"]
[null,null,null,null,null,null,null,"The QI Summary tab displays a summary of the QI ratings for each of those completed.  "]
[null,"Each of these populations is described briefly below with some considerations. In the worksheet, BPs that are especially relevant for Child Find activities related to each of these populations are indicated with the logos shown above. For these BPs, consider policies and procedures that ensure children in these populations are identified, evaluated, and enrolled. ",null,null,null,null,null,"The QI ratings are displayed in column M, and the QI priority, if selected, is displayed in column N.  The red, yellow or green horizontal bars graphically depict the QI rating.  "]
[]
[]
[]
[]
[null,"Children who have been maltreated",null,null,null,null,null,"The QI ratings are displayed in column M, and the QI priority, if selected, is displayed in column N.  The red, yellow or green horizontal bars graphically depict the QI rating.  "]
[null,"Children who have experienced abuse and neglect are at increased risk of developmental delay and may be eligible for early intervention services. ",null,null,null,null,null,"The QI ratings are displayed in column M, and the QI priority, if selected, is displayed in column N.  The red, yellow or green horizontal bars graphically depict the QI rating.  "]
[]
[null,"Considerations for this population include collaboration with primary referral sources, particularly social services; linked data systems; universal screening of children in cases of substantiated maltreatment; and referral to community agencies for children who are ineligible for early intervention services. ",null,null,null,null,null,"The QI ratings are displayed in column M, and the QI priority, if selected, is displayed in column N.  The red, yellow or green horizontal bars graphically depict the QI rating.  "]
[]
[]
[]
[]
[null,"Children with opioid or other substance exposure",null,null,null,null,null,"The QI ratings are displayed in column M, and the QI priority, if selected, is displayed in column N.  The red, yellow or green horizontal bars graphically depict the QI rating.  "]
[null,"Children who were prenatally exposed to opioids or other substances may express characteristics such as cognitive or motor delays, hyperactivity, ",null,null,null,null,null,"The QI ratings are displayed in column M, and the QI priority, if selected, is displayed in column N.  The red, yellow or green horizontal bars graphically depict the QI rating.  "]
[]
[null,"behavior disorders, attention deficit disorder, aggressiveness, delays in social emotional skills or engagement, or failure to thrive. Early intervention can mitigate these risks if children are identified, found eligible, and enrolled in services or referred to other agencies for services when found ineligible. Considerations for this population include coordinated referral and developmental monitoring, as well as referrals to other programs and services. ",null,null,null,null,null,"The QI ratings are displayed in column M, and the QI priority, if selected, is displayed in column N.  The red, yellow or green horizontal bars graphically depict the QI rating.  "]
[]
[]
[]
[]
[]
[null,"Children who have been exposed to Zika infection",null,null,null,null,null,"The QI ratings are displayed in column M, and the QI priority, if selected, is displayed in column N.  The red, yellow or green horizontal bars graphically depict the QI rating.  "]
[null,"Congenital Zika infection can cause brain abnormalities, such as microcephaly; eye anomalies; and other neurologic conditions. As a result, children with ",null,null,null,null,null,"The QI ratings are displayed in column M, and the QI priority, if selected, is displayed in column N.  The red, yellow or green horizontal bars graphically depict the QI rating.  "]
[]
[null,"congenital Zika infection are at risk for developmental delays and disabilities that can be improved with early intervention services. Considerations for this population include outreach to underserved populations, particularly those without a medical home; collaboration with primary referral sources, and automatic referral and presumed eligibility for children with evidence of Zika virus infection and abnormalities consistent with congenital Zika syndrome.",null,null,null,null,null,"The QI ratings are displayed in column M, and the QI priority, if selected, is displayed in column N.  The red, yellow or green horizontal bars graphically depict the QI rating.  "]
[]
[]
[]
[]
[]
[null,"  1 Designed by Icon Pond from Flaticon",null,null,null,null,null,"QI Summary"]
[null,null,null,null,null,null,null,"The QI Summary tab displays a summary of the QI ratings for each of those completed.  "]
[null,null,null,null,null,null,null,"The number of elements in each QI with ratings of 1, 2, 3 and 4 are summarized to the right of the graph, followed by the total number of elements in that QI."]
[null,"Theme Summary"]
[null,"The Theme Summary sheet displays a summary of the ratings for each of the themes for which BPs were rated. Data cannot be entered or edited on this sheet because it displays the data from the Child Find Best Practices worksheet. The theme ratings are displayed in column J, and the theme priorities, if entered, are displayed in column K. The colored horizontal bars graphically depict the theme ratings:",null,null,null,null,null,"This sheet lists all of the data elements recommended for a Part C or 619 data system, as presented in element a of QI.4 in the System Design and Development subcomponent.  Choose yes or no to indicate whether your state data system contains each data element.  The table at the top of the page will then display the number and percentage of data elements overall, and by type of data (child-level, service provider/teacher-level, and EIS program/LEA-level)."]
[]
[]
[]
[null,null,null,null,null,null,null,"Note that of the entire list, four are not recommended for619 programs.  These four data elements will be excluded from the calculation IF the program is 619 is selected in the Participant tab.  If no program type is selected, a link is provided back to the Participant tab."]
[null,null,null,null,null,null,null,0]
[null,"Red – indicates a theme rating of 1 or 2\nYellow – indicates a theme rating of 3, 4, or 5\nGreen – indicates a theme rating of 6 or 7",null,null,null,null,null,"QI Summary"]
[]
[null,null,null,null,null,null,null,"The QI Summary tab displays a summary of the QI ratings for each of those completed.  "]
[null,"The total number of BPs in each theme is presented in column T. To the right of the total is the number of BPs in each theme with ratings of 1, 2, 3, and 4. A summary of the number of BPs within each priority level is provided on the far right; this data only includes those BPs for which a priority was indicated.",null,null,null,null,null,"The QI ratings are displayed in column M, and the QI priority, if selected, is displayed in column N.  The red, yellow or green horizontal bars graphically depict the QI rating.  "]
[]
[]
[]
[]
[null,null,null,null,null,null,null,"The number of elements in each QI with ratings of 1, 2, 3 and 4 are summarized to the right of the graph, followed by the total number of elements in that QI."]
[null,"Data",null,null,null,null,null,"A summary of the number of elements with each priority is provided to the far right.  The number of elements for each priority reflects only those elements for which a priority was selected."]
[null,"There is a \"Get Data\" button to the right.  If you do not see the button, please save and close this workbook and, when re-opening the workbook, be sure to click \"Enable Macros\" and \"Enable Content\" when prompted.  These settings are important to access the full functionality of this workbook."]
[]
[]
[]
[]
[null,"The Get Data button (to the right) will generate a sheet with data for current theme and BP ratings. If additional themes are completed after getting the initial data, click on the Get Data button again to refresh the sheet with all current data.",null,null,null,null,null,"The links at the top left of the sheet, to the right of Jump To, allow easy navigation to the Qis in that component/subcomponent."]
[]
[null,null,null,null,null,null,null,"Also at the top of this sheet are two buttons called Wrap Text and Narrow Rows.  Click on the Wrap text button to display the full text of the QI; click on the Narrow Rows button to view the first part of the QI, with only one row per QI."]
[]
[null,"Note: There is a 10-15 second delay to generate the data sheet.",null,null,null,null,null,"The links at the top left of the sheet, to the right of Jump To, allow easy navigation to the Qis in that component/subcomponent."]
[]
[null,"Action Plan",null,null,null,null,null,"A summary of the number of elements with each priority is provided to the far right.  The number of elements for each priority reflects only those elements for which a priority was selected."]
[null,"Use the ratings and priorities from the CFSA in conjunction with the Action Plan to document who was involved with the self-assessment and plan next steps. In the first section of the Action Plan, document the members of the Child Find planning team, their role, and the organization they represent. In the second section, document the Child Find improvement plan, including the planned activities, resources needed, persons responsible, timeline, and the outcomes of improvement activities. In the third section of the template, describe how stakeholders will be involved in the self-assessment and improvement plan, including timelines for involvement.    ",null,null,null,null,null,"The links at the top left of the sheet, to the right of Jump To, allow easy navigation to the Qis in that component/subcomponent."]
[]
[]
[]
[]
[]
[]
[null,null,null,null,null,null,null,"Also at the top of this sheet are two buttons called Wrap Text and Narrow Rows.  Click on the Wrap text button to display the full text of the QI; click on the Narrow Rows button to view the first part of the QI, with only one row per QI."]
[]
[]
[null,"Saving the Results of the Self-Assessment"]
[null,"The CFSA tool is an Excel workbook and needs to be saved just like any other workbook. We recommend saving the file with the date it was completed in the file name, e.g., CFSA_082218, and then saving the file with a new file name if you complete more components at a later date, e.g., CFSA_101518. Save the file often while you are working in it."]
[]
[]
[]
[]
[]
[null,"Printing the Results of the Self-Assessment"]
[null,"Table of Contents: Prints 1 page, portrait (vertical). Print as you normally would (File, Print)."]
[]
[null,"Child Find Best Practices: Prints landscape (horizontal) with a variable number of pages depending on how much text is entered in the Evidence boxes.  To print as you normally would, please click on either the Hide Evidence or Show Evidence (whichever you prefer) prior to printing.\nYou can also create a PDF of the content of this tab and print the PDF using one of the Print PDF buttons at the top of the page."]
[]
[]
[]
[]
[]
[]
[null,"Theme Summary: Prints 1 page, landscape (horizontal). Print as you normally would (File, Print)."]
[]
[]
[null,"Action Plan: Prints landscape (horizontal) with a variable number of pages depending on how much text is entered in the rows. If the row height does not automatically adjust to the amount of text, you may \"manually\" adjust the row heights by clicking the \"Adjust Row Height\" button to the left of the screen in the Action Plan tab.\n\nThen, please print only the pages with data (either by selecting the print area OR by specifying which pages you'd like to print in your Print Dialog interface). "]
[]
[]
[]
[]
[]
[]
[null,"Data: Prints 3 pages, landscape (horizontal). Print as you normally would (File, Print)."]
[]
[]
[null,null,"For guidance troubleshooting common challenges, view the Help tab in this workbook. "]

{"sheet":"Table of Contents","index":2,"n_rows":33,"n_cols":3,"rows_kept":33,"cut":false,"hidden":false,"merged":[[5,1,5,2],[21,1,21,2],[1,1,1,2],[25,1,25,2],[29,1,29,2],[3,1,3,2]]}
[]
[null,"Table of Contents"]
[]
[null,"Instructions"]
[]
[null,"Child Find Best Practices"]
[]
[null,null,"Collaboration with primary referral sources"]
[]
[null,null,"Identification of infants and toddlers who are underserved by Part C"]
[]
[null,null,"Data Systems"]
[]
[null,null,"Evaluation of Child Find"]
[]
[null,null,"Technical Adequacy of Screening and Evaluation Tools"]
[]
[null,null,"Efficiency of Screening, Referral, and Evaluation Process and Procedures"]
[]
[null,null,"Responding to Children Found Ineligible for Early Intervention"]
[]
[null,"Theme Summary"]
[]
[null,null,"Summary ratings for each Best Practice"]
[]
[null,"Action Plan"]
[]
[null,null,"Child Find Action Plan (roster of team members, activities, etc)"]
[]
[null,"Data"]
[]
[null,null,"Exportable data file updated via \"Get Data\" button"]
[null,null,"(see Instructions tab for more information)"]

{"sheet":"Child Find Best Practices","index":3,"n_rows":107,"n_cols":27,"rows_kept":107,"cut":false,"hidden":false,"merged":[[94,17,95,17],[95,5,95,8],[0,3,1,5],[2,3,2,5],[3,4,3,5],[4,4,4,5],[5,4,5,5],[6,4,6,5],[7,4,7,5],[8,3,9,5],[23,17,24,17],[24,5,24,8],[26,4,26,8],[2,7,2,13],[3,8,3,13],[4,8,4,13],[12,4,12,8],[27,4,27,8],[28,4,28,8],[28,10,29,10],[28,11,29,11],[28,13,29,13],[23,4,23,8],[23,10,24,10],[10,18,10,21],[13,17,14,17],[15,17,16,17],[17,17,18,17],[19,17,20,17],[21,17,22,17],[15,18,15,21],[16,18,16,21],[13,10,14,10],[13,13,14,13],[15,13,16,13],[17,13,18,13],[19,13,20,13],[13,11,14,11],[10,23,11,23],[10,22,11,22],[14,22,15,23],[22,5,22,8],[15,10,16,10],[15,11,16,11],[17,10,18,10],[17,11,18,11],[19,10,20,10],[19,11,20,11],[21,10,22,10],[21,11,22,11],[19,4,19,8],[11,4,11,8],[21,4,21,8],[13,4,13,8],[15,4,15,8],[17,4,17,8],[14,5,14,8],[16,5,16,8],[18,5,18,8],[20,5,20,8],[9,10,10,11],[9,13,10,13],[23,11,24,11],[23,13,24,13],[21,13,22,13],[5,8,5,13],[6,8,6,13],[32,17,33,17],[33,5,33,8],[28,17,29,17],[29,5,29,8],[29,22,30,23],[30,4,30,8],[30,10,31,10],[30,11,31,11],[30,13,31,13],[30,17,31,17],[30,18,30,21],[31,5,31,8],[31,18,31,21],[35,4,35,8],[37,4,37,8],[37,10,38,10],[37,11,38,11],[37,13,38,13],[36,4,36,8],[32,4,32,8],[32,10,33,10],[32,11,33,11],[32,13,33,13],[37,17,38,17],[38,5,38,8],[38,22,39,23],[39,4,39,8],[39,10,40,10],[39,11,40,11],[39,13,40,13],[39,17,40,17],[39,18,39,21],[40,5,40,8],[40,18,40,21],[45,17,46,17],[46,5,46,8],[43,4,43,8],[43,10,44,10],[43,11,44,11],[43,13,44,13],[43,17,44,17],[44,5,44,8],[41,4,41,8],[41,10,42,10],[41,11,42,11],[41,13,42,13],[41,17,42,17],[42,5,42,8],[48,4,48,8],[50,4,50,8],[50,10,51,10],[50,11,51,11],[50,13,51,13],[49,4,49,8],[45,4,45,8],[45,10,46,10],[45,11,46,11],[45,13,46,13],[51,22,52,23],[52,4,52,8],[52,10,53,10],[52,11,53,11],[52,13,53,13],[52,17,53,17],[52,18,52,21],[53,5,53,8],[53,18,53,21],[56,17,57,17],[57,5,57,8],[54,4,54,8],[54,10,55,10],[54,11,55,11],[54,13,55,13],[54,17,55,17],[55,5,55,8],[50,17,51,17],[51,5,51,8],[59,4,59,8],[61,4,61,8],[61,10,62,10],[61,11,62,11],[61,13,62,13],[60,4,60,8],[56,4,56,8],[56,10,57,10],[56,11,57,11],[56,13,57,13],[61,17,62,17],[62,5,62,8],[62,22,63,23],[63,4,63,8],[63,10,64,10],[63,11,64,11],[63,13,64,13],[63,17,64,17],[63,18,63,21],[64,5,64,8],[64,18,64,21],[71,17,72,17],[72,5,72,8],[67,4,67,8],[67,10,68,10],[67,11,68,11],[67,13,68,13],[67,17,68,17],[68,5,68,8],[65,4,65,8],[65,10,66,10],[65,11,66,11],[65,13,66,13],[65,17,66,17],[66,5,66,8],[69,4,69,8],[69,10,70,10],[69,11,70,11],[69,13,70,13],[69,17,70,17],[70,5,70,8],[74,4,74,8],[76,4,76,8],[76,10,77,10],[76,11,77,11],[76,13,77,13],[75,4,75,8],[71,4,71,8],[71,10,72,10],[71,11,72,11],[71,13,72,13],[80,4,80,8],[80,10,81,10],[80,11,81,11],[80,13,81,13],[80,17,81,17],[81,5,81,8],[76,17,77,17],[77,5,77,8],[77,22,78,23],[78,4,78,8],[78,10,79,10],[78,11,79,11],[78,13,79,13],[78,17,79,17],[78,18,78,21],[79,5,79,8],[79,18,79,21],[84,4,84,8],[84,10,85,10],[84,11,85,11],[84,13,85,13],[84,17,85,17],[85,5,85,8],[82,4,82,8],[82,10,83,10],[82,11,83,11],[82,13,83,13],[82,17,83,17],[83,5,83,8],[92,17,93,17],[93,5,93,8],[88,4,88,8],[88,10,89,10],[88,11,89,11],[88,13,89,13],[88,17,89,17],[89,5,89,8],[86,4,86,8],[86,10,87,10],[86,11,87,11],[86,13,87,13],[86,17,87,17],[87,5,87,8],[90,4,90,8],[90,10,91,10],[90,11,91,11],[90,13,91,13],[90,17,91,17],[91,5,91,8],[97,4,97,8],[99,4,99,8],[99,10,100,10],[99,11,100,11],[99,13,100,13],[98,4,98,8],[92,4,92,8],[92,10,93,10],[92,11,93,11],[92,13,93,13],[94,4,94,8],[94,10,95,10],[94,11,95,11],[94,13,95,13],[99,17,100,17],[100,5,100,8],[100,22,101,23],[101,4,101,8],[101,10,102,10],[101,11,102,11],[101,13,102,13],[101,17,102,17],[101,18,101,21],[102,5,102,8],[102,18,102,21],[105,4,105,8],[105,10,106,10],[105,11,106,11],[105,13,106,13],[105,17,106,17],[106,5,106,8],[103,4,103,8],[103,10,104,10],[103,11,104,11],[103,13,104,13],[103,17,104,17],[104,5,104,8]]}
[{"$f":"D1&\"_\"&A2&\"_\"&TEXT(A3,\"DD-MMM-YYYY\")","v":"Child Find Best Practices_withEvidence_22-Feb-2019"},null,null,"Child Find Best Practices",null,null,null,null,null,null,null,null,null,null,null,null,null,null,null,null,null,null,null,null,null,{"$f":"E1&F1","v":""}]
["withEvidence",null,null,null,null,null,null,null,null,null,null,null,null,null,null,null,null,null,null,null,null,null,null,null,null,""]
[{"$f":"NOW()","v":"2019-02-22T10:22:51.500"},null,null,null,null,null,null,"Best Practice Rating (BPR)",null,null,null,null,null,null,null,null,null,null,null,null,null,null,null,null,null,""]
[null,null,null,null,null,null,null,1,"No - practice not in place and not planning to work on it at this time",null,null,null,null,null,null,null,null,null,null,null,null,null,null,null,null,""]
[null,null,null,null,null,null,null,2,"No - practice not in place but planning to work on it or getting started",null,null,null,null,null,null,null,null,null,null,null,null,null,null,null,null,""]
[null,null,null,null,null,null,null,3,"Yes - practice partially implemented",null,null,null,null,null,null,null,null,null,null,null,null,null,null,null,null,""]
[null,null,null,null,null,null,null,4,"Yes - practice fully implemented",null,null,null,null,null,null,null,null,null,null,null,null,null,null,null,null,""]
[null,null,null,null,null,null,null,null,null,null,null,null,null,null,null,null,null,null,null,null,null,null,null,null,null,""]
[null,null,null,"Child Find Best Practices",null,null,null,null,null,null,null,null,null,null,null,null,null,null,null,null,null,null,null,null,null,""]
[null,null,null,null,null,null,null,null,null,null,"Rating",null,null,"PRIORITY",null,null,null,null,null,null,null,null,null,null,null,""]
[null,"Index",{"$f":"MID(CELL(\"Filename\",C1),FIND(\"]\",CELL(\"Filename\",C1))+1,255)","v":"Child Find Best Practices"},null,null,null,null,null,null,null,null,null,null,null,null,null,null,null,null,null,null,null,null,null,null,""]
[null,{"$f":"IF(LEN(D12)>1,\"Q-\"&LEFT(D12,2)&RIGHT(D12)&\"-0\",\"E-\"&MID(#REF!,3,3)&\"-\"&D12)","v":"Q-BP1-0"},null,"BP 1",{"$f":"VLOOKUP(B12,ALLdata!A:F,6,FALSE)","v":"Collaboration with primary referral sources"},null,null,null,null,null,"Theme Rating: ",{"$f":"VLOOKUP(B12,ALLdata!A:H,8,FALSE)","v":0},null,null,null,null,{"$f":"IF(E12=\"Evidence:\",1,0)","v":0},null,null,null,null,null,null,null,null,{"$f":"E12&F12","v":"Collaboration with primary referral sources"},{"$f":"K12","v":"Theme Rating: "}]
[null,null,null,null,"Ongoing and effective collaborative relationships with referral agencies supports the appropriate referral of infants and toddlers to Part C.  Effective collaborative relationships are those where there is ongoing communication and adherence to child find procedures.  Training for referral sources, including physicians, nurses, and child care providers, helps to ensure consistency in application of criteria for referrals and supports timely referrals.  The practices in this section relate to the policies, agreements and communication that lead to effective collaboration with primary referral sources, and professional development to support referral agencies in making referrals.",null,null,null,null,null,null,null,null,null,null,null,1,null,null,null,null,null,null,null,null,"Ongoing and effective collaborative relationships with referral agencies supports the appropriate referral of infants and toddlers to Part C.  Effective collaborative relationships are those where there is ongoing communication and adherence to child find procedures.  Training for referral sources, including physicians, nurses, and child care providers, helps to ensure consistency in application of criteria for referrals and supports timely referrals.  The practices in this section relate to the policies, agreements and communication that lead to effective collaboration with primary referral sources, and professional development to support referral agencies in making referrals."]
[null,{"$f":"IF(LEN(D14)>1,\"Q-\"&LEFT(D14,2)&RIGHT(D14)&\"-0\",\"E-\"&MID(B12,3,3)&\"-\"&D14)","v":"E-BP1-a"},null,"a",{"$f":"VLOOKUP(B14,ALLdata!A:F,6,FALSE)","v":"Referral sources are provided with timely feedback including the status of the referral, outcomes of the referral, child engagement in services, and progress. "},null,null,null,null,null,"Best Practice Rating:",null,null,null,null,null,0,null,null,null,null,null,null,null,null,"Referral sources are provided with timely feedback including the status of the referral, outcomes of the referral, child engagement in services, and progress. ",{"$f":"K14","v":"Best Practice Rating:"}]
[null,null,null,null,"Evidence:",null,null,null,null,null,null,null,null,null,null,null,1,null,null,null,null,null,null,null,null,"Evidence:"]
[null,{"$f":"LEFT(B14,6)&D16","v":"E-BP1-b"},null,"b",{"$f":"VLOOKUP(B16,ALLdata!A:F,6,FALSE)","v":"“Referral” is clearly defined, and that definition is disseminated to primary referral sources."},null,null,null,null,null,"Best Practice Rating:",null,null,null,null,null,0,null,null,null,null,null,null,null,null,"“Referral” is clearly defined, and that definition is disseminated to primary referral sources.",{"$f":"K16","v":"Best Practice Rating:"}]
[null,null,null,null,"Evidence:",null,null,null,null,null,null,null,null,null,null,null,1,null,null,null,null,null,null,null,null,"Evidence:"]
[null,{"$f":"LEFT(B16,6)&D18","v":"E-BP1-c"},null,"c",{"$f":"VLOOKUP(B18,ALLdata!A:F,6,FALSE)","v":"Policies and procedures support ongoing and effective collaborative relationships with community agencies that serve underserved and at-risk populations. "},null,null,null,null,null,"Best Practice Rating:",null,null,null,null,null,0,null,null,null,null,null,null,null,null,"Policies and procedures support ongoing and effective collaborative relationships with community agencies that serve underserved and at-risk populations. ",{"$f":"K18","v":"Best Practice Rating:"}]
[null,null,null,null,"Evidence:",null,null,null,null,null,null,null,null,null,null,null,1,null,null,null,null,null,null,null,null,"Evidence:"]
[null,{"$f":"LEFT(B18,6)&D20","v":"E-BP1-d"},null,"d",{"$f":"VLOOKUP(B20,ALLdata!A:F,6,FALSE)","v":"Implement respectful and appropriate pre-referral education and information-sharing with families to support their understanding of the importance of EI and to reduce stigma."},null,null,null,null,null,"Best Practice Rating:",null,null,null,null,null,0,null,null,null,null,null,null,null,null,"Implement respectful and appropriate pre-referral education and information-sharing with families to support their understanding of the importance of EI and to reduce stigma.",{"$f":"K20","v":"Best Practice Rating:"}]
[null,null,null,null,"Evidence:",null,null,null,null,null,null,null,null,null,null,null,1,null,null,null,null,null,null,null,null,"Evidence:"]
[null,{"$f":"LEFT(B20,6)&D22","v":"E-BP1-e"},null,"e",{"$f":"VLOOKUP(B22,ALLdata!A:F,6,FALSE)","v":"Policies and procedures are in place to support ongoing and effective communication and collaborative relationships with referral agencies (e.g., NICUs, child care programs, pediatricians). "},null,null,null,null,null,"Best Practice Rating:",null,null,null,null,null,0,null,null,null,null,null,null,null,null,"Policies and procedures are in place to support ongoing and effective communication and collaborative relationships with referral agencies (e.g., NICUs, child care programs, pediatricians). ",{"$f":"K22","v":"Best Practice Rating:"}]
[null,null,null,null,"Evidence:",null,null,null,null,null,null,null,null,null,null,null,1,null,null,null,null,null,null,null,null,"Evidence:"]
[null,{"$f":"LEFT(B22,6)&D24","v":"E-BP1-f"},null,"f",{"$f":"VLOOKUP(B24,ALLdata!A:F,6,FALSE)","v":"Collaboration with primary referral sources includes education, training, and professional development to support consistent application of referral criteria across sectors, geographic regions, and genders."},null,null,null,null,null,"Best Practice Rating:",null,null,null,null,null,{"$f":"IF(E24=\"Evidence:\",1,0)","v":0},null,null,null,null,null,null,null,null,{"$f":"E24&F24","v":"Collaboration with primary referral sources includes education, training, and professional development to support consistent application of referral criteria across sectors, geographic regions, and genders."},{"$f":"K24","v":"Best Practice Rating:"}]
[null,null,null,null,"Evidence:",null,null,null,null,null,null,null,null,null,null,null,1,null,null,null,null,null,null,null,null,"Evidence:"]
[]
[null,{"$f":"IF(LEN(D27)>1,\"Q-\"&LEFT(D27,2)&RIGHT(D27)&\"-0\",\"E-\"&MID(B26,3,3)&\"-\"&D27)","v":"Q-BP2-0"},null,"BP 2",{"$f":"VLOOKUP(B27,ALLdata!A:F,6,FALSE)","v":"Identification of infants and toddlers who are underserved by Part C"},null,null,null,null,null,"Theme Rating: ",{"$f":"VLOOKUP(B27,ALLdata!A:H,8,FALSE)","v":0},null,null,null,null,{"$f":"IF(E27=\"Evidence:\",1,0)","v":0},null,null,null,null,null,null,null,null,{"$f":"E27&F27","v":"Identification of infants and toddlers who are underserved by Part C"},{"$f":"K27","v":"Theme Rating: "}]
[null,null,null,null,"Some infants and toddlers with disabilities are not readily screened and enrolled in Part C. This can be related to access to adequate screening in the settings where they receive community or medical services or the family’s understanding of the importance of early intervention services, among other things. The practices in this section focus of strategies for reaching out to underserved populations to provide equal opportunity to participation in Part C. ",null,null,null,null,null,null,null,null,null,null,null,1,null,null,null,null,null,null,null,null,"Some infants and toddlers with disabilities are not readily screened and enrolled in Part C. This can be related to access to adequate screening in the settings where they receive community or medical services or the family’s understanding of the importance of early intervention services, among other things. The practices in this section focus of strategies for reaching out to underserved populations to provide equal opportunity to participation in Part C. "]
[null,{"$f":"IF(LEN(D29)>1,\"Q-\"&LEFT(D29,2)&RIGHT(D29)&\"-0\",\"E-\"&MID(B27,3,3)&\"-\"&D29)","v":"E-BP2-a"},null,"a",{"$f":"VLOOKUP(B29,ALLdata!A:F,6,FALSE)","v":"Materials describing the child find process are targeted towards underserved populations."},null,null,null,null,null,"Best Practice Rating:",null,null,null,null,null,{"$f":"IF(E29=\"Evidence:\",1,0)","v":0},null,null,null,null,null,null,null,null,{"$f":"E29&F29","v":"Materials describing the child find process are targeted towards underserved populations."},{"$f":"K29","v":"Best Practice Rating:"}]
[null,null,null,null,"Evidence:",null,null,null,null,null,null,null,null,null,null,null,1,null,null,null,null,null,null,null,null,"Evidence:",0]
[null,{"$f":"LEFT(B29,6)&D31","v":"E-BP2-b"},null,"b",{"$f":"VLOOKUP(B31,ALLdata!A:F,6,FALSE)","v":"Community health workers and other cultural brokers (i.e., individuals who bridge groups of differing backgrounds to create change, such as interpreters or other community members who may act in both directions between the community and Part C agency) are engaged and support the child find process."},null,null,null,null,null,"Best Practice Rating:",null,null,null,null,null,0,null,null,null,null,null,null,null,null,"Community health workers and other cultural brokers (i.e., individuals who bridge groups of differing backgrounds to create change, such as interpreters or other community members who may act in both directions between the community and Part C agency) are engaged and support the child find process.","Best Practice Rating:"]
[null,null,null,null,"Evidence:",null,null,null,null,null,null,null,null,null,null,null,1,null,null,null,null,null,null,null,null,"Evidence:",0]
[null,{"$f":"LEFT(B31,6)&D33","v":"E-BP2-c"},null,"c",{"$f":"VLOOKUP(B33,ALLdata!A:F,6,FALSE)","v":"Use strategies such as a 211 telephone-based developmental screening and care coordination as a scalable and cost-effective strategy to reach children who may not have a medical home. (For more information on 211 screening see https://www.zerotothree.org/resources/56-improving-access-to-early-identification-and-intervention-211-la-county-developmental-screening-and-care-coordination)"},null,null,null,null,null,"Best Practice Rating:",null,null,null,null,null,0,null,null,null,null,null,null,null,null,"Use strategies such as a 211 telephone-based developmental screening and care coordination as a scalable and cost-effective strategy to reach children who may not have a medical home. (For more information on 211 screening see https://www.zerotothree.org/resources/56-improving-access-to-early-identification-and-intervention-211-la-county-developmental-screening-and-care-coordination)","Best Practice Rating:"]
[null,null,null,null,"Evidence:",null,null,null,null,null,null,null,null,null,null,null,1,null,null,null,null,null,null,null,null,"Evidence:",0]
[]
[null,{"$f":"IF(LEN(D36)>1,\"Q-\"&LEFT(D36,2)&RIGHT(D36)&\"-0\",\"E-\"&MID(B35,3,3)&\"-\"&D36)","v":"Q-BP3-0"},null,"BP 3",{"$f":"VLOOKUP(B36,ALLdata!A:F,6,FALSE)","v":"Data Systems "},null,null,null,null,null,"Theme Rating: ",{"$f":"VLOOKUP(B36,ALLdata!A:H,8,FALSE)","v":0},null,null,null,null,{"$f":"IF(E36=\"Evidence:\",1,0)","v":0},null,null,null,null,null,null,null,null,{"$f":"E36&F36","v":"Data Systems "},{"$f":"K36","v":"Theme Rating: "}]
[null,null,null,null,"Data systems are a powerful tool for managing information across programs serving young children and within Part C programs. The practices in this section focus on attributes of data systems that support child find, like linking data across systems serving young children.",null,null,null,null,null,null,null,null,null,null,null,1,null,null,null,null,null,null,null,null,"Data systems are a powerful tool for managing information across programs serving young children and within Part C programs. The practices in this section focus on attributes of data systems that support child find, like linking data across systems serving young children."]
[null,{"$f":"IF(LEN(D38)>1,\"Q-\"&LEFT(D38,2)&RIGHT(D38)&\"-0\",\"E-\"&MID(B36,3,3)&\"-\"&D38)","v":"E-BP3-a"},null,"a",{"$f":"VLOOKUP(B38,ALLdata!A:F,6,FALSE)","v":"Formal data governance is in place defining the policies related to data security and access."},null,null,null,null,null,"Best Practice Rating:",null,null,null,null,null,0,null,null,null,null,null,null,null,null,"Formal data governance is in place defining the policies related to data security and access.",{"$f":"K38","v":"Best Practice Rating:"}]
[null,null,null,null,"Evidence:",null,null,null,null,null,null,null,null,null,null,null,1,null,null,null,null,null,null,null,null,"Evidence:",0]
[null,{"$f":"LEFT(B38,6)&D40","v":"E-BP3-b"},null,"b",{"$f":"VLOOKUP(B40,ALLdata!A:F,6,FALSE)","v":"Data system includes sufficient technical (e.g., firewalls, secure laptops, password, management, etc.) and nontechnical (e.g. data access and sharing restrictions, regular staff trainings, ensuring correct access and administrative rights are granted for staff and authorized data users) security measures to minimize the risk of disclosing Personally Identifiable Information (PII)."},null,null,null,null,null,"Best Practice Rating:",null,null,null,null,null,0,null,null,null,null,null,null,null,null,"Data system includes sufficient technical (e.g., firewalls, secure laptops, password, management, etc.) and nontechnical (e.g. data access and sharing restrictions, regular staff trainings, ensuring correct access and administrative rights are granted for staff and authorized data users) security measures to minimize the risk of disclosing Personally Identifiable Information (PII).","Best Practice Rating:"]
[null,null,null,null,"Evidence:",null,null,null,null,null,null,null,null,null,null,null,1,null,null,null,null,null,null,null,null,"Evidence:",0]
[null,{"$f":"LEFT(B40,6)&D42","v":"E-BP3-c"},null,"c",{"$f":"VLOOKUP(B42,ALLdata!A:F,6,FALSE)","v":"The data system has the capacity to support accountability, program development, and program operations and includes elements and features of high-quality data systems."},null,null,null,null,null,"Best Practice Rating:",null,null,null,null,null,0,null,null,null,null,null,null,null,null,"The data system has the capacity to support accountability, program development, and program operations and includes elements and features of high-quality data systems.","Best Practice Rating:"]
[null,null,null,null,"Evidence:",null,null,null,null,null,null,null,null,null,null,null,1,null,null,null,null,null,null,null,null,"Evidence:",0]
[null,{"$f":"LEFT(B42,6)&D44","v":"E-BP3-d"},null,"d",{"$f":"VLOOKUP(B44,ALLdata!A:F,6,FALSE)","v":"The Part C state data system has interoperability that allows for linking Part C data to other statewide longitudinal and early childhood data systems."},null,null,null,null,null,"Best Practice Rating:",null,null,null,null,null,0,null,null,null,null,null,null,null,null,"The Part C state data system has interoperability that allows for linking Part C data to other statewide longitudinal and early childhood data systems.","Best Practice Rating:"]
[null,null,null,null,"Evidence:",null,null,null,null,null,null,null,null,null,null,null,1,null,null,null,null,null,null,null,null,"Evidence:",0]
[null,{"$f":"LEFT(B44,6)&D46","v":"E-BP3-e"},null,"e",{"$f":"VLOOKUP(B46,ALLdata!A:F,6,FALSE)","v":"The data collected are high quality."},null,null,null,null,null,"Best Practice Rating:",null,null,null,null,null,0,null,null,null,null,null,null,null,null,"The data collected are high quality.","Best Practice Rating:"]
[null,null,null,null,"Evidence:",null,null,null,null,null,null,null,null,null,null,null,1,null,null,null,null,null,null,null,null,"Evidence:",0]
[]
[null,{"$f":"IF(LEN(D49)>1,\"Q-\"&LEFT(D49,2)&RIGHT(D49)&\"-0\",\"E-\"&MID(B48,3,3)&\"-\"&D49)","v":"Q-BP4-0"},null,"BP 4",{"$f":"VLOOKUP(B49,ALLdata!A:F,6,FALSE)","v":"Evaluation of Child Find"},null,null,null,null,null,"Theme Rating: ",{"$f":"VLOOKUP(B49,ALLdata!A:H,8,FALSE)","v":0},null,null,null,null,{"$f":"IF(E49=\"Evidence:\",1,0)","v":0},null,null,null,null,null,null,null,null,{"$f":"E49&F49","v":"Evaluation of Child Find"},{"$f":"K49","v":"Theme Rating: "}]
[null,null,null,null,"Like other critical components of state and local infrastructure, it is important to review and revise the child find system periodically to ensure that policies and procedures are still relevant and are being implemented with fidelity.  The practices in this section focus on methods for periodic evaluation and revision of the child find system.",null,null,null,null,null,null,null,null,null,null,null,1,null,null,null,null,null,null,null,null,"Like other critical components of state and local infrastructure, it is important to review and revise the child find system periodically to ensure that policies and procedures are still relevant and are being implemented with fidelity.  The practices in this section focus on methods for periodic evaluation and revision of the child find system."]
[null,{"$f":"IF(LEN(D51)>1,\"Q-\"&LEFT(D51,2)&RIGHT(D51)&\"-0\",\"E-\"&MID(B49,3,3)&\"-\"&D51)","v":"E-BP4-a"},null,"a",{"$f":"VLOOKUP(B51,ALLdata!A:F,6,FALSE)","v":"The state has a method for evaluating progress towards best practices, including experiences of parents and primary referral sources."},null,null,null,null,null,"Best Practice Rating:",null,null,null,null,null,0,null,null,null,null,null,null,null,null,"The state has a method for evaluating progress towards best practices, including experiences of parents and primary referral sources.",{"$f":"K51","v":"Best Practice Rating:"}]
[null,null,null,null,"Evidence:",null,null,null,null,null,null,null,null,null,null,null,1,null,null,null,null,null,null,null,null,"Evidence:",0]
[null,{"$f":"LEFT(B51,6)&D53","v":"E-BP4-b"},null,"b",{"$f":"VLOOKUP(B53,ALLdata!A:F,6,FALSE)","v":"The Part C state data system, directly or through a related application, has reporting and analysis tools that provide end users, including state and local program staff, with easy access* to the data in both raw form and reports. "},null,null,null,null,null,"Best Practice Rating:",null,null,null,null,null,0,null,null,null,null,null,null,null,null,"The Part C state data system, directly or through a related application, has reporting and analysis tools that provide end users, including state and local program staff, with easy access* to the data in both raw form and reports. ","Best Practice Rating:"]
[null,null,null,null,"Evidence:",null,null,null,null,null,null,null,null,null,null,null,1,null,null,null,null,null,null,null,null,"Evidence:",0]
[null,{"$f":"LEFT(B53,6)&D55","v":"E-BP4-c"},null,"c",{"$f":"VLOOKUP(B55,ALLdata!A:F,6,FALSE)","v":"Reports include metrics useful for monitoring the child find system."},null,null,null,null,null,"Best Practice Rating:",null,null,null,null,null,0,null,null,null,null,null,null,null,null,"Reports include metrics useful for monitoring the child find system.","Best Practice Rating:"]
[null,null,null,null,"Evidence:",null,null,null,null,null,null,null,null,null,null,null,1,null,null,null,null,null,null,null,null,"Evidence:",0]
[null,{"$f":"LEFT(B55,6)&D57","v":"E-BP4-d"},null,"d",{"$f":"VLOOKUP(B57,ALLdata!A:F,6,FALSE)","v":"Data system features methods for identifying underserved populations."},null,null,null,null,null,"Best Practice Rating:",null,null,null,null,null,0,null,null,null,null,null,null,null,null,"Data system features methods for identifying underserved populations.","Best Practice Rating:"]
[null,null,null,null,"Evidence:",null,null,null,null,null,null,null,null,null,null,null,1,null,null,null,null,null,null,null,null,"Evidence:",0]
[]
[null,{"$f":"IF(LEN(D60)>1,\"Q-\"&LEFT(D60,2)&RIGHT(D60)&\"-0\",\"E-\"&MID(B59,3,3)&\"-\"&D60)","v":"Q-BP5-0"},null,"BP 5",{"$f":"VLOOKUP(B60,ALLdata!A:F,6,FALSE)","v":"Technical Adequacy of Screening and Evaluation Tools"},null,null,null,null,null,"Theme Rating: ",{"$f":"VLOOKUP(B60,ALLdata!A:H,8,FALSE)","v":0},null,null,null,null,{"$f":"IF(E60=\"Evidence:\",1,0)","v":0},null,null,null,null,null,null,null,null,{"$f":"E60&F60","v":"Technical Adequacy of Screening and Evaluation Tools"},{"$f":"K60","v":"Theme Rating: "}]
[null,null,null,null,"Tools used for screening must meet standards for technical adequacy and be implemented consistently and appropriately to minimize under- or over-identification. Items in this section have to do with the characteristics of the screening tool and training for those administering screenings.",null,null,null,null,null,null,null,null,null,null,null,1,null,null,null,null,null,null,null,null,"Tools used for screening must meet standards for technical adequacy and be implemented consistently and appropriately to minimize under- or over-identification. Items in this section have to do with the characteristics of the screening tool and training for those administering screenings."]
[null,{"$f":"IF(LEN(D62)>1,\"Q-\"&LEFT(D62,2)&RIGHT(D62)&\"-0\",\"E-\"&MID(B60,3,3)&\"-\"&D62)","v":"E-BP5-a"},null,"a",{"$f":"VLOOKUP(B62,ALLdata!A:F,6,FALSE)","v":"Use of standardized developmental screening and evaluation tools with strong psychometric properties and sufficient sensitivity to detect child progress."},null,null,null,null,null,"Best Practice Rating:",null,null,null,null,null,0,null,null,null,null,null,null,null,null,"Use of standardized developmental screening and evaluation tools with strong psychometric properties and sufficient sensitivity to detect child progress.",{"$f":"K62","v":"Best Practice Rating:"}]
[null,null,null,null,"Evidence:",null,null,null,null,null,null,null,null,null,null,null,1,null,null,null,null,null,null,null,null,"Evidence:",0]
[null,{"$f":"LEFT(B62,6)&D64","v":"E-BP5-b"},null,"b",{"$f":"VLOOKUP(B64,ALLdata!A:F,6,FALSE)","v":"Screening tools are brief and with a reduced literacy burden."},null,null,null,null,null,"Best Practice Rating:",null,null,null,null,null,0,null,null,null,null,null,null,null,null,"Screening tools are brief and with a reduced literacy burden.","Best Practice Rating:"]
[null,null,null,null,"Evidence:",null,null,null,null,null,null,null,null,null,null,null,1,null,null,null,null,null,null,null,null,"Evidence:",0]
[null,{"$f":"LEFT(B64,6)&D66","v":"E-BP5-c"},null,"c",{"$f":"VLOOKUP(B66,ALLdata!A:F,6,FALSE)","v":"Developmental screening and evaluation tools include social-emotional development."},null,null,null,null,null,"Best Practice Rating:",null,null,null,null,null,0,null,null,null,null,null,null,null,null,"Developmental screening and evaluation tools include social-emotional development.","Best Practice Rating:"]
[null,null,null,null,"Evidence:",null,null,null,null,null,null,null,null,null,null,null,1,null,null,null,null,null,null,null,null,"Evidence:",0]
[null,{"$f":"LEFT(B66,6)&D68","v":"E-BP5-d"},null,"d",{"$f":"VLOOKUP(B68,ALLdata!A:F,6,FALSE)","v":"Individuals conducting screenings and evaluations are trained in their use, scoring, and interpretation."},null,null,null,null,null,"Best Practice Rating:",null,null,null,null,null,0,null,null,null,null,null,null,null,null,"Individuals conducting screenings and evaluations are trained in their use, scoring, and interpretation.","Best Practice Rating:"]
[null,null,null,null,"Evidence:",null,null,null,null,null,null,null,null,null,null,null,1,null,null,null,null,null,null,null,null,"Evidence:",0]
[null,{"$f":"LEFT(B66,6)&D70","v":"E-BP5-e"},null,"e",{"$f":"VLOOKUP(B70,ALLdata!A:F,6,FALSE)","v":"Evaluation tools provide functional information that can be used to inform IFSP development."},null,null,null,null,null,"Best Practice Rating:",null,null,null,null,null,{"$f":"IF(E70=\"Evidence:\",1,0)","v":0},null,null,null,null,null,null,null,null,{"$f":"E70&F70","v":"Evaluation tools provide functional information that can be used to inform IFSP development."},{"$f":"K70","v":"Best Practice Rating:"}]
[null,null,null,null,"Evidence:",null,null,null,null,null,null,null,null,null,null,null,1,null,null,null,null,null,null,null,null,"Evidence:",0]
[null,{"$f":"LEFT(B68,6)&D72","v":"E-BP5-f"},null,"f",{"$f":"VLOOKUP(B72,ALLdata!A:F,6,FALSE)","v":"Implementation of CDC-recommended practices for the diagnosis and management of infants born to mothers with Zika exposure or with potential Zika exposure."},null,null,null,null,null,"Best Practice Rating:",null,null,null,null,null,0,null,null,null,null,null,null,null,null,"Implementation of CDC-recommended practices for the diagnosis and management of infants born to mothers with Zika exposure or with potential Zika exposure.","Best Practice Rating:"]
[null,null,null,null,"Evidence:",null,null,null,null,null,null,null,null,null,null,null,1,null,null,null,null,null,null,null,null,"Evidence:",0]
[]
[null,{"$f":"IF(LEN(D75)>1,\"Q-\"&LEFT(D75,2)&RIGHT(D75)&\"-0\",\"E-\"&MID(B74,3,3)&\"-\"&D75)","v":"Q-BP6-0"},null,"BP 6",{"$f":"VLOOKUP(B75,ALLdata!A:F,6,FALSE)","v":"Efficiency of Screening, Referral, and Evaluation Process and Procedures"},null,null,null,null,null,"Theme Rating: ",{"$f":"VLOOKUP(B75,ALLdata!A:H,8,FALSE)","v":0},null,null,null,null,{"$f":"IF(E75=\"Evidence:\",1,0)","v":0},null,null,null,null,null,null,null,null,{"$f":"E75&F75","v":"Efficiency of Screening, Referral, and Evaluation Process and Procedures"},{"$f":"K75","v":"Theme Rating: "}]
[null,null,null,null,"Effective screening, referral, and evaluation programs within Child Find efforts include coordinated efforts to screen all infants, toddlers, and young children in all developmental domains periodically, straightforward referral processes to facilitate ease of referral, and efficient evaluations. Expedited or universal referral of infants and toddlers with established conditions that make them automatically eligible for Part C services speeds up the time it takes to get early intervention services in place. Practices in this section include universal screening, cultural considerations for screening, coordination with referral agencies for screening, referral modes, and practices for universal or expedited referral, including use of a decision-making algorithm. ",null,null,null,null,null,null,null,null,null,null,null,1,null,null,null,null,null,null,null,null,"Effective screening, referral, and evaluation programs within Child Find efforts include coordinated efforts to screen all infants, toddlers, and young children in all developmental domains periodically, straightforward referral processes to facilitate ease of referral, and efficient evaluations. Expedited or universal referral of infants and toddlers with established conditions that make them automatically eligible for Part C services speeds up the time it takes to get early intervention services in place. Practices in this section include universal screening, cultural considerations for screening, coordination with referral agencies for screening, referral modes, and practices for universal or expedited referral, including use of a decision-making algorithm. "]
[null,{"$f":"IF(LEN(D77)>1,\"Q-\"&LEFT(D77,2)&RIGHT(D77)&\"-0\",\"E-\"&MID(B75,3,3)&\"-\"&D77)","v":"E-BP6-a"},null,"a",{"$f":"VLOOKUP(B77,ALLdata!A:F,6,FALSE)","v":"Universal screening for all children at set time points."},null,null,null,null,null,"Best Practice Rating:",null,null,null,null,null,0,null,null,null,null,null,null,null,null,"Universal screening for all children at set time points.",{"$f":"K77","v":"Best Practice Rating:"}]
[null,null,null,null,"Evidence:",null,null,null,null,null,null,null,null,null,null,null,1,null,null,null,null,null,null,null,null,"Evidence:",0]
[null,{"$f":"LEFT(B77,6)&D79","v":"E-BP6-b"},null,"b",{"$f":"VLOOKUP(B79,ALLdata!A:F,6,FALSE)","v":"Statewide coordination of screening includes surveillance and screening by primary care physicians."},null,null,null,null,null,"Best Practice Rating:",null,null,null,null,null,0,null,null,null,null,null,null,null,null,"Statewide coordination of screening includes surveillance and screening by primary care physicians.","Best Practice Rating:"]
[null,null,null,null,"Evidence:",null,null,null,null,null,null,null,null,null,null,null,1,null,null,null,null,null,null,null,null,"Evidence:",0]
[null,{"$f":"LEFT(B79,6)&D81","v":"E-BP6-c"},null,"c",{"$f":"VLOOKUP(B81,ALLdata!A:F,6,FALSE)","v":"Screening includes family perspectives and is conducted in the child’s dominant language and according to family preferences."},null,null,null,null,null,"Best Practice Rating:",null,null,null,null,null,0,null,null,null,null,null,null,null,null,"Screening includes family perspectives and is conducted in the child’s dominant language and according to family preferences.","Best Practice Rating:"]
[null,null,null,null,"Evidence:",null,null,null,null,null,null,null,null,null,null,null,1,null,null,null,null,null,null,null,null,"Evidence:",0]
[null,{"$f":"LEFT(B81,6)&D83","v":"E-BP6-d"},null,"d",{"$f":"VLOOKUP(B83,ALLdata!A:F,6,FALSE)","v":"Web-based referral or electronic transmission of referrals."},null,null,null,null,null,"Best Practice Rating:",null,null,null,null,null,0,null,null,null,null,null,null,null,null,"Web-based referral or electronic transmission of referrals.","Best Practice Rating:"]
[null,null,null,null,"Evidence:",null,null,null,null,null,null,null,null,null,null,null,1,null,null,null,null,null,null,null,null,"Evidence:",0]
[null,{"$f":"LEFT(B83,6)&D85","v":"E-BP6-e"},null,"e",{"$f":"VLOOKUP(B85,ALLdata!A:F,6,FALSE)","v":"A simple, straightforward universal referral form is used."},null,null,null,null,null,"Best Practice Rating:",null,null,null,null,null,0,null,null,null,null,null,null,null,null,"A simple, straightforward universal referral form is used.","Best Practice Rating:"]
[null,null,null,null,"Evidence:",null,null,null,null,null,null,null,null,null,null,null,1,null,null,null,null,null,null,null,null,"Evidence:",0]
[null,{"$f":"LEFT(B85,6)&D87","v":"E-BP6-f"},null,"f",{"$f":"VLOOKUP(B87,ALLdata!A:F,6,FALSE)","v":"A universal checklist for identifying eligible children is used to streamline identification and reduce the need for screening/comprehensive evaluation."},null,null,null,null,null,"Best Practice Rating:",null,null,null,null,null,0,null,null,null,null,null,null,null,null,"A universal checklist for identifying eligible children is used to streamline identification and reduce the need for screening/comprehensive evaluation.","Best Practice Rating:"]
[null,null,null,null,"Evidence:",null,null,null,null,null,null,null,null,null,null,null,1,null,null,null,null,null,null,null,null,"Evidence:",0]
[null,{"$f":"LEFT(B87,6)&D89","v":"E-BP6-g"},null,"g",{"$f":"VLOOKUP(B89,ALLdata!A:F,6,FALSE)","v":"Children with established conditions with a high probability of developmental delay are automatically referred to Part C and are presumed eligible."},null,null,null,null,null,"Best Practice Rating:",null,null,null,null,null,0,null,null,null,null,null,null,null,null,"Children with established conditions with a high probability of developmental delay are automatically referred to Part C and are presumed eligible.","Best Practice Rating:"]
[null,null,null,null,"Evidence:",null,null,null,null,null,null,null,null,null,null,null,1,null,null,null,null,null,null,null,null,"Evidence:",0]
[null,{"$f":"LEFT(B89,6)&D91","v":"E-BP6-h"},null,"h",{"$f":"VLOOKUP(B91,ALLdata!A:F,6,FALSE)","v":"Children with clinical findings consistent with congenital Zika syndrome born to mothers with possible Zika virus exposure in pregnancy are automatically referred to Part C and presumed eligible."},null,null,null,null,null,"Best Practice Rating:",null,null,null,null,null,{"$f":"IF(E91=\"Evidence:\",1,0)","v":0},null,null,null,null,null,null,null,null,{"$f":"E91&F91","v":"Children with clinical findings consistent with congenital Zika syndrome born to mothers with possible Zika virus exposure in pregnancy are automatically referred to Part C and presumed eligible."},{"$f":"K91","v":"Best Practice Rating:"}]
[null,null,null,null,"Evidence:",null,null,null,null,null,null,null,null,null,null,null,1,null,null,null,null,null,null,null,null,"Evidence:",0]
[null,{"$f":"LEFT(B89,6)&D93","v":"E-BP6-i"},null,"i",{"$f":"VLOOKUP(B93,ALLdata!A:F,6,FALSE)","v":"A decision-making algorithm is used to expedite enrollment in Part C."},null,null,null,null,null,"Best Practice Rating:",null,null,null,null,null,0,null,null,null,null,null,null,null,null,"A decision-making algorithm is used to expedite enrollment in Part C.","Best Practice Rating:"]
[null,null,null,null,"Evidence:",null,null,null,null,null,null,null,null,null,null,null,1,null,null,null,null,null,null,null,null,"Evidence:",0]
[null,{"$f":"LEFT(B91,6)&D95","v":"E-BP6-j"},null,"j",{"$f":"VLOOKUP(B95,ALLdata!A:F,6,FALSE)","v":"Infants born less than or equal to 1500 grams (3.3 lbs.) or less than 37 weeks of gestational age are considered a diagnosed physical or mental condition and eligible to receive EI services."},null,null,null,null,null,"Best Practice Rating:",null,null,null,null,null,{"$f":"IF(E95=\"Evidence:\",1,0)","v":0},null,null,null,null,null,null,null,null,{"$f":"E95&F95","v":"Infants born less than or equal to 1500 grams (3.3 lbs.) or less than 37 weeks of gestational age are considered a diagnosed physical or mental condition and eligible to receive EI services."},{"$f":"K95","v":"Best Practice Rating:"}]
[null,null,null,null,"Evidence:",null,null,null,null,null,null,null,null,null,null,null,1,null,null,null,null,null,null,null,null,"Evidence:",0]
[]
[null,{"$f":"IF(LEN(D98)>1,\"Q-\"&LEFT(D98,2)&RIGHT(D98)&\"-0\",\"E-\"&MID(B97,3,3)&\"-\"&D98)","v":"Q-BP7-0"},null,"BP 7",{"$f":"VLOOKUP(B98,ALLdata!A:F,6,FALSE)","v":"Responding to Children Found Ineligible for Early Intervention"},null,null,null,null,null,"Theme Rating: ",{"$f":"VLOOKUP(B98,ALLdata!A:H,8,FALSE)","v":0},null,null,null,null,{"$f":"IF(E98=\"Evidence:\",1,0)","v":0},null,null,null,null,null,null,null,null,{"$f":"E98&F98","v":"Responding to Children Found Ineligible for Early Intervention"},{"$f":"K98","v":"Theme Rating: "}]
[null,null,null,null,"Children who are at risk but who do not initially meet eligibility criteria for early intervention have an increased likelihood of qualifying for early intervention later. Practices in this section focus on connecting families with other community agencies and resources and continued developmental surveillance when a child is found ineligible for early intervention.",null,null,null,null,null,null,null,null,null,null,null,1,null,null,null,null,null,null,null,null,"Children who are at risk but who do not initially meet eligibility criteria for early intervention have an increased likelihood of qualifying for early intervention later. Practices in this section focus on connecting families with other community agencies and resources and continued developmental surveillance when a child is found ineligible for early intervention."]
[null,{"$f":"IF(LEN(D100)>1,\"Q-\"&LEFT(D100,2)&RIGHT(D100)&\"-0\",\"E-\"&MID(B98,3,3)&\"-\"&D100)","v":"E-BP7-a"},null,"a",{"$f":"VLOOKUP(B100,ALLdata!A:F,6,FALSE)","v":"Connect families with other community resources to meet needs EI does not address."},null,null,null,null,null,"Best Practice Rating:",null,null,null,null,null,0,null,null,null,null,null,null,null,null,"Connect families with other community resources to meet needs EI does not address.",{"$f":"K100","v":"Best Practice Rating:"}]
[null,null,null,null,"Evidence:",null,null,null,null,null,null,null,null,null,null,null,1,null,null,null,null,null,null,null,null,"Evidence:",0]
[null,{"$f":"LEFT(B100,6)&D102","v":"E-BP7-b"},null,"b",{"$f":"VLOOKUP(B102,ALLdata!A:F,6,FALSE)","v":"Promote linkages between early identification services and a network of treatment services so that children’s developmental concerns are addressed."},null,null,null,null,null,"Best Practice Rating:",null,null,null,null,null,0,null,null,null,null,null,null,null,null,"Promote linkages between early identification services and a network of treatment services so that children’s developmental concerns are addressed.","Best Practice Rating:"]
[null,null,null,null,"Evidence:",null,null,null,null,null,null,null,null,null,null,null,1,null,null,null,null,null,null,null,null,"Evidence:",0]
[null,{"$f":"LEFT(B102,6)&D104","v":"E-BP7-c"},null,"c",{"$f":"VLOOKUP(B104,ALLdata!A:F,6,FALSE)","v":"Repeat screening and monitoring for children whose assessment scores indicated they are at risk but who did not meet eligibility criteria."},null,null,null,null,null,"Best Practice Rating:",null,null,null,null,null,0,null,null,null,null,null,null,null,null,"Repeat screening and monitoring for children whose assessment scores indicated they are at risk but who did not meet eligibility criteria.","Best Practice Rating:"]
[null,null,null,null,"Evidence:",null,null,null,null,null,null,null,null,null,null,null,1,null,null,null,null,null,null,null,null,"Evidence:",0]
[null,{"$f":"LEFT(B104,6)&D106","v":"E-BP7-d"},null,"d",{"$f":"VLOOKUP(B106,ALLdata!A:F,6,FALSE)","v":"Support outreach to inform parents about developmental screening and follow up services."},null,null,null,null,null,"Best Practice Rating:",null,null,null,null,null,0,null,null,null,null,null,null,null,null,"Support outreach to inform parents about developmental screening and follow up services.","Best Practice Rating:"]
[null,null,null,null,"Evidence:",null,null,null,null,null,null,null,null,null,null,null,1,null,null,null,null,null,null,null,null,"Evidence:",0]

{"sheet":"Theme Summary","index":4,"n_rows":33,"n_cols":30,"rows_kept":33,"cut":false,"hidden":false,"merged":[[8,12,8,18],[9,2,9,8],[11,2,11,8],[18,12,18,18],[16,12,16,18],[14,12,14,18],[12,12,12,18],[13,2,13,8],[15,2,15,8],[17,2,17,8],[10,12,10,18],[7,2,7,8],[4,12,4,18],[0,26,0,28],[1,26,1,28],[0,21,0,24],[1,21,1,24],[0,19,2,19],[0,2,1,8],[1,9,1,18],[5,2,5,8],[3,2,3,8],[6,12,6,18],[30,2,30,8],[31,12,31,18],[32,2,32,8],[33,12,33,18],[19,12,19,18],[25,12,25,18],[26,2,26,8],[27,12,27,18],[28,2,28,8],[29,12,29,18],[20,2,20,8],[21,12,21,18],[22,2,22,8],[23,12,23,18],[24,2,24,8],[19,2,19,8]]}
[null,null,"THEME SUMMARY",null,null,null,null,null,null,null,null,null,null,null,null,null,null,null,null,"Total # of Practices",null,"# of Practices in this theme",null,null,null,null,"# of Practices in this theme"]
[null,null,null,null,null,null,null,null,null,"Theme Rating",null,null,null,null,null,null,null,null,null,null,null,"with RATING…",null,null,null,null,"with PRIORITY…"]
[null,null,null,null,null,null,null,null,null,"Rating","Priority",null,1,2,3,4,5,6,7,null,null,1,2,3,4,null,"Low","Medium","High"]
[null,null,"Child Find Best Practices"]
[]
["Q-BP1-0","BP 1",{"$f":"VLOOKUP(A6,ALLdata!A:F,6,FALSE)","v":"Collaboration with primary referral sources"},null,null,null,null,null,null,{"$f":"VLOOKUP(A6,ALLdata!A:H,8,FALSE)","v":0},{"$f":"VLOOKUP(A6,ALLdata!A:I,9,FALSE)","v":0},null,{"$f":"VLOOKUP($A6,ALLdata!$A:$I,8,FALSE)","v":0},{"$f":"VLOOKUP($A6,ALLdata!$A:$I,8,FALSE)","v":0},{"$f":"VLOOKUP($A6,ALLdata!$A:$I,8,FALSE)","v":0},{"$f":"VLOOKUP($A6,ALLdata!$A:$I,8,FALSE)","v":0},{"$f":"VLOOKUP($A6,ALLdata!$A:$I,8,FALSE)","v":0},{"$f":"VLOOKUP($A6,ALLdata!$A:$I,8,FALSE)","v":0},{"$f":"VLOOKUP($A6,ALLdata!$A:$I,8,FALSE)","v":0},{"$f":"COUNTIFS(ALLdata!B:B,\"Element\",ALLdata!D:D,B6)","v":6},null,{"$f":"COUNTIFS(ALLdata!$B:$B,\"Element\",ALLdata!$D:$D,$B6,ALLdata!$G:$G,V$3)","v":0},{"$f":"COUNTIFS(ALLdata!$B:$B,\"Element\",ALLdata!$D:$D,$B6,ALLdata!$G:$G,W$3)","v":0},{"$f":"COUNTIFS(ALLdata!$B:$B,\"Element\",ALLdata!$D:$D,$B6,ALLdata!$G:$G,X$3)","v":0},{"$f":"COUNTIFS(ALLdata!$B:$B,\"Element\",ALLdata!$D:$D,$B6,ALLdata!$G:$G,Y$3)","v":0},null,{"$f":"COUNTIFS(ALLdata!$B:$B,\"Element\",ALLdata!$D:$D,$B6,ALLdata!$I:$I,LEFT(AA$3))","v":0},{"$f":"COUNTIFS(ALLdata!$B:$B,\"Element\",ALLdata!$D:$D,$B6,ALLdata!$I:$I,LEFT(AB$3))","v":0},{"$f":"COUNTIFS(ALLdata!$B:$B,\"Element\",ALLdata!$D:$D,$B6,ALLdata!$I:$I,LEFT(AC$3))","v":0},{"$f":"IF(SUM(V6:Y6)=0,\"* Note: No BPs have been rated for this theme.\",\"\")","v":"* Note: No BPs have been rated for this theme."}]
[]
["Q-BP2-0","BP 2",{"$f":"VLOOKUP(A8,ALLdata!A:F,6,FALSE)","v":"Identification of infants and toddlers who are underserved by Part C"},null,null,null,null,null,null,{"$f":"VLOOKUP(A8,ALLdata!A:H,8,FALSE)","v":0},{"$f":"VLOOKUP(A8,ALLdata!A:I,9,FALSE)","v":0},null,{"$f":"VLOOKUP($A8,ALLdata!$A:$I,8,FALSE)","v":0},{"$f":"VLOOKUP($A8,ALLdata!$A:$I,8,FALSE)","v":0},{"$f":"VLOOKUP($A8,ALLdata!$A:$I,8,FALSE)","v":0},{"$f":"VLOOKUP($A8,ALLdata!$A:$I,8,FALSE)","v":0},{"$f":"VLOOKUP($A8,ALLdata!$A:$I,8,FALSE)","v":0},{"$f":"VLOOKUP($A8,ALLdata!$A:$I,8,FALSE)","v":0},{"$f":"VLOOKUP($A8,ALLdata!$A:$I,8,FALSE)","v":0},{"$f":"COUNTIFS(ALLdata!B:B,\"Element\",ALLdata!D:D,B8)","v":3},null,{"$f":"COUNTIFS(ALLdata!$B:$B,\"Element\",ALLdata!$D:$D,$B8,ALLdata!$G:$G,V$3)","v":0},{"$f":"COUNTIFS(ALLdata!$B:$B,\"Element\",ALLdata!$D:$D,$B8,ALLdata!$G:$G,W$3)","v":0},{"$f":"COUNTIFS(ALLdata!$B:$B,\"Element\",ALLdata!$D:$D,$B8,ALLdata!$G:$G,X$3)","v":0},{"$f":"COUNTIFS(ALLdata!$B:$B,\"Element\",ALLdata!$D:$D,$B8,ALLdata!$G:$G,Y$3)","v":0},null,{"$f":"COUNTIFS(ALLdata!$B:$B,\"Element\",ALLdata!$D:$D,$B8,ALLdata!$I:$I,LEFT(AA$3))","v":0},{"$f":"COUNTIFS(ALLdata!$B:$B,\"Element\",ALLdata!$D:$D,$B8,ALLdata!$I:$I,LEFT(AB$3))","v":0},{"$f":"COUNTIFS(ALLdata!$B:$B,\"Element\",ALLdata!$D:$D,$B8,ALLdata!$I:$I,LEFT(AC$3))","v":0},{"$f":"IF(SUM(V8:Y8)=0,\"* Note: No BPs have been rated for this theme.\",\"\")","v":"* Note: No BPs have been rated for this theme."}]
[]
["Q-BP3-0","BP 3",{"$f":"VLOOKUP(A10,ALLdata!A:F,6,FALSE)","v":"Data Systems "},null,null,null,null,null,null,{"$f":"VLOOKUP(A10,ALLdata!A:H,8,FALSE)","v":0},{"$f":"VLOOKUP(A10,ALLdata!A:I,9,FALSE)","v":0},null,{"$f":"VLOOKUP($A10,ALLdata!$A:$I,8,FALSE)","v":0},{"$f":"VLOOKUP($A10,ALLdata!$A:$I,8,FALSE)","v":0},{"$f":"VLOOKUP($A10,ALLdata!$A:$I,8,FALSE)","v":0},{"$f":"VLOOKUP($A10,ALLdata!$A:$I,8,FALSE)","v":0},{"$f":"VLOOKUP($A10,ALLdata!$A:$I,8,FALSE)","v":0},{"$f":"VLOOKUP($A10,ALLdata!$A:$I,8,FALSE)","v":0},{"$f":"VLOOKUP($A10,ALLdata!$A:$I,8,FALSE)","v":0},{"$f":"COUNTIFS(ALLdata!B:B,\"Element\",ALLdata!D:D,B10)","v":5},null,{"$f":"COUNTIFS(ALLdata!$B:$B,\"Element\",ALLdata!$D:$D,$B10,ALLdata!$G:$G,V$3)","v":0},{"$f":"COUNTIFS(ALLdata!$B:$B,\"Element\",ALLdata!$D:$D,$B10,ALLdata!$G:$G,W$3)","v":0},{"$f":"COUNTIFS(ALLdata!$B:$B,\"Element\",ALLdata!$D:$D,$B10,ALLdata!$G:$G,X$3)","v":0},{"$f":"COUNTIFS(ALLdata!$B:$B,\"Element\",ALLdata!$D:$D,$B10,ALLdata!$G:$G,Y$3)","v":0},null,{"$f":"COUNTIFS(ALLdata!$B:$B,\"Element\",ALLdata!$D:$D,$B10,ALLdata!$I:$I,LEFT(AA$3))","v":0},{"$f":"COUNTIFS(ALLdata!$B:$B,\"Element\",ALLdata!$D:$D,$B10,ALLdata!$I:$I,LEFT(AB$3))","v":0},{"$f":"COUNTIFS(ALLdata!$B:$B,\"Element\",ALLdata!$D:$D,$B10,ALLdata!$I:$I,LEFT(AC$3))","v":0},{"$f":"IF(SUM(V10:Y10)=0,\"* Note: No BPs have been rated for this theme.\",\"\")","v":"* Note: No BPs have been rated for this theme."}]
[]
["Q-BP4-0","BP 4",{"$f":"VLOOKUP(A12,ALLdata!A:F,6,FALSE)","v":"Evaluation of Child Find"},null,null,null,null,null,null,{"$f":"VLOOKUP(A12,ALLdata!A:H,8,FALSE)","v":0},{"$f":"VLOOKUP(A12,ALLdata!A:I,9,FALSE)","v":0},null,{"$f":"VLOOKUP($A12,ALLdata!$A:$I,8,FALSE)","v":0},{"$f":"VLOOKUP($A12,ALLdata!$A:$I,8,FALSE)","v":0},{"$f":"VLOOKUP($A12,ALLdata!$A:$I,8,FALSE)","v":0},{"$f":"VLOOKUP($A12,ALLdata!$A:$I,8,FALSE)","v":0},{"$f":"VLOOKUP($A12,ALLdata!$A:$I,8,FALSE)","v":0},{"$f":"VLOOKUP($A12,ALLdata!$A:$I,8,FALSE)","v":0},{"$f":"VLOOKUP($A12,ALLdata!$A:$I,8,FALSE)","v":0},{"$f":"COUNTIFS(ALLdata!B:B,\"Element\",ALLdata!D:D,B12)","v":4},null,{"$f":"COUNTIFS(ALLdata!$B:$B,\"Element\",ALLdata!$D:$D,$B12,ALLdata!$G:$G,V$3)","v":0},{"$f":"COUNTIFS(ALLdata!$B:$B,\"Element\",ALLdata!$D:$D,$B12,ALLdata!$G:$G,W$3)","v":0},{"$f":"COUNTIFS(ALLdata!$B:$B,\"Element\",ALLdata!$D:$D,$B12,ALLdata!$G:$G,X$3)","v":0},{"$f":"COUNTIFS(ALLdata!$B:$B,\"Element\",ALLdata!$D:$D,$B12,ALLdata!$G:$G,Y$3)","v":0},null,{"$f":"COUNTIFS(ALLdata!$B:$B,\"Element\",ALLdata!$D:$D,$B12,ALLdata!$I:$I,LEFT(AA$3))","v":0},{"$f":"COUNTIFS(ALLdata!$B:$B,\"Element\",ALLdata!$D:$D,$B12,ALLdata!$I:$I,LEFT(AB$3))","v":0},{"$f":"COUNTIFS(ALLdata!$B:$B,\"Element\",ALLdata!$D:$D,$B12,ALLdata!$I:$I,LEFT(AC$3))","v":0},{"$f":"IF(SUM(V12:Y12)=0,\"* Note: No BPs have been rated for this theme.\",\"\")","v":"* Note: No BPs have been rated for this theme."}]
[]
["Q-BP5-0","BP 5",{"$f":"VLOOKUP(A14,ALLdata!A:F,6,FALSE)","v":"Technical Adequacy of Screening and Evaluation Tools"},null,null,null,null,null,null,{"$f":"VLOOKUP(A14,ALLdata!A:H,8,FALSE)","v":0},{"$f":"VLOOKUP(A14,ALLdata!A:I,9,FALSE)","v":0},null,{"$f":"VLOOKUP($A14,ALLdata!$A:$I,8,FALSE)","v":0},{"$f":"VLOOKUP($A14,ALLdata!$A:$I,8,FALSE)","v":0},{"$f":"VLOOKUP($A14,ALLdata!$A:$I,8,FALSE)","v":0},{"$f":"VLOOKUP($A14,ALLdata!$A:$I,8,FALSE)","v":0},{"$f":"VLOOKUP($A14,ALLdata!$A:$I,8,FALSE)","v":0},{"$f":"VLOOKUP($A14,ALLdata!$A:$I,8,FALSE)","v":0},{"$f":"VLOOKUP($A14,ALLdata!$A:$I,8,FALSE)","v":0},{"$f":"COUNTIFS(ALLdata!B:B,\"Element\",ALLdata!D:D,B14)","v":6},null,{"$f":"COUNTIFS(ALLdata!$B:$B,\"Element\",ALLdata!$D:$D,$B14,ALLdata!$G:$G,V$3)","v":0},{"$f":"COUNTIFS(ALLdata!$B:$B,\"Element\",ALLdata!$D:$D,$B14,ALLdata!$G:$G,W$3)","v":0},{"$f":"COUNTIFS(ALLdata!$B:$B,\"Element\",ALLdata!$D:$D,$B14,ALLdata!$G:$G,X$3)","v":0},{"$f":"COUNTIFS(ALLdata!$B:$B,\"Element\",ALLdata!$D:$D,$B14,ALLdata!$G:$G,Y$3)","v":0},null,{"$f":"COUNTIFS(ALLdata!$B:$B,\"Element\",ALLdata!$D:$D,$B14,ALLdata!$I:$I,LEFT(AA$3))","v":0},{"$f":"COUNTIFS(ALLdata!$B:$B,\"Element\",ALLdata!$D:$D,$B14,ALLdata!$I:$I,LEFT(AB$3))","v":0},{"$f":"COUNTIFS(ALLdata!$B:$B,\"Element\",ALLdata!$D:$D,$B14,ALLdata!$I:$I,LEFT(AC$3))","v":0},{"$f":"IF(SUM(V14:Y14)=0,\"* Note: No BPs have been rated for this theme.\",\"\")","v":"* Note: No BPs have been rated for this theme."}]
[]
["Q-BP6-0","BP 6",{"$f":"VLOOKUP(A16,ALLdata!A:F,6,FALSE)","v":"Efficiency of Screening, Referral, and Evaluation Process and Procedures"},null,null,null,null,null,null,{"$f":"VLOOKUP(A16,ALLdata!A:H,8,FALSE)","v":0},{"$f":"VLOOKUP(A16,ALLdata!A:I,9,FALSE)","v":0},null,{"$f":"VLOOKUP($A16,ALLdata!$A:$I,8,FALSE)","v":0},{"$f":"VLOOKUP($A16,ALLdata!$A:$I,8,FALSE)","v":0},{"$f":"VLOOKUP($A16,ALLdata!$A:$I,8,FALSE)","v":0},{"$f":"VLOOKUP($A16,ALLdata!$A:$I,8,FALSE)","v":0},{"$f":"VLOOKUP($A16,ALLdata!$A:$I,8,FALSE)","v":0},{"$f":"VLOOKUP($A16,ALLdata!$A:$I,8,FALSE)","v":0},{"$f":"VLOOKUP($A16,ALLdata!$A:$I,8,FALSE)","v":0},{"$f":"COUNTIFS(ALLdata!B:B,\"Element\",ALLdata!D:D,B16)","v":10},null,{"$f":"COUNTIFS(ALLdata!$B:$B,\"Element\",ALLdata!$D:$D,$B16,ALLdata!$G:$G,V$3)","v":0},{"$f":"COUNTIFS(ALLdata!$B:$B,\"Element\",ALLdata!$D:$D,$B16,ALLdata!$G:$G,W$3)","v":0},{"$f":"COUNTIFS(ALLdata!$B:$B,\"Element\",ALLdata!$D:$D,$B16,ALLdata!$G:$G,X$3)","v":0},{"$f":"COUNTIFS(ALLdata!$B:$B,\"Element\",ALLdata!$D:$D,$B16,ALLdata!$G:$G,Y$3)","v":0},null,{"$f":"COUNTIFS(ALLdata!$B:$B,\"Element\",ALLdata!$D:$D,$B16,ALLdata!$I:$I,LEFT(AA$3))","v":0},{"$f":"COUNTIFS(ALLdata!$B:$B,\"Element\",ALLdata!$D:$D,$B16,ALLdata!$I:$I,LEFT(AB$3))","v":0},{"$f":"COUNTIFS(ALLdata!$B:$B,\"Element\",ALLdata!$D:$D,$B16,ALLdata!$I:$I,LEFT(AC$3))","v":0},{"$f":"IF(SUM(V16:Y16)=0,\"* Note: No BPs have been rated for this theme.\",\"\")","v":"* Note: No BPs have been rated for this theme."}]
[]
["Q-BP7-0","BP 7",{"$f":"VLOOKUP(A18,ALLdata!A:F,6,FALSE)","v":"Responding to Children Found Ineligible for Early Intervention"},null,null,null,null,null,null,{"$f":"VLOOKUP(A18,ALLdata!A:H,8,FALSE)","v":0},{"$f":"VLOOKUP(A18,ALLdata!A:I,9,FALSE)","v":0},null,{"$f":"VLOOKUP($A18,ALLdata!$A:$I,8,FALSE)","v":0},{"$f":"VLOOKUP($A18,ALLdata!$A:$I,8,FALSE)","v":0},{"$f":"VLOOKUP($A18,ALLdata!$A:$I,8,FALSE)","v":0},{"$f":"VLOOKUP($A18,ALLdata!$A:$I,8,FALSE)","v":0},{"$f":"VLOOKUP($A18,ALLdata!$A:$I,8,FALSE)","v":0},{"$f":"VLOOKUP($A18,ALLdata!$A:$I,8,FALSE)","v":0},{"$f":"VLOOKUP($A18,ALLdata!$A:$I,8,FALSE)","v":0},{"$f":"COUNTIFS(ALLdata!B:B,\"Element\",ALLdata!D:D,B18)","v":4},null,{"$f":"COUNTIFS(ALLdata!$B:$B,\"Element\",ALLdata!$D:$D,$B18,ALLdata!$G:$G,V$3)","v":0},{"$f":"COUNTIFS(ALLdata!$B:$B,\"Element\",ALLdata!$D:$D,$B18,ALLdata!$G:$G,W$3)","v":0},{"$f":"COUNTIFS(ALLdata!$B:$B,\"Element\",ALLdata!$D:$D,$B18,ALLdata!$G:$G,X$3)","v":0},{"$f":"COUNTIFS(ALLdata!$B:$B,\"Element\",ALLdata!$D:$D,$B18,ALLdata!$G:$G,Y$3)","v":0},null,{"$f":"COUNTIFS(ALLdata!$B:$B,\"Element\",ALLdata!$D:$D,$B18,ALLdata!$I:$I,LEFT(AA$3))","v":0},{"$f":"COUNTIFS(ALLdata!$B:$B,\"Element\",ALLdata!$D:$D,$B18,ALLdata!$I:$I,LEFT(AB$3))","v":0},{"$f":"COUNTIFS(ALLdata!$B:$B,\"Element\",ALLdata!$D:$D,$B18,ALLdata!$I:$I,LEFT(AC$3))","v":0},{"$f":"IF(SUM(V18:Y18)=0,\"* Note: No BPs have been rated for this theme.\",\"\")","v":"* Note: No BPs have been rated for this theme."}]
[]
[null,null,"Page 2",null,null,null,null,null,null,"Rating","Priority"]
["Q-P21-0","P2 1",{"$f":"VLOOKUP(A21,ALLdata!A:F,6,FALSE)","v":{"$error":"#N/A"}},null,null,null,null,null,null,{"$f":"VLOOKUP(A21,ALLdata!A:H,8,FALSE)","v":{"$error":"#N/A"}},{"$f":"VLOOKUP(A21,ALLdata!A:I,9,FALSE)","v":{"$error":"#N/A"}},null,{"$f":"VLOOKUP($A21,ALLdata!$A:$I,8,FALSE)","v":{"$error":"#N/A"}},{"$f":"VLOOKUP($A21,ALLdata!$A:$I,8,FALSE)","v":{"$error":"#N/A"}},{"$f":"VLOOKUP($A21,ALLdata!$A:$I,8,FALSE)","v":{"$error":"#N/A"}},{"$f":"VLOOKUP($A21,ALLdata!$A:$I,8,FALSE)","v":{"$error":"#N/A"}},{"$f":"VLOOKUP($A21,ALLdata!$A:$I,8,FALSE)","v":{"$error":"#N/A"}},{"$f":"VLOOKUP($A21,ALLdata!$A:$I,8,FALSE)","v":{"$error":"#N/A"}},{"$f":"VLOOKUP($A21,ALLdata!$A:$I,8,FALSE)","v":{"$error":"#N/A"}},{"$f":"COUNTIFS(ALLdata!B:B,\"Element\",ALLdata!D:D,B21)","v":0},null,{"$f":"COUNTIFS(ALLdata!$B:$B,\"Element\",ALLdata!$D:$D,B21,ALLdata!$G:$G,#REF!)","v":0},{"$f":"COUNTIFS(ALLdata!$B:$B,\"Element\",ALLdata!$D:$D,B21,ALLdata!$G:$G,#REF!)","v":0},{"$f":"COUNTIFS(ALLdata!$B:$B,\"Element\",ALLdata!$D:$D,B21,ALLdata!$G:$G,#REF!)","v":0},{"$f":"COUNTIFS(ALLdata!$B:$B,\"Element\",ALLdata!$D:$D,B21,ALLdata!$G:$G,#REF!)","v":0},null,{"$f":"COUNTIFS(ALLdata!$B:$B,\"Element\",ALLdata!$D:$D,B21,ALLdata!$I:$I,LEFT(#REF!))","v":0},{"$f":"COUNTIFS(ALLdata!$B:$B,\"Element\",ALLdata!$D:$D,B21,ALLdata!$I:$I,LEFT(#REF!))","v":0},{"$f":"COUNTIFS(ALLdata!$B:$B,\"Element\",ALLdata!$D:$D,B21,ALLdata!$I:$I,LEFT(#REF!))","v":0}]
[]
["Q-P22-0","P2 2",{"$f":"VLOOKUP(A23,ALLdata!A:F,6,FALSE)","v":{"$error":"#N/A"}},null,null,null,null,null,null,{"$f":"VLOOKUP(A23,ALLdata!A:H,8,FALSE)","v":{"$error":"#N/A"}},{"$f":"VLOOKUP(A23,ALLdata!A:I,9,FALSE)","v":{"$error":"#N/A"}},null,{"$f":"VLOOKUP($A23,ALLdata!$A:$I,8,FALSE)","v":{"$error":"#N/A"}},{"$f":"VLOOKUP($A23,ALLdata!$A:$I,8,FALSE)","v":{"$error":"#N/A"}},{"$f":"VLOOKUP($A23,ALLdata!$A:$I,8,FALSE)","v":{"$error":"#N/A"}},{"$f":"VLOOKUP($A23,ALLdata!$A:$I,8,FALSE)","v":{"$error":"#N/A"}},{"$f":"VLOOKUP($A23,ALLdata!$A:$I,8,FALSE)","v":{"$error":"#N/A"}},{"$f":"VLOOKUP($A23,ALLdata!$A:$I,8,FALSE)","v":{"$error":"#N/A"}},{"$f":"VLOOKUP($A23,ALLdata!$A:$I,8,FALSE)","v":{"$error":"#N/A"}},{"$f":"COUNTIFS(ALLdata!B:B,\"Element\",ALLdata!D:D,B23)","v":0},null,{"$f":"COUNTIFS(ALLdata!$B:$B,\"Element\",ALLdata!$D:$D,B23,ALLdata!$G:$G,#REF!)","v":0},{"$f":"COUNTIFS(ALLdata!$B:$B,\"Element\",ALLdata!$D:$D,B23,ALLdata!$G:$G,#REF!)","v":0},{"$f":"COUNTIFS(ALLdata!$B:$B,\"Element\",ALLdata!$D:$D,B23,ALLdata!$G:$G,#REF!)","v":0},{"$f":"COUNTIFS(ALLdata!$B:$B,\"Element\",ALLdata!$D:$D,B23,ALLdata!$G:$G,#REF!)","v":0},null,{"$f":"COUNTIFS(ALLdata!$B:$B,\"Element\",ALLdata!$D:$D,B23,ALLdata!$I:$I,LEFT(#REF!))","v":0},{"$f":"COUNTIFS(ALLdata!$B:$B,\"Element\",ALLdata!$D:$D,B23,ALLdata!$I:$I,LEFT(#REF!))","v":0},{"$f":"COUNTIFS(ALLdata!$B:$B,\"Element\",ALLdata!$D:$D,B23,ALLdata!$I:$I,LEFT(#REF!))","v":0}]
[]
["Q-P23-0","P2 3",{"$f":"VLOOKUP(A25,ALLdata!A:F,6,FALSE)","v":{"$error":"#N/A"}},null,null,null,null,null,null,{"$f":"VLOOKUP(A25,ALLdata!A:H,8,FALSE)","v":{"$error":"#N/A"}},{"$f":"VLOOKUP(A25,ALLdata!A:I,9,FALSE)","v":{"$error":"#N/A"}},null,{"$f":"VLOOKUP($A25,ALLdata!$A:$I,8,FALSE)","v":{"$error":"#N/A"}},{"$f":"VLOOKUP($A25,ALLdata!$A:$I,8,FALSE)","v":{"$error":"#N/A"}},{"$f":"VLOOKUP($A25,ALLdata!$A:$I,8,FALSE)","v":{"$error":"#N/A"}},{"$f":"VLOOKUP($A25,ALLdata!$A:$I,8,FALSE)","v":{"$error":"#N/A"}},{"$f":"VLOOKUP($A25,ALLdata!$A:$I,8,FALSE)","v":{"$error":"#N/A"}},{"$f":"VLOOKUP($A25,ALLdata!$A:$I,8,FALSE)","v":{"$error":"#N/A"}},{"$f":"VLOOKUP($A25,ALLdata!$A:$I,8,FALSE)","v":{"$error":"#N/A"}},{"$f":"COUNTIFS(ALLdata!B:B,\"Element\",ALLdata!D:D,B25)","v":0},null,{"$f":"COUNTIFS(ALLdata!$B:$B,\"Element\",ALLdata!$D:$D,B25,ALLdata!$G:$G,#REF!)","v":0},{"$f":"COUNTIFS(ALLdata!$B:$B,\"Element\",ALLdata!$D:$D,B25,ALLdata!$G:$G,#REF!)","v":0},{"$f":"COUNTIFS(ALLdata!$B:$B,\"Element\",ALLdata!$D:$D,B25,ALLdata!$G:$G,#REF!)","v":0},{"$f":"COUNTIFS(ALLdata!$B:$B,\"Element\",ALLdata!$D:$D,B25,ALLdata!$G:$G,#REF!)","v":0},null,{"$f":"COUNTIFS(ALLdata!$B:$B,\"Element\",ALLdata!$D:$D,B25,ALLdata!$I:$I,LEFT(#REF!))","v":0},{"$f":"COUNTIFS(ALLdata!$B:$B,\"Element\",ALLdata!$D:$D,B25,ALLdata!$I:$I,LEFT(#REF!))","v":0},{"$f":"COUNTIFS(ALLdata!$B:$B,\"Element\",ALLdata!$D:$D,B25,ALLdata!$I:$I,LEFT(#REF!))","v":0}]
[]
["Q-P24-0","P2 4",{"$f":"VLOOKUP(A27,ALLdata!A:F,6,FALSE)","v":{"$error":"#N/A"}},null,null,null,null,null,null,{"$f":"VLOOKUP(A27,ALLdata!A:H,8,FALSE)","v":{"$error":"#N/A"}},{"$f":"VLOOKUP(A27,ALLdata!A:I,9,FALSE)","v":{"$error":"#N/A"}},null,{"$f":"VLOOKUP($A27,ALLdata!$A:$I,8,FALSE)","v":{"$error":"#N/A"}},{"$f":"VLOOKUP($A27,ALLdata!$A:$I,8,FALSE)","v":{"$error":"#N/A"}},{"$f":"VLOOKUP($A27,ALLdata!$A:$I,8,FALSE)","v":{"$error":"#N/A"}},{"$f":"VLOOKUP($A27,ALLdata!$A:$I,8,FALSE)","v":{"$error":"#N/A"}},{"$f":"VLOOKUP($A27,ALLdata!$A:$I,8,FALSE)","v":{"$error":"#N/A"}},{"$f":"VLOOKUP($A27,ALLdata!$A:$I,8,FALSE)","v":{"$error":"#N/A"}},{"$f":"VLOOKUP($A27,ALLdata!$A:$I,8,FALSE)","v":{"$error":"#N/A"}},{"$f":"COUNTIFS(ALLdata!B:B,\"Element\",ALLdata!D:D,B27)","v":0},null,{"$f":"COUNTIFS(ALLdata!$B:$B,\"Element\",ALLdata!$D:$D,B27,ALLdata!$G:$G,#REF!)","v":0},{"$f":"COUNTIFS(ALLdata!$B:$B,\"Element\",ALLdata!$D:$D,B27,ALLdata!$G:$G,#REF!)","v":0},{"$f":"COUNTIFS(ALLdata!$B:$B,\"Element\",ALLdata!$D:$D,B27,ALLdata!$G:$G,#REF!)","v":0},{"$f":"COUNTIFS(ALLdata!$B:$B,\"Element\",ALLdata!$D:$D,B27,ALLdata!$G:$G,#REF!)","v":0},null,{"$f":"COUNTIFS(ALLdata!$B:$B,\"Element\",ALLdata!$D:$D,B27,ALLdata!$I:$I,LEFT(#REF!))","v":0},{"$f":"COUNTIFS(ALLdata!$B:$B,\"Element\",ALLdata!$D:$D,B27,ALLdata!$I:$I,LEFT(#REF!))","v":0},{"$f":"COUNTIFS(ALLdata!$B:$B,\"Element\",ALLdata!$D:$D,B27,ALLdata!$I:$I,LEFT(#REF!))","v":0}]
[]
["Q-P25-0","P2 5",{"$f":"VLOOKUP(A29,ALLdata!A:F,6,FALSE)","v":{"$error":"#N/A"}},null,null,null,null,null,null,{"$f":"VLOOKUP(A29,ALLdata!A:H,8,FALSE)","v":{"$error":"#N/A"}},{"$f":"VLOOKUP(A29,ALLdata!A:I,9,FALSE)","v":{"$error":"#N/A"}},null,{"$f":"VLOOKUP($A29,ALLdata!$A:$I,8,FALSE)","v":{"$error":"#N/A"}},{"$f":"VLOOKUP($A29,ALLdata!$A:$I,8,FALSE)","v":{"$error":"#N/A"}},{"$f":"VLOOKUP($A29,ALLdata!$A:$I,8,FALSE)","v":{"$error":"#N/A"}},{"$f":"VLOOKUP($A29,ALLdata!$A:$I,8,FALSE)","v":{"$error":"#N/A"}},{"$f":"VLOOKUP($A29,ALLdata!$A:$I,8,FALSE)","v":{"$error":"#N/A"}},{"$f":"VLOOKUP($A29,ALLdata!$A:$I,8,FALSE)","v":{"$error":"#N/A"}},{"$f":"VLOOKUP($A29,ALLdata!$A:$I,8,FALSE)","v":{"$error":"#N/A"}},{"$f":"COUNTIFS(ALLdata!B:B,\"Element\",ALLdata!D:D,B29)","v":0},null,{"$f":"COUNTIFS(ALLdata!$B:$B,\"Element\",ALLdata!$D:$D,B29,ALLdata!$G:$G,#REF!)","v":0},{"$f":"COUNTIFS(ALLdata!$B:$B,\"Element\",ALLdata!$D:$D,B29,ALLdata!$G:$G,#REF!)","v":0},{"$f":"COUNTIFS(ALLdata!$B:$B,\"Element\",ALLdata!$D:$D,B29,ALLdata!$G:$G,#REF!)","v":0},{"$f":"COUNTIFS(ALLdata!$B:$B,\"Element\",ALLdata!$D:$D,B29,ALLdata!$G:$G,#REF!)","v":0},null,{"$f":"COUNTIFS(ALLdata!$B:$B,\"Element\",ALLdata!$D:$D,B29,ALLdata!$I:$I,LEFT(#REF!))","v":0},{"$f":"COUNTIFS(ALLdata!$B:$B,\"Element\",ALLdata!$D:$D,B29,ALLdata!$I:$I,LEFT(#REF!))","v":0},{"$f":"COUNTIFS(ALLdata!$B:$B,\"Element\",ALLdata!$D:$D,B29,ALLdata!$I:$I,LEFT(#REF!))","v":0}]
[]
["Q-P26-0","P2 6",{"$f":"VLOOKUP(A31,ALLdata!A:F,6,FALSE)","v":{"$error":"#N/A"}},null,null,null,null,null,null,{"$f":"VLOOKUP(A31,ALLdata!A:H,8,FALSE)","v":{"$error":"#N/A"}},{"$f":"VLOOKUP(A31,ALLdata!A:I,9,FALSE)","v":{"$error":"#N/A"}},null,{"$f":"VLOOKUP($A31,ALLdata!$A:$I,8,FALSE)","v":{"$error":"#N/A"}},{"$f":"VLOOKUP($A31,ALLdata!$A:$I,8,FALSE)","v":{"$error":"#N/A"}},{"$f":"VLOOKUP($A31,ALLdata!$A:$I,8,FALSE)","v":{"$error":"#N/A"}},{"$f":"VLOOKUP($A31,ALLdata!$A:$I,8,FALSE)","v":{"$error":"#N/A"}},{"$f":"VLOOKUP($A31,ALLdata!$A:$I,8,FALSE)","v":{"$error":"#N/A"}},{"$f":"VLOOKUP($A31,ALLdata!$A:$I,8,FALSE)","v":{"$error":"#N/A"}},{"$f":"VLOOKUP($A31,ALLdata!$A:$I,8,FALSE)","v":{"$error":"#N/A"}},{"$f":"COUNTIFS(ALLdata!B:B,\"Element\",ALLdata!D:D,B31)","v":0},null,{"$f":"COUNTIFS(ALLdata!$B:$B,\"Element\",ALLdata!$D:$D,B31,ALLdata!$G:$G,#REF!)","v":0},{"$f":"COUNTIFS(ALLdata!$B:$B,\"Element\",ALLdata!$D:$D,B31,ALLdata!$G:$G,#REF!)","v":0},{"$f":"COUNTIFS(ALLdata!$B:$B,\"Element\",ALLdata!$D:$D,B31,ALLdata!$G:$G,#REF!)","v":0},{"$f":"COUNTIFS(ALLdata!$B:$B,\"Element\",ALLdata!$D:$D,B31,ALLdata!$G:$G,#REF!)","v":0},null,{"$f":"COUNTIFS(ALLdata!$B:$B,\"Element\",ALLdata!$D:$D,B31,ALLdata!$I:$I,LEFT(#REF!))","v":0},{"$f":"COUNTIFS(ALLdata!$B:$B,\"Element\",ALLdata!$D:$D,B31,ALLdata!$I:$I,LEFT(#REF!))","v":0},{"$f":"COUNTIFS(ALLdata!$B:$B,\"Element\",ALLdata!$D:$D,B31,ALLdata!$I:$I,LEFT(#REF!))","v":0}]
[]
["Q-P27-0","P2 7",{"$f":"VLOOKUP(A33,ALLdata!A:F,6,FALSE)","v":{"$error":"#N/A"}},null,null,null,null,null,null,{"$f":"VLOOKUP(A33,ALLdata!A:H,8,FALSE)","v":{"$error":"#N/A"}},{"$f":"VLOOKUP(A33,ALLdata!A:I,9,FALSE)","v":{"$error":"#N/A"}},null,{"$f":"VLOOKUP($A33,ALLdata!$A:$I,8,FALSE)","v":{"$error":"#N/A"}},{"$f":"VLOOKUP($A33,ALLdata!$A:$I,8,FALSE)","v":{"$error":"#N/A"}},{"$f":"VLOOKUP($A33,ALLdata!$A:$I,8,FALSE)","v":{"$error":"#N/A"}},{"$f":"VLOOKUP($A33,ALLdata!$A:$I,8,FALSE)","v":{"$error":"#N/A"}},{"$f":"VLOOKUP($A33,ALLdata!$A:$I,8,FALSE)","v":{"$error":"#N/A"}},{"$f":"VLOOKUP($A33,ALLdata!$A:$I,8,FALSE)","v":{"$error":"#N/A"}},{"$f":"VLOOKUP($A33,ALLdata!$A:$I,8,FALSE)","v":{"$error":"#N/A"}},{"$f":"COUNTIFS(ALLdata!B:B,\"Element\",ALLdata!D:D,B33)","v":0},null,{"$f":"COUNTIFS(ALLdata!$B:$B,\"Element\",ALLdata!$D:$D,B33,ALLdata!$G:$G,#REF!)","v":0},{"$f":"COUNTIFS(ALLdata!$B:$B,\"Element\",ALLdata!$D:$D,B33,ALLdata!$G:$G,#REF!)","v":0},{"$f":"COUNTIFS(ALLdata!$B:$B,\"Element\",ALLdata!$D:$D,B33,ALLdata!$G:$G,#REF!)","v":0},{"$f":"COUNTIFS(ALLdata!$B:$B,\"Element\",ALLdata!$D:$D,B33,ALLdata!$G:$G,#REF!)","v":0},null,{"$f":"COUNTIFS(ALLdata!$B:$B,\"Element\",ALLdata!$D:$D,B33,ALLdata!$I:$I,LEFT(#REF!))","v":0},{"$f":"COUNTIFS(ALLdata!$B:$B,\"Element\",ALLdata!$D:$D,B33,ALLdata!$I:$I,LEFT(#REF!))","v":0},{"$f":"COUNTIFS(ALLdata!$B:$B,\"Element\",ALLdata!$D:$D,B33,ALLdata!$I:$I,LEFT(#REF!))","v":0}]

{"sheet":"Action Plan","index":5,"n_rows":257,"n_cols":17,"rows_kept":257,"cut":false,"hidden":false,"merged":[[7,1,26,1],[2,0,5,1],[6,0,11,0],[0,1,1,1],[3,14,3,16],[4,14,4,16],[3,8,4,12],[3,4,3,6],[4,4,4,6]]}
[null,"Action Plan"]
[]
[" jump to:"]
[null,null,null,null,"Planning Team Members",null,null,null,"Child Find Improvement Plan",null,null,null,null,null,"Stakeholder Involvement"]
[null,null,null,null,"State Child Find Planning Team Members, Role and Organization Represented",null,null,null,null,null,null,null,null,null,"Describe the stakeholders and how they will be involved in the self-assessment and improvement plan."]
[]
[null,null,null,null,"Child Find Planning Team Member","Role","Organization",null,"Outcomes of activities","Activities to improve Child Find","Resources Needed (fiscal, partners, personnel, materials)","Who Is Responsible ","Timeline (projected initiation & completion dates)",null,"Stakeholder(s)","How will they be involved?","Timeline"]
[null,"\nInstructions:\n\nFill out the charts to the right. Use as many rows as necessary.\n\nNOTE ON PRINTING: \nIf you would like to print, this page is set up to print each chart on its own page, going across.  You will want to print only the pages that have data in them - if you print this whole tab you may end up with many pages with no information.",1]
[null,null,2]
[null,null,3]
[null,null,4]
[null,null,5]
[null,null,6]
[null,null,7]
[null,null,8]
[null,null,9]
[null,null,10]
[null,null,11]
[null,null,12]
[null,null,13]
[null,null,14]
[null,null,15]
[null,null,16]
[null,null,17]
[null,null,18]
[null,null,19]
[null,null,20]
[null,null,21]
[null,null,22]
[null,null,23]
[null,null,24]
[null,null,25]
[null,null,26]
[null,null,27]
[null,null,28]
[null,null,29]
[null,null,30]
[null,null,31]
[null,null,32]
[null,null,33]
[null,null,34]
[null,null,35]
[null,null,36]
[null,null,37]
[null,null,38]
[null,null,39]
[null,null,40]
[null,null,41]
[null,null,42]
[null,null,43]
[null,null,44]
[null,null,45]
[null,null,46]
[null,null,47]
[null,null,48]
[null,null,49]
[null,null,50]
[null,null,51]
[null,null,52]
[null,null,53]
[null,null,54]
[null,null,55]
[null,null,56]
[null,null,57]
[null,null,58]
[null,null,59]
[null,null,60]
[null,null,61]
[null,null,62]
[null,null,63]
[null,null,64]
[null,null,65]
[null,null,66]
[null,null,67]
[null,null,68]
[null,null,69]
[null,null,70]
[null,null,71]
[null,null,72]
[null,null,73]
[null,null,74]
[null,null,75]
[null,null,76]
[null,null,77]
[null,null,78]
[null,null,79]
[null,null,80]
[null,null,81]
[null,null,82]
[null,null,83]
[null,null,84]
[null,null,85]
[null,null,86]
[null,null,87]
[null,null,88]
[null,null,89]
[null,null,90]
[null,null,91]
[null,null,92]
[null,null,93]
[null,null,94]
[null,null,95]
[null,null,96]
[null,null,97]
[null,null,98]
[null,null,99]
[null,null,100]
[null,null,101]
[null,null,102]
[null,null,103]
[null,null,104]
[null,null,105]
[null,null,106]
[null,null,107]
[null,null,108]
[null,null,109]
[null,null,110]
[null,null,111]
[null,null,112]
[null,null,113]
[null,null,114]
[null,null,115]
[null,null,116]
[null,null,117]
[null,null,118]
[null,null,119]
[null,null,120]
[null,null,121]
[null,null,122]
[null,null,123]
[null,null,124]
[null,null,125]
[null,null,126]
[null,null,127]
[null,null,128]
[null,null,129]
[null,null,130]
[null,null,131]
[null,null,132]
[null,null,133]
[null,null,134]
[null,null,135]
[null,null,136]
[null,null,137]
[null,null,138]
[null,null,139]
[null,null,140]
[null,null,141]
[null,null,142]
[null,null,143]
[null,null,144]
[null,null,145]
[null,null,146]
[null,null,147]
[null,null,148]
[null,null,149]
[null,null,150]
[null,null,151]
[null,null,152]
[null,null,153]
[null,null,154]
[null,null,155]
[null,null,156]
[null,null,157]
[null,null,158]
[null,null,159]
[null,null,160]
[null,null,161]
[null,null,162]
[null,null,163]
[null,null,164]
[null,null,165]
[null,null,166]
[null,null,167]
[null,null,168]
[null,null,169]
[null,null,170]
[null,null,171]
[null,null,172]
[null,null,173]
[null,null,174]
[null,null,175]
[null,null,176]
[null,null,177]
[null,null,178]
[null,null,179]
[null,null,180]
[null,null,181]
[null,null,182]
[null,null,183]
[null,null,184]
[null,null,185]
[null,null,186]
[null,null,187]
[null,null,188]
[null,null,189]
[null,null,190]
[null,null,191]
[null,null,192]
[null,null,193]
[null,null,194]
[null,null,195]
[null,null,196]
[null,null,197]
[null,null,198]
[null,null,199]
[null,null,200]
[null,null,201]
[null,null,202]
[null,null,203]
[null,null,204]
[null,null,205]
[null,null,206]
[null,null,207]
[null,null,208]
[null,null,209]
[null,null,210]
[null,null,211]
[null,null,212]
[null,null,213]
[null,null,214]
[null,null,215]
[null,null,216]
[null,null,217]
[null,null,218]
[null,null,219]
[null,null,220]
[null,null,221]
[null,null,222]
[null,null,223]
[null,null,224]
[null,null,225]
[null,null,226]
[null,null,227]
[null,null,228]
[null,null,229]
[null,null,230]
[null,null,231]
[null,null,232]
[null,null,233]
[null,null,234]
[null,null,235]
[null,null,236]
[null,null,237]
[null,null,238]
[null,null,239]
[null,null,240]
[null,null,241]
[null,null,242]
[null,null,243]
[null,null,244]
[null,null,245]
[null,null,246]
[null,null,247]
[null,null,248]
[null,null,249]
[null,null,250]

{"sheet":"Data","index":6,"n_rows":47,"n_cols":14,"rows_kept":47,"cut":false,"hidden":false,"merged":[]}
["Index","Type","Component","ThemeNumber","BPNumber","Text","Rating","Priority","Date","Count_Expected","Count_Actual",null,null,"2019-02-06T14:19:14.370"]
["T-BP1-0","Theme","Collaboration","BP 1","-","Collaboration with primary referral sources","-","-","2019-02-06",6,0]
["T-BP2-0","Theme","Identification","BP 2","-","Identification of infants and toddlers who are underserved by Part C","-","-","2019-02-06",3,0]
["T-BP3-0","Theme","DataSystems","BP 3","-","Data Systems ","-","-","2019-02-06",5,0]
["T-BP4-0","Theme","Evaluation","BP 4","-","Evaluation of Child Find","-","-","2019-02-06",4,0]
["T-BP5-0","Theme","Adequacy","BP 5","-","Technical Adequacy of Screening and Evaluation Tools","-","-","2019-02-06",6,0]
["T-BP6-0","Theme","Efficiency","BP 6","-","Efficiency of Screening, Referral, and Evaluation Process and Procedures","-","-","2019-02-06",10,0]
["T-BP7-0","Theme","Ineligible","BP 7","-","Responding to Children Found Ineligible for Early Intervention","-","-","2019-02-06",4,0]
[]
["B-BP1-a","BestPractice","Collaboration","BP 1","a","Referral sources are provided with timely feedback including the status of the referral, outcomes of the referral, child engagement in services, and progress. ","-","-","2019-02-06"]
["B-BP1-b","BestPractice","Collaboration","BP 1","b","“Referral” is clearly defined, and that definition is disseminated to primary referral sources.","-","-","2019-02-06"]
["B-BP1-c","BestPractice","Collaboration","BP 1","c","Policies and procedures support ongoing and effective collaborative relationships with community agencies that serve underserved and at-risk populations. ","-","-","2019-02-06"]
["B-BP1-d","BestPractice","Collaboration","BP 1","d","Implement respectful and appropriate pre-referral education and information-sharing with families to support their understanding of the importance of EI and to reduce stigma.","-","-","2019-02-06"]
["B-BP1-e","BestPractice","Collaboration","BP 1","e","Policies and procedures are in place to support ongoing and effective communication and collaborative relationships with referral agencies (e.g., NICUs, child care programs, pediatricians). ","-","-","2019-02-06"]
["B-BP1-f","BestPractice","Collaboration","BP 1","f","Collaboration with primary referral sources includes education, training, and professional development to support consistent application of referral criteria across sectors, geographic regions, and genders.","-","-","2019-02-06"]
["B-BP2-a","BestPractice","Identification","BP 2","a","Materials describing the child find process are targeted towards underserved populations.","-","-","2019-02-06"]
["B-BP2-b","BestPractice","Identification","BP 2","b","Community health workers and other cultural brokers (i.e., individuals who bridge groups of differing backgrounds to create change, such as interpreters or other community members who may act in both directions between the community and Part C agency) are engaged and support the child find process.","-","-","2019-02-06"]
["B-BP2-c","BestPractice","Identification","BP 2","c","Use strategies such as a 211 telephone-based developmental screening and care coordination as a scalable and cost-effective strategy to reach children who may not have a medical home. (For more information on 211 screening see https://www.zerotothree.org/resources/56-improving-access-to-early-identification-and-intervention-211-la-county-developmental-screening-and-care-coordination)","-","-","2019-02-06"]
["B-BP3-a","BestPractice","DataSystems","BP 3","a","Formal data governance is in place defining the policies related to data security and access.","-","-","2019-02-06"]
["B-BP3-b","BestPractice","DataSystems","BP 3","b","Data system includes sufficient technical (e.g., firewalls, secure laptops, password, management, etc.) and nontechnical (e.g. data access and sharing restrictions, regular staff trainings, ensuring correct access and administrative rights are granted for staff and authorized data users) security measures to minimize the risk of disclosing Personally Identifiable Information (PII).","-","-","2019-02-06"]
["B-BP3-c","BestPractice","DataSystems","BP 3","c","The data system has the capacity to support accountability, program development, and program operations and includes elements and features of high-quality data systems.","-","-","2019-02-06"]
["B-BP3-d","BestPractice","DataSystems","BP 3","d","The Part C state data system has interoperability that allows for linking Part C data to other statewide longitudinal and early childhood data systems.","-","-","2019-02-06"]
["B-BP3-e","BestPractice","DataSystems","BP 3","e","The data collected are high quality.","-","-","2019-02-06"]
["B-BP4-a","BestPractice","Evaluation","BP 4","a","The state has a method for evaluating progress towards best practices, including experiences of parents and primary referral sources.","-","-","2019-02-06"]
["B-BP4-b","BestPractice","Evaluation","BP 4","b","The Part C state data system, directly or through a related application, has reporting and analysis tools that provide end users, including state and local program staff, with easy access* to the data in both raw form and reports. ","-","-","2019-02-06"]
["B-BP4-c","BestPractice","Evaluation","BP 4","c","Reports include metrics useful for monitoring the child find system.","-","-","2019-02-06"]
["B-BP4-d","BestPractice","Evaluation","BP 4","d","Data system features methods for identifying underserved populations.","-","-","2019-02-06"]
["B-BP5-a","BestPractice","Adequacy","BP 5","a","Use of standardized developmental screening and evaluation tools with strong psychometric properties and sufficient sensitivity to detect child progress.","-","-","2019-02-06"]
["B-BP5-b","BestPractice","Adequacy","BP 5","b","Screening tools are brief and with a reduced literacy burden.","-","-","2019-02-06"]
["B-BP5-c","BestPractice","Adequacy","BP 5","c","Developmental screening and evaluation tools include social-emotional development.","-","-","2019-02-06"]
["B-BP5-d","BestPractice","Adequacy","BP 5","d","Individuals conducting screenings and evaluations are trained in their use, scoring, and interpretation.","-","-","2019-02-06"]
["B-BP5-e","BestPractice","Adequacy","BP 5","e","Evaluation tools provide functional information that can be used to inform IFSP development.","-","-","2019-02-06"]
["B-BP5-f","BestPractice","Adequacy","BP 5","f","Implementation of CDC-recommended practices for the diagnosis and management of infants born to mothers with Zika exposure or with potential Zika exposure.","-","-","2019-02-06"]
["B-BP6-a","BestPractice","Efficiency","BP 6","a","Universal screening for all children at set time points.","-","-","2019-02-06"]
["B-BP6-b","BestPractice","Efficiency","BP 6","b","Statewide coordination of screening includes surveillance and screening by primary care physicians.","-","-","2019-02-06"]
["B-BP6-c","BestPractice","Efficiency","BP 6","c","Screening includes family perspectives and is conducted in the child’s dominant language and according to family preferences.","-","-","2019-02-06"]
["B-BP6-d","BestPractice","Efficiency","BP 6","d","Web-based referral or electronic transmission of referrals.","-","-","2019-02-06"]
["B-BP6-e","BestPractice","Efficiency","BP 6","e","A simple, straightforward universal referral form is used.","-","-","2019-02-06"]
["B-BP6-f","BestPractice","Efficiency","BP 6","f","A universal checklist for identifying eligible children is used to streamline identification and reduce the need for screening/comprehensive evaluation.","-","-","2019-02-06"]
["B-BP6-g","BestPractice","Efficiency","BP 6","g","Children with established conditions with a high probability of developmental delay are automatically referred to Part C and are presumed eligible.","-","-","2019-02-06"]
["B-BP6-h","BestPractice","Efficiency","BP 6","h","Children with clinical findings consistent with congenital Zika syndrome born to mothers with possible Zika virus exposure in pregnancy are automatically referred to Part C and presumed eligible.","-","-","2019-02-06"]
["B-BP6-i","BestPractice","Efficiency","BP 6","i","A decision-making algorithm is used to expedite enrollment in Part C.","-","-","2019-02-06"]
["B-BP6-j","BestPractice","Efficiency","BP 6","j","Infants born less than or equal to 1500 grams (3.3 lbs.) or less than 37 weeks of gestational age are considered a diagnosed physical or mental condition and eligible to receive EI services.","-","-","2019-02-06"]
["B-BP7-a","BestPractice","Ineligible","BP 7","a","Connect families with other community resources to meet needs EI does not address.","-","-","2019-02-06"]
["B-BP7-b","BestPractice","Ineligible","BP 7","b","Promote linkages between early identification services and a network of treatment services so that children’s developmental concerns are addressed.","-","-","2019-02-06"]
["B-BP7-c","BestPractice","Ineligible","BP 7","c","Repeat screening and monitoring for children whose assessment scores indicated they are at risk but who did not meet eligibility criteria.","-","-","2019-02-06"]
["B-BP7-d","BestPractice","Ineligible","BP 7","d","Support outreach to inform parents about developmental screening and follow up services.","-","-","2019-02-06"]

{"sheet":"Help","index":7,"n_rows":199,"n_cols":13,"rows_kept":199,"cut":false,"hidden":false,"merged":[[4,0,36,0],[4,1,5,6],[6,1,7,6],[9,1,10,6],[12,1,13,6],[82,1,91,6],[92,1,93,6],[102,1,105,6],[106,1,126,6],[0,1,0,15],[1,1,1,2],[1,3,1,5],[1,6,1,8],[1,9,1,11],[15,1,16,6],[17,1,18,6],[59,1,61,6],[21,1,23,6],[39,1,43,6],[79,1,81,6],[1,12,1,14],[129,0,156,0],[129,1,130,6],[131,1,134,6],[135,1,156,6],[100,0,127,0],[100,1,101,6],[158,0,183,0],[158,1,159,6],[160,1,162,6],[163,1,167,6],[168,1,171,6],[172,1,175,6],[185,0,205,0],[185,1,186,6],[192,1,197,6],[187,1,191,6],[198,1,205,6]]}
[null,"Help!   Click a topic to view more information and some trouble-shooting ideas"]
[null,"Enable Macros",null,"Best Practices Buttons",null,null,"Entering Data",null,null,"Saving PDFs",null,null,"Data tab"]
[]
[]
[null,"Enable Macros in Excel",null,null,null,null,null,null,"For more on enabling macros, please see: https://powerspreadsheets.com/how-to-enable-macros-excel/"]
[]
[null,"When you open this file, you should see a prompt at the top of the window to \"Enable Content.\""]
[]
[]
[null,"If you see this button, click, \"Enable Content\" so that the macros will be allowed to work."]
[]
[]
[null,"If you do NOT see the \"Enable Content\" button, you may need to change your macro settings in Excel."]
[]
[]
[null,"Change Macro Settings in Excel"]
[]
[null,"To begin, click the \"File\" tab at the top left corner of your Excel window."]
[]
[]
[]
[null,"Once you have clicked \"File\" you will see this screen with \"Options\" at the bottom of the list.  Click \"Options.\""]
[]
[]
[]
[]
[]
[]
[]
[]
[]
[]
[]
[]
[]
[]
[]
[]
[]
[null,"After you click \"Options\" in the previous step, you should see this popup window with \"Trust Center\" at the bottom of the list of options on the left. Click \"Trust Center.\""]
[]
[]
[]
[]
[]
[]
[]
[]
[]
[]
[]
[]
[]
[]
[]
[]
[]
[]
[]
[null,"From the Trust Center, select \"Trust Center Settings.\""]
[]
[]
[]
[]
[]
[]
[]
[]
[]
[]
[]
[]
[]
[]
[]
[]
[]
[]
[]
[null,"On the Trust Center Settings, select Macro Settings from the left menu."]
[]
[]
[null,"On this screen you might see that your macro option is set to \"Disable all macros without notification.\"  Change this to \"Disable all macros with notification\" which will give you the option to enable macros each time you open a macro-driven file. These macro settings are in order from more secure (at the top) to less secure (at the bottom), so keeping the ability to selectively enable macros when you choose to do so is your best option."]
[]
[]
[]
[]
[]
[]
[]
[]
[]
[null,"Click \"OK\" twice to finalize your settings."]
[]
[]
[]
[]
[]
[]
[]
[null,"What do all these buttons do?"]
[]
[null,"On the \"Child Find Best Practices\" tab, the rounded-corner buttons and the curved arrow button will allow you to interact with this workbook:"]
[]
[]
[]
[null," - Table of Contents: Link jumps you to Table of Contents tab (and away from this tab)\n - BP 1, BP2, etc.: Each of these multi-colored buttons jumps you to that Best Practice theme.  These are all located in this same tab - you can navigate with these buttons or by scrolling, whichever you prefer.\n - Show Evidence: If the Evidence rows are hidden, this button reveals all the Evidence rows (e.g. rows 15, 17, 19, 21, etc. in the image to the right).\n - Hide Evidence: If the Evidence rows are visible, this button hides all the Evidence rows (e.g. rows 15, 17, 19, 21, etc in the image to the right).\n - PDF with Evidence: First shows all Evidence rows, then creates a PDF of this tab. (Evidence rows will be shown in the PDF and in the workbook).\n - PDF without Evidence: First hides all Evidence rows, then creates a PDF of this tab. (Evidence rows will be hidden in the PDF and in the workbook).\n\nMore information about saving PDFs is included below."]
[]
[]
[]
[]
[]
[]
[]
[]
[]
[]
[]
[]
[]
[]
[]
[]
[]
[]
[]
[]
[]
[]
[null,"How to Enter Data"]
[]
[null,"On the \"Child Find Best Practices\" tab, the light yellow cells are the only places where you can add text or enter ratings for your program."]
[]
[]
[]
[null," - Evidence: You may wish to include notes or evidence about a particular best practice for your own record-keeping (optional). \nNote: if you do not see Evidence rows as shown in the image to the right, click the \"Show Evidence\" button to unhide those rows.\n\n - Best Practice Rating: You may give any individual Best Practice a Rating of 1, 2, 3, or 4 (in column L), explained in the Best Practice Rating Chart at the top of the page.\nNote: You CANNOT RATE A BEST PRACTICE THEME overall; instead, a theme rating is calculated once you have entered ratings for its individual best practices.\n\n - PRIORITY: You may give a priority rating for any Best Practice and/or theme by entering the letter (H, M, or L in lower- or upper- case) or by selecting a letter from the dropdown list. The priority ratings are optional. A list of any BPs marked as high priority is available in the Action Plan tab."]
[]
[]
[]
[]
[]
[]
[]
[]
[]
[]
[]
[]
[]
[]
[]
[]
[]
[]
[]
[]
[]
[]
[null,"Saving PDF"]
[]
[null,"At the top of the Child Find Best Practices tab are two buttons: PDF with Evidence, and PDF without Evidence."]
[]
[]
[null,"When you click on one of these PDF buttons, you will be prompted to choose a folder in which to save the file.  The file is automatically named for you and includes the current date in the file name."]
[]
[]
[]
[]
[null,"In this example, I created a folder on my desktop called \"Child Find Best Practices\" where this PDF will be stored. "]
[]
[]
[]
[null,"Once the file is created, it may open automatically in your browser (depending on your settings) or you may need to navigate to where the file is stored to open it."]
[]
[]
[]
[]
[]
[]
[]
[]
[]
[]
[]
[]
[null,"Data tab"]
[]
[null,"On the Instructions tab or on the Table of Contents tab there is a \"Get Data\" button which pulls all data entered in the workbook into one data sheet (Data tab)."]
[]
[]
[]
[]
[null,"The information in the Data tab is a chart of each Best Practice Theme, its overall rating and priority as well as how many Best Practices contributed to that rating (Count_Actual, column K).  A Date is included (column I) to show when the Get Data operation was executed."]
[]
[]
[]
[]
[]
[null,"Below the Best Practice Themes (rows 2:8) are all the individual Best Practices (rows 10:46)."]

{"sheet":"ALLdata","index":8,"n_rows":54,"n_cols":18,"rows_kept":54,"cut":false,"hidden":true,"merged":[]}
["Index","Type","Component","QINumber","ElementNumber","Text","ElementRating","QIRating","Priority","Date","Count_Expected","Count_Actual",1,2,3,4,"Not Applicable","RatingToLookup"]
[{"$f":"\"Q-\"&LEFT(D2,2)&RIGHT(D2)&\"-0\"","v":"Q-BP1-0"},"QualityIndicator","Collaboration","BP 1",0,"Collaboration with primary referral sources","-",{"$f":"IF(L2<>0,VLOOKUP(R2,QIRatingLookup!A:B,2,FALSE),0)","v":0},{"$f":"IFERROR(VLOOKUP($A2,'Child Find Best Practices'!$B:$N,13,FALSE),\"\")","v":0},{"$f":"TODAY()","v":"2019-02-22"},{"$f":"COUNTIFS($B:$B,\"Element\",$D:$D,$D2)","v":6},{"$f":"VALUE(M2)+VALUE(N2)+VALUE(O2)+VALUE(P2)+VALUE(Q2)","v":0},{"$f":"IF(LEN(COUNTIFS($D:$D,$D2,$G:$G,M$1,$B:$B,\"Element\"))=1,\"0\",\"\")&COUNTIFS($D:$D,$D2,$G:$G,M$1,$B:$B,\"Element\")","v":"00"},"00","00","00",null,{"$f":"M2&\"-\"&N2&\"-\"&O2&\"-\"&P2","v":"00-00-00-00"}]
["Q-BP2-0","QualityIndicator","Identification","BP 2",0,"Identification of infants and toddlers who are underserved by Part C","-",{"$f":"IF(L3<>0,VLOOKUP(R3,QIRatingLookup!A:B,2,FALSE),0)","v":0},{"$f":"IFERROR(VLOOKUP($A3,'Child Find Best Practices'!$B:$N,13,FALSE),\"\")","v":0},{"$f":"TODAY()","v":"2019-02-22"},3,{"$f":"VALUE(M3)+VALUE(N3)+VALUE(O3)+VALUE(P3)+VALUE(Q3)","v":0},"00","00","00","00",null,{"$f":"M3&\"-\"&N3&\"-\"&O3&\"-\"&P3","v":"00-00-00-00"}]
["Q-BP3-0","QualityIndicator","DataSystems","BP 3",0,"Data Systems ","-",{"$f":"IF(L4<>0,VLOOKUP(R4,QIRatingLookup!A:B,2,FALSE),0)","v":0},{"$f":"IFERROR(VLOOKUP($A4,'Child Find Best Practices'!$B:$N,13,FALSE),\"\")","v":0},"2019-02-22",5,{"$f":"VALUE(M4)+VALUE(N4)+VALUE(O4)+VALUE(P4)+VALUE(Q4)","v":0},"00","00","00","00",null,"00-00-00-00"]
["Q-BP4-0","QualityIndicator","Evaluation","BP 4",0,"Evaluation of Child Find","-",{"$f":"IF(L5<>0,VLOOKUP(R5,QIRatingLookup!A:B,2,FALSE),0)","v":0},{"$f":"IFERROR(VLOOKUP($A5,'Child Find Best Practices'!$B:$N,13,FALSE),\"\")","v":0},"2019-02-22",4,0,"00","00","00","00",null,"00-00-00-00"]
["Q-BP5-0","QualityIndicator","Adequacy","BP 5",0,"Technical Adequacy of Screening and Evaluation Tools","-",{"$f":"IF(L6<>0,VLOOKUP(R6,QIRatingLookup!A:B,2,FALSE),0)","v":0},{"$f":"IFERROR(VLOOKUP($A6,'Child Find Best Practices'!$B:$N,13,FALSE),\"\")","v":0},"2019-02-22",6,0,"00","00","00","00",null,"00-00-00-00"]
["Q-BP6-0","QualityIndicator","Efficiency","BP 6",0,"Efficiency of Screening, Referral, and Evaluation Process and Procedures","-",{"$f":"IF(L7<>0,VLOOKUP(R7,QIRatingLookup!A:B,2,FALSE),0)","v":0},{"$f":"IFERROR(VLOOKUP($A7,'Child Find Best Practices'!$B:$N,13,FALSE),\"\")","v":0},"2019-02-22",10,{"$f":"VALUE(M7)+VALUE(N7)+VALUE(O7)+VALUE(P7)+VALUE(Q7)","v":0},"00","00","00","00",null,{"$f":"M7&\"-\"&N7&\"-\"&O7&\"-\"&P7","v":"00-00-00-00"}]
["Q-BP7-0","QualityIndicator","Ineligible","BP 7",0,"Responding to Children Found Ineligible for Early Intervention","-",{"$f":"IF(L8<>0,VLOOKUP(R8,QIRatingLookup!A:B,2,FALSE),0)","v":0},{"$f":"IFERROR(VLOOKUP($A8,'Child Find Best Practices'!$B:$N,13,FALSE),\"\")","v":0},"2019-02-22",4,0,"00","00","00","00",null,"00-00-00-00"]
[]
[]
[]
[]
[]
[]
[]
[]
[{"$f":"\"E-\"&LEFT(D17,2)&RIGHT(D17)&\"-\"&E17","v":"E-BP1-a"},"Element","Collaboration","BP 1","a","Referral sources are provided with timely feedback including the status of the referral, outcomes of the referral, child engagement in services, and progress. ",{"$f":"IFERROR(VLOOKUP($A17,'Child Find Best Practices'!$B:$N,11,FALSE),\"\")","v":0},"-",{"$f":"IFERROR(VLOOKUP($A17,'Child Find Best Practices'!$B:$N,13,FALSE),\"\")","v":0},"2019-02-22",null,null,{"$f":"IF(M16=$M$16,IF(I17=\"H\",1,0),IF(I17=\"H\",M16+1,M16))","v":0},{"$f":"\"[\"&D17&\"-\"&E17&\"]\"&\"  \"&F17","v":"[BP 1-a]  Referral sources are provided with timely feedback including the status of the referral, outcomes of the referral, child engagement in services, and progress. "},null,1,{"$f":"IFERROR(VLOOKUP($P17,$M$17:$N$54,2,FALSE),\"\")","v":""},{"$f":"IF(Q17=\"\",\"\",CHAR(10)&Q17&CHAR(10))","v":""}]
[{"$f":"\"E-\"&LEFT(D18,2)&RIGHT(D18)&\"-\"&E18","v":"E-BP1-b"},"Element","Collaboration","BP 1","b","“Referral” is clearly defined, and that definition is disseminated to primary referral sources.",{"$f":"IFERROR(VLOOKUP($A18,'Child Find Best Practices'!$B:$N,11,FALSE),\"\")","v":0},"-",{"$f":"IFERROR(VLOOKUP($A18,'Child Find Best Practices'!$B:$N,13,FALSE),\"\")","v":0},"2019-02-22",null,null,{"$f":"IF(M17=$M$16,IF(I18=\"H\",1,0),IF(I18=\"H\",M17+1,M17))","v":0},{"$f":"\"[\"&D18&\"-\"&E18&\"]\"&\"  \"&F18","v":"[BP 1-b]  “Referral” is clearly defined, and that definition is disseminated to primary referral sources."},null,2,{"$f":"IFERROR(VLOOKUP($P18,$M$17:$N$54,2,FALSE),\"\")","v":""},{"$f":"IF(Q18=\"\",\"\",CHAR(10)&Q18&CHAR(10))","v":""}]
["E-BP1-c","Element","Collaboration","BP 1","c","Policies and procedures support ongoing and effective collaborative relationships with community agencies that serve underserved and at-risk populations. ",{"$f":"IFERROR(VLOOKUP($A19,'Child Find Best Practices'!$B:$N,11,FALSE),\"\")","v":0},"-",{"$f":"IFERROR(VLOOKUP($A19,'Child Find Best Practices'!$B:$N,13,FALSE),\"\")","v":0},"2019-02-22",null,null,0,"[BP 1-c]  Policies and procedures support ongoing and effective collaborative relationships with community agencies that serve underserved and at-risk populations. ",null,3,"",""]
["E-BP1-d","Element","Collaboration","BP 1","d","Implement respectful and appropriate pre-referral education and information-sharing with families to support their understanding of the importance of EI and to reduce stigma.",{"$f":"IFERROR(VLOOKUP($A20,'Child Find Best Practices'!$B:$N,11,FALSE),\"\")","v":0},"-",{"$f":"IFERROR(VLOOKUP($A20,'Child Find Best Practices'!$B:$N,13,FALSE),\"\")","v":0},"2019-02-22",null,null,0,"[BP 1-d]  Implement respectful and appropriate pre-referral education and information-sharing with families to support their understanding of the importance of EI and to reduce stigma.",null,4,"",""]
["E-BP1-e","Element","Collaboration","BP 1","e","Policies and procedures are in place to support ongoing and effective communication and collaborative relationships with referral agencies (e.g., NICUs, child care programs, pediatricians). ",{"$f":"IFERROR(VLOOKUP($A21,'Child Find Best Practices'!$B:$N,11,FALSE),\"\")","v":0},"-",{"$f":"IFERROR(VLOOKUP($A21,'Child Find Best Practices'!$B:$N,13,FALSE),\"\")","v":0},"2019-02-22",null,null,0,"[BP 1-e]  Policies and procedures are in place to support ongoing and effective communication and collaborative relationships with referral agencies (e.g., NICUs, child care programs, pediatricians). ",null,5,"",""]
["E-BP1-f","Element","Collaboration","BP 1","f","Collaboration with primary referral sources includes education, training, and professional development to support consistent application of referral criteria across sectors, geographic regions, and genders.",{"$f":"IFERROR(VLOOKUP($A22,'Child Find Best Practices'!$B:$N,11,FALSE),\"\")","v":0},"-",{"$f":"IFERROR(VLOOKUP($A22,'Child Find Best Practices'!$B:$N,13,FALSE),\"\")","v":0},"2019-02-22",null,null,0,"[BP 1-f]  Collaboration with primary referral sources includes education, training, and professional development to support consistent application of referral criteria across sectors, geographic regions, and genders.",null,6,"",""]
["E-BP2-a","Element","Identification","BP 2","a","Materials describing the child find process are targeted towards underserved populations.",{"$f":"IFERROR(VLOOKUP($A23,'Child Find Best Practices'!$B:$N,11,FALSE),\"\")","v":0},"-",{"$f":"IFERROR(VLOOKUP($A23,'Child Find Best Practices'!$B:$N,13,FALSE),\"\")","v":0},"2019-02-22",null,null,0,"[BP 2-a]  Materials describing the child find process are targeted towards underserved populations.",null,7,"",""]
["E-BP2-b","Element","Identification","BP 2","b","Community health workers and other cultural brokers (i.e., individuals who bridge groups of differing backgrounds to create change, such as interpreters or other community members who may act in both directions between the community and Part C agency) are engaged and support the child find process.",{"$f":"IFERROR(VLOOKUP($A24,'Child Find Best Practices'!$B:$N,11,FALSE),\"\")","v":0},"-",{"$f":"IFERROR(VLOOKUP($A24,'Child Find Best Practices'!$B:$N,13,FALSE),\"\")","v":0},"2019-02-22",null,null,0,"[BP 2-b]  Community health workers and other cultural brokers (i.e., individuals who bridge groups of differing backgrounds to create change, such as interpreters or other community members who may act in both directions between the community and Part C agency) are engaged and support the child find process.",null,8,"",""]
["E-BP2-c","Element","Identification","BP 2","c","Use strategies such as a 211 telephone-based developmental screening and care coordination as a scalable and cost-effective strategy to reach children who may not have a medical home. (For more information on 211 screening see https://www.zerotothree.org/resources/56-improving-access-to-early-identification-and-intervention-211-la-county-developmental-screening-and-care-coordination)",{"$f":"IFERROR(VLOOKUP($A25,'Child Find Best Practices'!$B:$N,11,FALSE),\"\")","v":0},"-",{"$f":"IFERROR(VLOOKUP($A25,'Child Find Best Practices'!$B:$N,13,FALSE),\"\")","v":0},"2019-02-22",null,null,0,"[BP 2-c]  Use strategies such as a 211 telephone-based developmental screening and care coordination as a scalable and cost-effective strategy to reach children who may not have a medical home. (For more information on 211 screening see https://www.zerotothree.org/resources/56-improving-access-to-early-identification-and-intervention-211-la-county-developmental-screening-and-care-coordination)",null,9,"",""]
["E-BP3-a","Element","DataSystems","BP 3","a","Formal data governance is in place defining the policies related to data security and access.",{"$f":"IFERROR(VLOOKUP($A26,'Child Find Best Practices'!$B:$N,11,FALSE),\"\")","v":0},"-",{"$f":"IFERROR(VLOOKUP($A26,'Child Find Best Practices'!$B:$N,13,FALSE),\"\")","v":0},"2019-02-22",null,null,0,"[BP 3-a]  Formal data governance is in place defining the policies related to data security and access.",null,10,"",""]
["E-BP3-b","Element","DataSystems","BP 3","b","Data system includes sufficient technical (e.g., firewalls, secure laptops, password, management, etc.) and nontechnical (e.g. data access and sharing restrictions, regular staff trainings, ensuring correct access and administrative rights are granted for staff and authorized data users) security measures to minimize the risk of disclosing Personally Identifiable Information (PII).",{"$f":"IFERROR(VLOOKUP($A27,'Child Find Best Practices'!$B:$N,11,FALSE),\"\")","v":0},"-",{"$f":"IFERROR(VLOOKUP($A27,'Child Find Best Practices'!$B:$N,13,FALSE),\"\")","v":0},"2019-02-22",null,null,0,"[BP 3-b]  Data system includes sufficient technical (e.g., firewalls, secure laptops, password, management, etc.) and nontechnical (e.g. data access and sharing restrictions, regular staff trainings, ensuring correct access and administrative rights are granted for staff and authorized data users) security measures to minimize the risk of disclosing Personally Identifiable Information (PII).",null,11,"",""]
["E-BP3-c","Element","DataSystems","BP 3","c","The data system has the capacity to support accountability, program development, and program operations and includes elements and features of high-quality data systems.",{"$f":"IFERROR(VLOOKUP($A28,'Child Find Best Practices'!$B:$N,11,FALSE),\"\")","v":0},"-",{"$f":"IFERROR(VLOOKUP($A28,'Child Find Best Practices'!$B:$N,13,FALSE),\"\")","v":0},"2019-02-22",null,null,0,"[BP 3-c]  The data system has the capacity to support accountability, program development, and program operations and includes elements and features of high-quality data systems.",null,12,"",""]
["E-BP3-d","Element","DataSystems","BP 3","d","The Part C state data system has interoperability that allows for linking Part C data to other statewide longitudinal and early childhood data systems.",{"$f":"IFERROR(VLOOKUP($A29,'Child Find Best Practices'!$B:$N,11,FALSE),\"\")","v":0},"-",{"$f":"IFERROR(VLOOKUP($A29,'Child Find Best Practices'!$B:$N,13,FALSE),\"\")","v":0},"2019-02-22",null,null,0,"[BP 3-d]  The Part C state data system has interoperability that allows for linking Part C data to other statewide longitudinal and early childhood data systems.",null,13,"",""]
["E-BP3-e","Element","DataSystems","BP 3","e","The data collected are high quality.",{"$f":"IFERROR(VLOOKUP($A30,'Child Find Best Practices'!$B:$N,11,FALSE),\"\")","v":0},"-",{"$f":"IFERROR(VLOOKUP($A30,'Child Find Best Practices'!$B:$N,13,FALSE),\"\")","v":0},"2019-02-22",null,null,0,"[BP 3-e]  The data collected are high quality.",null,14,"",""]
["E-BP4-a","Element","Evaluation","BP 4","a","The state has a method for evaluating progress towards best practices, including experiences of parents and primary referral sources.",{"$f":"IFERROR(VLOOKUP($A31,'Child Find Best Practices'!$B:$N,11,FALSE),\"\")","v":0},"-",{"$f":"IFERROR(VLOOKUP($A31,'Child Find Best Practices'!$B:$N,13,FALSE),\"\")","v":0},"2019-02-22",null,null,0,"[BP 4-a]  The state has a method for evaluating progress towards best practices, including experiences of parents and primary referral sources.",null,15,"",""]
["E-BP4-b","Element","Evaluation","BP 4","b","The Part C state data system, directly or through a related application, has reporting and analysis tools that provide end users, including state and local program staff, with easy access* to the data in both raw form and reports. ",{"$f":"IFERROR(VLOOKUP($A32,'Child Find Best Practices'!$B:$N,11,FALSE),\"\")","v":0},"-",{"$f":"IFERROR(VLOOKUP($A32,'Child Find Best Practices'!$B:$N,13,FALSE),\"\")","v":0},"2019-02-22",null,null,0,"[BP 4-b]  The Part C state data system, directly or through a related application, has reporting and analysis tools that provide end users, including state and local program staff, with easy access* to the data in both raw form and reports. ",null,16,"",""]
["E-BP4-c","Element","Evaluation","BP 4","c","Reports include metrics useful for monitoring the child find system.",{"$f":"IFERROR(VLOOKUP($A33,'Child Find Best Practices'!$B:$N,11,FALSE),\"\")","v":0},"-",{"$f":"IFERROR(VLOOKUP($A33,'Child Find Best Practices'!$B:$N,13,FALSE),\"\")","v":0},"2019-02-22",null,null,0,"[BP 4-c]  Reports include metrics useful for monitoring the child find system.",null,17,"",""]
["E-BP4-d","Element","Evaluation","BP 4","d","Data system features methods for identifying underserved populations.",{"$f":"IFERROR(VLOOKUP($A34,'Child Find Best Practices'!$B:$N,11,FALSE),\"\")","v":0},"-",{"$f":"IFERROR(VLOOKUP($A34,'Child Find Best Practices'!$B:$N,13,FALSE),\"\")","v":0},"2019-02-22",null,null,0,"[BP 4-d]  Data system features methods for identifying underserved populations.",null,18,"",""]
["E-BP5-a","Element","Adequacy","BP 5","a","Use of standardized developmental screening and evaluation tools with strong psychometric properties and sufficient sensitivity to detect child progress.",{"$f":"IFERROR(VLOOKUP($A35,'Child Find Best Practices'!$B:$N,11,FALSE),\"\")","v":0},"-",{"$f":"IFERROR(VLOOKUP($A35,'Child Find Best Practices'!$B:$N,13,FALSE),\"\")","v":0},"2019-02-22",null,null,0,"[BP 5-a]  Use of standardized developmental screening and evaluation tools with strong psychometric properties and sufficient sensitivity to detect child progress.",null,19,"",""]
["E-BP5-b","Element","Adequacy","BP 5","b","Screening tools are brief and with a reduced literacy burden.",{"$f":"IFERROR(VLOOKUP($A36,'Child Find Best Practices'!$B:$N,11,FALSE),\"\")","v":0},"-",{"$f":"IFERROR(VLOOKUP($A36,'Child Find Best Practices'!$B:$N,13,FALSE),\"\")","v":0},"2019-02-22",null,null,0,"[BP 5-b]  Screening tools are brief and with a reduced literacy burden.",null,20,"",""]
["E-BP5-c","Element","Adequacy","BP 5","c","Developmental screening and evaluation tools include social-emotional development.",{"$f":"IFERROR(VLOOKUP($A37,'Child Find Best Practices'!$B:$N,11,FALSE),\"\")","v":0},"-",{"$f":"IFERROR(VLOOKUP($A37,'Child Find Best Practices'!$B:$N,13,FALSE),\"\")","v":0},"2019-02-22",null,null,0,"[BP 5-c]  Developmental screening and evaluation tools include social-emotional development.",null,21,"",""]
["E-BP5-d","Element","Adequacy","BP 5","d","Individuals conducting screenings and evaluations are trained in their use, scoring, and interpretation.",{"$f":"IFERROR(VLOOKUP($A38,'Child Find Best Practices'!$B:$N,11,FALSE),\"\")","v":0},"-",{"$f":"IFERROR(VLOOKUP($A38,'Child Find Best Practices'!$B:$N,13,FALSE),\"\")","v":0},"2019-02-22",null,null,0,"[BP 5-d]  Individuals conducting screenings and evaluations are trained in their use, scoring, and interpretation.",null,22,"",""]
["E-BP5-e","Element","Adequacy","BP 5","e","Evaluation tools provide functional information that can be used to inform IFSP development.",{"$f":"IFERROR(VLOOKUP($A39,'Child Find Best Practices'!$B:$N,11,FALSE),\"\")","v":0},"-",{"$f":"IFERROR(VLOOKUP($A39,'Child Find Best Practices'!$B:$N,13,FALSE),\"\")","v":0},"2019-02-22",null,null,0,"[BP 5-e]  Evaluation tools provide functional information that can be used to inform IFSP development.",null,23,"",""]
[{"$f":"\"E-\"&LEFT(D40,2)&RIGHT(D40)&\"-\"&E40","v":"E-BP5-f"},"Element","Adequacy","BP 5","f","Implementation of CDC-recommended practices for the diagnosis and management of infants born to mothers with Zika exposure or with potential Zika exposure.",{"$f":"IFERROR(VLOOKUP($A40,'Child Find Best Practices'!$B:$N,11,FALSE),\"\")","v":0},"-",{"$f":"IFERROR(VLOOKUP($A40,'Child Find Best Practices'!$B:$N,13,FALSE),\"\")","v":0},"2019-02-22",null,null,0,"[BP 5-f]  Implementation of CDC-recommended practices for the diagnosis and management of infants born to mothers with Zika exposure or with potential Zika exposure.",null,24,"",""]
["E-BP6-a","Element","Efficiency","BP 6","a","Universal screening for all children at set time points.",{"$f":"IFERROR(VLOOKUP($A41,'Child Find Best Practices'!$B:$N,11,FALSE),\"\")","v":0},"-",{"$f":"IFERROR(VLOOKUP($A41,'Child Find Best Practices'!$B:$N,13,FALSE),\"\")","v":0},"2019-02-22",null,null,0,"[BP 6-a]  Universal screening for all children at set time points.",null,25,"",""]
["E-BP6-b","Element","Efficiency","BP 6","b","Statewide coordination of screening includes surveillance and screening by primary care physicians.",{"$f":"IFERROR(VLOOKUP($A42,'Child Find Best Practices'!$B:$N,11,FALSE),\"\")","v":0},"-",{"$f":"IFERROR(VLOOKUP($A42,'Child Find Best Practices'!$B:$N,13,FALSE),\"\")","v":0},"2019-02-22",null,null,0,"[BP 6-b]  Statewide coordination of screening includes surveillance and screening by primary care physicians.",null,26,"",""]
["E-BP6-c","Element","Efficiency","BP 6","c","Screening includes family perspectives and is conducted in the child’s dominant language and according to family preferences.",{"$f":"IFERROR(VLOOKUP($A43,'Child Find Best Practices'!$B:$N,11,FALSE),\"\")","v":0},"-",{"$f":"IFERROR(VLOOKUP($A43,'Child Find Best Practices'!$B:$N,13,FALSE),\"\")","v":0},"2019-02-22",null,null,0,"[BP 6-c]  Screening includes family perspectives and is conducted in the child’s dominant language and according to family preferences.",null,27,"",""]
["E-BP6-d","Element","Efficiency","BP 6","d","Web-based referral or electronic transmission of referrals.",{"$f":"IFERROR(VLOOKUP($A44,'Child Find Best Practices'!$B:$N,11,FALSE),\"\")","v":0},"-",{"$f":"IFERROR(VLOOKUP($A44,'Child Find Best Practices'!$B:$N,13,FALSE),\"\")","v":0},"2019-02-22",null,null,0,"[BP 6-d]  Web-based referral or electronic transmission of referrals.",null,28,"",""]
["E-BP6-e","Element","Efficiency","BP 6","e","A simple, straightforward universal referral form is used.",{"$f":"IFERROR(VLOOKUP($A45,'Child Find Best Practices'!$B:$N,11,FALSE),\"\")","v":0},"-",{"$f":"IFERROR(VLOOKUP($A45,'Child Find Best Practices'!$B:$N,13,FALSE),\"\")","v":0},"2019-02-22",null,null,0,"[BP 6-e]  A simple, straightforward universal referral form is used.",null,29,"",""]
["E-BP6-f","Element","Efficiency","BP 6","f","A universal checklist for identifying eligible children is used to streamline identification and reduce the need for screening/comprehensive evaluation.",{"$f":"IFERROR(VLOOKUP($A46,'Child Find Best Practices'!$B:$N,11,FALSE),\"\")","v":0},"-",{"$f":"IFERROR(VLOOKUP($A46,'Child Find Best Practices'!$B:$N,13,FALSE),\"\")","v":0},"2019-02-22",null,null,0,"[BP 6-f]  A universal checklist for identifying eligible children is used to streamline identification and reduce the need for screening/comprehensive evaluation.",null,30,"",""]
["E-BP6-g","Element","Efficiency","BP 6","g","Children with established conditions with a high probability of developmental delay are automatically referred to Part C and are presumed eligible.",{"$f":"IFERROR(VLOOKUP($A47,'Child Find Best Practices'!$B:$N,11,FALSE),\"\")","v":0},"-",{"$f":"IFERROR(VLOOKUP($A47,'Child Find Best Practices'!$B:$N,13,FALSE),\"\")","v":0},"2019-02-22",null,null,0,"[BP 6-g]  Children with established conditions with a high probability of developmental delay are automatically referred to Part C and are presumed eligible.",null,31,"",""]
[{"$f":"\"E-\"&LEFT(D48,2)&RIGHT(D48)&\"-\"&E48","v":"E-BP6-h"},"Element","Efficiency","BP 6","h","Children with clinical findings consistent with congenital Zika syndrome born to mothers with possible Zika virus exposure in pregnancy are automatically referred to Part C and presumed eligible.",{"$f":"IFERROR(VLOOKUP($A48,'Child Find Best Practices'!$B:$N,11,FALSE),\"\")","v":0},"-",{"$f":"IFERROR(VLOOKUP($A48,'Child Find Best Practices'!$B:$N,13,FALSE),\"\")","v":0},"2019-02-22",null,null,0,"[BP 6-h]  Children with clinical findings consistent with congenital Zika syndrome born to mothers with possible Zika virus exposure in pregnancy are automatically referred to Part C and presumed eligible.",null,32,"",""]
["E-BP6-i","Element","Efficiency","BP 6","i","A decision-making algorithm is used to expedite enrollment in Part C.",{"$f":"IFERROR(VLOOKUP($A49,'Child Find Best Practices'!$B:$N,11,FALSE),\"\")","v":0},"-",{"$f":"IFERROR(VLOOKUP($A49,'Child Find Best Practices'!$B:$N,13,FALSE),\"\")","v":0},"2019-02-22",null,null,0,"[BP 6-i]  A decision-making algorithm is used to expedite enrollment in Part C.",null,33,"",""]
["E-BP6-j","Element","Efficiency","BP 6","j","Infants born less than or equal to 1500 grams (3.3 lbs.) or less than 37 weeks of gestational age are considered a diagnosed physical or mental condition and eligible to receive EI services.",{"$f":"IFERROR(VLOOKUP($A50,'Child Find Best Practices'!$B:$N,11,FALSE),\"\")","v":0},"-",{"$f":"IFERROR(VLOOKUP($A50,'Child Find Best Practices'!$B:$N,13,FALSE),\"\")","v":0},"2019-02-22",null,null,{"$f":"IF(M49=$M$16,IF(I50=\"H\",1,0),IF(I50=\"H\",M49+1,M49))","v":0},{"$f":"\"[\"&D50&\"-\"&E50&\"]\"&\"  \"&F50","v":"[BP 6-j]  Infants born less than or equal to 1500 grams (3.3 lbs.) or less than 37 weeks of gestational age are considered a diagnosed physical or mental condition and eligible to receive EI services."},null,33,"",{"$f":"IF(Q50=\"\",\"\",CHAR(10)&Q50&CHAR(10))","v":""}]
["E-BP7-a","Element","Ineligible","BP 7","a","Connect families with other community resources to meet needs EI does not address.",{"$f":"IFERROR(VLOOKUP($A51,'Child Find Best Practices'!$B:$N,11,FALSE),\"\")","v":0},"-",{"$f":"IFERROR(VLOOKUP($A51,'Child Find Best Practices'!$B:$N,13,FALSE),\"\")","v":0},"2019-02-22",null,null,0,"[BP 7-a]  Connect families with other community resources to meet needs EI does not address.",null,33,"",""]
["E-BP7-b","Element","Ineligible","BP 7","b","Promote linkages between early identification services and a network of treatment services so that children’s developmental concerns are addressed.",{"$f":"IFERROR(VLOOKUP($A52,'Child Find Best Practices'!$B:$N,11,FALSE),\"\")","v":0},"-",{"$f":"IFERROR(VLOOKUP($A52,'Child Find Best Practices'!$B:$N,13,FALSE),\"\")","v":0},"2019-02-22",null,null,0,"[BP 7-b]  Promote linkages between early identification services and a network of treatment services so that children’s developmental concerns are addressed.",null,33,"",""]
["E-BP7-c","Element","Ineligible","BP 7","c","Repeat screening and monitoring for children whose assessment scores indicated they are at risk but who did not meet eligibility criteria.",{"$f":"IFERROR(VLOOKUP($A53,'Child Find Best Practices'!$B:$N,11,FALSE),\"\")","v":0},"-",{"$f":"IFERROR(VLOOKUP($A53,'Child Find Best Practices'!$B:$N,13,FALSE),\"\")","v":0},"2019-02-22",null,null,0,"[BP 7-c]  Repeat screening and monitoring for children whose assessment scores indicated they are at risk but who did not meet eligibility criteria.",null,33,"",""]
["E-BP7-d","Element","Ineligible","BP 7","d","Support outreach to inform parents about developmental screening and follow up services.",{"$f":"IFERROR(VLOOKUP($A54,'Child Find Best Practices'!$B:$N,11,FALSE),\"\")","v":0},"-",{"$f":"IFERROR(VLOOKUP($A54,'Child Find Best Practices'!$B:$N,13,FALSE),\"\")","v":0},"2019-02-22",null,null,0,"[BP 7-d]  Support outreach to inform parents about developmental screening and follow up services.",null,33,"",""]

{"sheet":"QualityIndicators","index":9,"n_rows":8,"n_cols":2,"rows_kept":8,"cut":false,"hidden":true,"merged":[]}
["QualityIndicatorCode","QualityIndicatorText"]
["BP 1","Collaboration with primary referral sources"]
["BP 2","Identification of infants and toddlers who are underserved by Part C"]
["BP 3","Data Systems "]
["BP 4","Evaluation of Child Find"]
["BP 5","Technical Adequacy of Screening and Evaluation Tools"]
["BP 6","Efficiency of Screening, Referral, and Evaluation Process and Procedures"]
["BP 7","Responding to Children Found Ineligible for Early Intervention"]

{"sheet":"QIRatingLookup","index":10,"n_rows":4846,"n_cols":12,"rows_kept":4846,"cut":false,"hidden":true,"merged":[]}
["Index","Rating",null,"Total","Number of 1s","Number of 2s","Number of 3s","Number of 4s","TEXT Number of 1s","TEXT Number of 2s","TEXT Number of 3s","TEXT Number of 4s"]
["INCOMPLETE",{"$f":"\"-\"","v":"-"}]
[{"$f":"I3&\"-\"&J3&\"-\"&K3&\"-\"&L3","v":"00-00-00-01"},7,null,1,0,0,0,1,{"$f":"IF(LEN(E3)=1,0&E3,IF(LEN(E3)=0,\"00\",RIGHT(E3,2)))","v":"00"},"00","00","01"]
[{"$f":"I4&\"-\"&J4&\"-\"&K4&\"-\"&L4","v":"00-00-01-00"},4,null,1,0,0,1,0,"00","00","01","00"]
[{"$f":"I5&\"-\"&J5&\"-\"&K5&\"-\"&L5","v":"00-01-00-00"},2,null,1,0,1,0,0,"00","01","00","00"]
[{"$f":"I6&\"-\"&J6&\"-\"&K6&\"-\"&L6","v":"01-00-00-00"},1,null,1,1,0,0,0,"01","00","00","00"]
[{"$f":"I7&\"-\"&J7&\"-\"&K7&\"-\"&L7","v":"00-00-00-02"},7,null,2,0,0,0,2,"00","00","00","02"]
["00-00-01-01",6,null,2,0,0,1,1,{"$f":"IF(LEN(E8)=1,0&E8,IF(LEN(E8)=0,\"00\",RIGHT(E8,2)))","v":"00"},{"$f":"IF(LEN(F8)=1,0&F8,IF(LEN(F8)=0,\"00\",RIGHT(F8,2)))","v":"00"},{"$f":"IF(LEN(G8)=1,0&G8,IF(LEN(G8)=0,\"00\",RIGHT(G8,2)))","v":"01"},{"$f":"IF(LEN(H8)=1,0&H8,IF(LEN(H8)=0,\"00\",RIGHT(H8,2)))","v":"01"}]
["00-00-02-00",4,null,2,0,0,2,0,"00","00","02","00"]
["00-01-00-01",5,null,2,0,1,0,1,"00","01","00","01"]
["00-01-01-00",4,null,2,0,1,1,0,"00","01","01","00"]
["00-02-00-00",2,null,2,0,2,0,0,"00","02","00","00"]
["01-00-00-01",4,null,2,1,0,0,1,"01","00","00","01"]
["01-00-01-00",3,null,2,1,0,1,0,"01","00","01","00"]
["01-01-00-00",2,null,2,1,1,0,0,"01","01","00","00"]
["02-00-00-00",1,null,2,2,0,0,0,"02","00","00","00"]
["00-00-00-03",7,null,3,0,0,0,3,"00","00","00","03"]
["00-00-01-02",6,null,3,0,0,1,2,"00","00","01","02"]
["00-00-02-01",5,null,3,0,0,2,1,"00","00","02","01"]
["00-00-03-00",4,null,3,0,0,3,0,"00","00","03","00"]
["00-01-00-02",5,null,3,0,1,0,2,"00","01","00","02"]
["00-01-01-01",5,null,3,0,1,1,1,"00","01","01","01"]
["00-01-02-00",4,null,3,0,1,2,0,"00","01","02","00"]
["00-02-00-01",3,null,3,0,2,0,1,"00","02","00","01"]
["00-02-01-00",3,null,3,0,2,1,0,"00","02","01","00"]
["00-03-00-00",2,null,3,0,3,0,0,"00","03","00","00"]
["01-00-00-02",4,null,3,1,0,0,2,"01","00","00","02"]
["01-00-01-01",4,null,3,1,0,1,1,"01","00","01","01"]
["01-00-02-00",4,null,3,1,0,2,0,"01","00","02","00"]
["01-01-00-01",3,null,3,1,1,0,1,"01","01","00","01"]
["01-01-01-00",3,null,3,1,1,1,0,"01","01","01","00"]
["01-02-00-00",2,null,3,1,2,0,0,"01","02","00","00"]
["02-00-00-01",3,null,3,2,0,0,1,"02","00","00","01"]
["02-00-01-00",3,null,3,2,0,1,0,"02","00","01","00"]
["02-01-00-00",2,null,3,2,1,0,0,"02","01","00","00"]
["03-00-00-00",1,null,3,3,0,0,0,"03","00","00","00"]
["00-00-00-04",7,null,4,0,0,0,4,"00","00","00","04"]
["00-00-01-03",6,null,4,0,0,1,3,"00","00","01","03"]
["00-00-02-02",6,null,4,0,0,2,2,"00","00","02","02"]
["00-00-03-01",5,null,4,0,0,3,1,"00","00","03","01"]
["00-00-04-00",4,null,4,0,0,4,0,"00","00","04","00"]
["00-01-00-03",5,null,4,0,1,0,3,"00","01","00","03"]
["00-01-01-02",5,null,4,0,1,1,2,"00","01","01","02"]
["00-01-02-01",5,null,4,0,1,2,1,"00","01","02","01"]
["00-01-03-00",4,null,4,0,1,3,0,"00","01","03","00"]
["00-02-00-02",4,null,4,0,2,0,2,"00","02","00","02"]
["00-02-01-01",4,null,4,0,2,1,1,"00","02","01","01"]
["00-02-02-00",4,null,4,0,2,2,0,"00","02","02","00"]
["00-03-00-01",3,null,4,0,3,0,1,"00","03","00","01"]
["00-03-01-00",3,null,4,0,3,1,0,"00","03","01","00"]
["00-04-00-00",2,null,4,0,4,0,0,"00","04","00","00"]
["01-00-00-03",5,null,4,1,0,0,3,"01","00","00","03"]
["01-00-01-02",4,null,4,1,0,1,2,"01","00","01","02"]
["01-00-02-01",4,null,4,1,0,2,1,"01","00","02","01"]
["01-00-03-00",4,null,4,1,0,3,0,"01","00","03","00"]
["01-01-00-02",4,null,4,1,1,0,2,"01","01","00","02"]
["01-01-01-01",4,null,4,1,1,1,1,"01","01","01","01"]
["01-01-02-00",4,null,4,1,1,2,0,"01","01","02","00"]
["01-02-00-01",3,null,4,1,2,0,1,"01","02","00","01"]
["01-02-01-00",2,null,4,1,2,1,0,"01","02","01","00"]
["01-03-00-00",2,null,4,1,3,0,0,"01","03","00","00"]
["02-00-00-02",4,null,4,2,0,0,2,"02","00","00","02"]
["02-00-01-01",3,null,4,2,0,1,1,"02","00","01","01"]
["02-00-02-00",3,null,4,2,0,2,0,"02","00","02","00"]
["02-01-00-01",3,null,4,2,1,0,1,"02","01","00","01"]
["02-01-01-00",2,null,4,2,1,1,0,"02","01","01","00"]
["02-02-00-00",2,null,4,2,2,0,0,"02","02","00","00"]
["03-00-00-01",3,null,4,3,0,0,1,"03","00","00","01"]
["03-00-01-00",2,null,4,3,0,1,0,"03","00","01","00"]
["03-01-00-00",2,null,4,3,1,0,0,"03","01","00","00"]
[{"$f":"I71&\"-\"&J71&\"-\"&K71&\"-\"&L71","v":"04-00-00-00"},1,null,4,4,0,0,0,"04","00","00","00"]
["00-00-00-05",7,null,5,0,0,0,5,{"$f":"IF(LEN(E72)=1,0&E72,IF(LEN(E72)=0,\"00\",RIGHT(E72,2)))","v":"00"},{"$f":"IF(LEN(F72)=1,0&F72,IF(LEN(F72)=0,\"00\",RIGHT(F72,2)))","v":"00"},{"$f":"IF(LEN(G72)=1,0&G72,IF(LEN(G72)=0,\"00\",RIGHT(G72,2)))","v":"00"},{"$f":"IF(LEN(H72)=1,0&H72,IF(LEN(H72)=0,\"00\",RIGHT(H72,2)))","v":"05"}]
["00-00-01-04",6,null,5,0,0,1,4,"00","00","01","04"]
["00-00-02-03",6,null,5,0,0,2,3,"00","00","02","03"]
["00-00-03-02",5,null,5,0,0,3,2,"00","00","03","02"]
["00-00-04-01",5,null,5,0,0,4,1,"00","00","04","01"]
["00-00-05-00",4,null,5,0,0,5,0,"00","00","05","00"]
["00-01-01-03",5,null,5,0,1,1,3,"00","01","01","03"]
["00-01-02-02",5,null,5,0,1,2,2,"00","01","02","02"]
["00-01-03-01",5,null,5,0,1,3,1,"00","01","03","01"]
["00-01-04-00",4,null,5,0,1,4,0,"00","01","04","00"]
["00-01-00-04",5,null,5,0,1,null,4,"00","01","00","04"]
["00-02-00-03",5,null,5,0,2,0,3,"00","02","00","03"]
["00-02-01-02",5,null,5,0,2,1,2,"00","02","01","02"]
["00-02-02-01",4,null,5,0,2,2,1,"00","02","02","01"]
["00-02-03-00",4,null,5,0,2,3,0,"00","02","03","00"]
["00-03-00-02",3,null,5,0,3,0,2,"00","03","00","02"]
["00-03-01-01",3,null,5,0,3,1,1,"00","03","01","01"]
["00-03-02-00",3,null,5,0,3,2,0,"00","03","02","00"]
["00-04-00-01",3,null,5,0,4,0,1,"00","04","00","01"]
["00-04-01-00",3,null,5,0,4,1,0,"00","04","01","00"]
["00-05-00-00",2,null,5,0,5,0,0,"00","05","00","00"]
["01-00-00-04",5,null,5,1,0,0,4,"01","00","00","04"]
["01-00-01-03",5,null,5,1,0,1,3,"01","00","01","03"]
["01-00-02-02",5,null,5,1,0,2,2,"01","00","02","02"]
["01-00-03-01",4,null,5,1,0,3,1,"01","00","03","01"]
["01-00-04-00",4,null,5,1,0,4,0,"01","00","04","00"]
["01-01-00-03",4,null,5,1,1,0,3,"01","01","00","03"]
["01-01-01-02",4,null,5,1,1,1,2,"01","01","01","02"]
["01-01-02-01",4,null,5,1,1,2,1,"01","01","02","01"]
["01-01-03-00",4,null,5,1,1,3,0,"01","01","03","00"]
["01-02-00-02",3,null,5,1,2,0,2,"01","02","00","02"]
["01-02-01-01",3,null,5,1,2,1,1,"01","02","01","01"]
["01-02-02-00",3,null,5,1,2,2,0,"01","02","02","00"]
["01-03-00-01",3,null,5,1,3,0,1,"01","03","00","01"]
["01-03-01-00",2,null,5,1,3,1,0,"01","03","01","00"]
["01-04-00-00",2,null,5,1,4,0,0,"01","04","00","00"]
["02-00-00-03",4,null,5,2,0,0,3,"02","00","00","03"]
["02-00-01-02",4,null,5,2,0,1,2,"02","00","01","02"]
["02-00-02-01",4,null,5,2,0,2,1,"02","00","02","01"]
["02-00-03-00",4,null,5,2,0,3,0,"02","00","03","00"]
["02-01-00-02",3,null,5,2,1,0,2,"02","01","00","02"]
["02-01-01-01",3,null,5,2,1,1,1,"02","01","01","01"]
["02-01-02-00",3,null,5,2,1,2,0,"02","01","02","00"]
["02-02-00-01",3,null,5,2,2,0,1,"02","02","00","01"]
["02-02-01-00",2,null,5,2,2,1,0,"02","02","01","00"]
["02-03-00-00",2,null,5,2,3,0,0,"02","03","00","00"]
["03-00-00-02",3,null,5,3,0,0,2,"03","00","00","02"]
["03-00-01-01",3,null,5,3,0,1,1,"03","00","01","01"]
["03-00-02-00",3,null,5,3,0,2,0,"03","00","02","00"]
["03-01-00-01",3,null,5,3,1,0,1,"03","01","00","01"]
["03-01-01-00",2,null,5,3,1,1,0,"03","01","01","00"]
["03-02-00-00",2,null,5,3,2,0,0,"03","02","00","00"]
["04-00-00-01",3,null,5,4,0,0,1,"04","00","00","01"]
["04-00-01-00",2,null,5,4,0,1,0,"04","00","01","00"]
["04-01-00-00",2,null,5,4,1,0,0,"04","01","00","00"]
["05-00-00-00",1,null,5,5,0,0,0,"05","00","00","00"]
["00-00-00-06",7,null,6,0,0,0,6,"00","00","00","06"]
["00-00-01-05",6,null,6,0,0,1,5,"00","00","01","05"]
["00-00-02-04",6,null,6,0,0,2,4,"00","00","02","04"]
["00-00-03-03",6,null,6,0,0,3,3,"00","00","03","03"]
["00-00-04-02",5,null,6,0,0,4,2,"00","00","04","02"]
["00-00-05-01",4,null,6,0,0,5,1,"00","00","05","01"]
["00-00-06-00",4,null,6,0,0,6,0,"00","00","06","00"]
[{"$f":"I135&\"-\"&J135&\"-\"&K135&\"-\"&L135","v":"00-01-00-05"},5,null,6,0,1,0,5,"00","01","00","05"]
["00-01-01-04",5,null,6,0,1,1,4,{"$f":"IF(LEN(E136)=1,0&E136,IF(LEN(E136)=0,\"00\",RIGHT(E136,2)))","v":"00"},{"$f":"IF(LEN(F136)=1,0&F136,IF(LEN(F136)=0,\"00\",RIGHT(F136,2)))","v":"01"},{"$f":"IF(LEN(G136)=1,0&G136,IF(LEN(G136)=0,\"00\",RIGHT(G136,2)))","v":"01"},{"$f":"IF(LEN(H136)=1,0&H136,IF(LEN(H136)=0,\"00\",RIGHT(H136,2)))","v":"04"}]
["00-01-02-03",5,null,6,0,1,2,3,"00","01","02","03"]
["00-01-03-02",5,null,6,0,1,3,2,"00","01","03","02"]
["00-01-04-01",4,null,6,0,1,4,1,"00","01","04","01"]
["00-01-05-00",4,null,6,0,1,5,0,"00","01","05","00"]
["00-02-00-04",5,null,6,0,2,0,4,"00","02","00","04"]
["00-02-01-03",5,null,6,0,2,1,3,"00","02","01","03"]
["00-02-02-02",5,null,6,0,2,2,2,"00","02","02","02"]
["00-02-03-01",4,null,6,0,2,3,1,"00","02","03","01"]
["00-02-04-00",4,null,6,0,2,4,0,"00","02","04","00"]
["00-03-00-03",4,null,6,0,3,0,3,"00","03","00","03"]
["00-03-01-02",4,null,6,0,3,1,2,"00","03","01","02"]
["00-03-02-01",4,null,6,0,3,2,1,"00","03","02","01"]
["00-03-03-00",4,null,6,0,3,3,0,"00","03","03","00"]
["00-04-00-02",3,null,6,0,4,0,2,"00","04","00","02"]
["00-04-01-01",3,null,6,0,4,1,1,"00","04","01","01"]
["00-04-02-00",3,null,6,0,4,2,0,"00","04","02","00"]
["00-05-00-01",3,null,6,0,5,0,1,"00","05","00","01"]
["00-05-01-00",2,null,6,0,5,1,0,"00","05","01","00"]
["00-06-00-00",2,null,6,0,6,0,0,"00","06","00","00"]
["01-00-00-05",5,null,6,1,0,0,5,"01","00","00","05"]
["01-00-01-04",5,null,6,1,0,1,4,"01","00","01","04"]
["01-00-02-03",5,null,6,1,0,2,3,"01","00","02","03"]
["01-00-03-02",5,null,6,1,0,3,2,"01","00","03","02"]
["01-00-04-01",4,null,6,1,0,4,1,"01","00","04","01"]
["01-00-05-00",4,null,6,1,0,5,0,"01","00","05","00"]
["01-01-00-04",5,null,6,1,1,0,4,"01","01","00","04"]
["01-01-01-03",4,null,6,1,1,1,3,"01","01","01","03"]
["01-01-02-02",4,null,6,1,1,2,2,"01","01","02","02"]
["01-01-03-01",4,null,6,1,1,3,1,"01","01","03","01"]
["01-01-04-00",4,null,6,1,1,4,0,"01","01","04","00"]
["01-02-00-03",4,null,6,1,2,0,3,"01","02","00","03"]
["01-02-01-02",4,null,6,1,2,1,2,"01","02","01","02"]
["01-02-02-01",4,null,6,1,2,2,1,"01","02","02","01"]
["01-02-03-00",4,null,6,1,2,3,0,"01","02","03","00"]
["01-03-00-02",3,null,6,1,3,0,2,"01","03","00","02"]
["01-03-01-01",3,null,6,1,3,1,1,"01","03","01","01"]
["01-03-02-00",3,null,6,1,3,2,0,"01","03","02","00"]
["01-04-00-01",2,null,6,1,4,0,1,"01","04","00","01"]
["01-04-01-00",2,null,6,1,4,1,0,"01","04","01","00"]
["01-05-00-00",2,null,6,1,5,0,0,"01","05","00","00"]
["02-00-00-04",4,null,6,2,0,0,4,"02","00","00","04"]
["02-00-01-03",4,null,6,2,0,1,3,"02","00","01","03"]
["02-00-02-02",4,null,6,2,0,2,2,"02","00","02","02"]
["02-00-03-01",4,null,6,2,0,3,1,"02","00","03","01"]
["02-00-04-00",4,null,6,2,0,4,0,"02","00","04","00"]
["02-01-00-03",4,null,6,2,1,0,3,"02","01","00","03"]
["02-01-01-02",4,null,6,2,1,1,2,"02","01","01","02"]
["02-01-02-01",4,null,6,2,1,2,1,"02","01","02","01"]
["02-01-03-00",3,null,6,2,1,3,0,"02","01","03","00"]
["02-02-00-02",3,null,6,2,2,0,2,"02","02","00","02"]
["02-02-01-01",3,null,6,2,2,1,1,"02","02","01","01"]
["02-02-02-00",3,null,6,2,2,2,0,"02","02","02","00"]
["02-03-00-01",2,null,6,2,3,0,1,"02","03","00","01"]
["02-03-01-00",2,null,6,2,3,1,0,"02","03","01","00"]
["02-04-00-00",2,null,6,2,4,0,0,"02","04","00","00"]
["03-00-00-03",4,null,6,3,0,0,3,"03","00","00","03"]
["03-00-01-02",4,null,6,3,0,1,2,"03","00","01","02"]
["03-00-02-01",3,null,6,3,0,2,1,"03","00","02","01"]
["03-00-03-00",3,null,6,3,0,3,0,"03","00","03","00"]
["03-01-00-02",3,null,6,3,1,0,2,"03","01","00","02"]
["03-01-01-01",3,null,6,3,1,1,1,"03","01","01","01"]
["03-01-02-00",3,null,6,3,1,2,0,"03","01","02","00"]
[{"$f":"I199&\"-\"&J199&\"-\"&K199&\"-\"&L199","v":"03-02-00-01"},2,null,6,3,2,0,1,"03","02","00","01"]
["03-02-01-00",2,null,6,3,2,1,0,{"$f":"IF(LEN(E200)=1,0&E200,IF(LEN(E200)=0,\"00\",RIGHT(E200,2)))","v":"03"},{"$f":"IF(LEN(F200)=1,0&F200,IF(LEN(F200)=0,\"00\",RIGHT(F200,2)))","v":"02"},{"$f":"IF(LEN(G200)=1,0&G200,IF(LEN(G200)=0,\"00\",RIGHT(G200,2)))","v":"01"},{"$f":"IF(LEN(H200)=1,0&H200,IF(LEN(H200)=0,\"00\",RIGHT(H200,2)))","v":"00"}]
["03-03-00-00",2,null,6,3,3,0,0,"03","03","00","00"]
["04-00-00-02",3,null,6,4,0,0,2,"04","00","00","02"]
["04-00-01-01",3,null,6,4,0,1,1,"04","00","01","01"]
["04-00-02-00",3,null,6,4,0,2,0,"04","00","02","00"]
["04-01-00-01",2,null,6,4,1,0,1,"04","01","00","01"]
["04-01-01-00",2,null,6,4,1,1,0,"04","01","01","00"]
["04-02-00-00",2,null,6,4,2,0,0,"04","02","00","00"]
["05-00-00-01",2,null,6,5,0,0,1,"05","00","00","01"]
["05-00-01-00",2,null,6,5,0,1,0,"05","00","01","00"]
["05-01-00-00",2,null,6,5,1,0,0,"05","01","00","00"]
["06-00-00-00",1,null,6,6,0,0,0,"06","00","00","00"]
["00-00-00-07",7,null,7,0,0,0,7,"00","00","00","07"]
["00-00-01-06",6,null,7,0,0,1,6,"00","00","01","06"]
["00-00-02-05",6,null,7,0,0,2,5,"00","00","02","05"]
["00-00-03-04",6,null,7,0,0,3,4,"00","00","03","04"]
["00-00-04-03",5,null,7,0,0,4,3,"00","00","04","03"]
["00-00-05-02",5,null,7,0,0,5,2,"00","00","05","02"]
["00-00-06-01",4,null,7,0,0,6,1,"00","00","06","01"]
["00-00-07-00",4,null,7,0,0,7,0,"00","00","07","00"]
["00-01-00-06",5,null,7,0,1,0,6,"00","01","00","06"]
["00-01-01-05",5,null,7,0,1,1,5,"00","01","01","05"]
["00-01-02-04",5,null,7,0,1,2,4,"00","01","02","04"]
["00-01-03-03",5,null,7,0,1,3,3,"00","01","03","03"]
["00-01-04-02",5,null,7,0,1,4,2,"00","01","04","02"]
["00-01-05-01",4,null,7,0,1,5,1,"00","01","05","01"]
["00-01-06-00",4,null,7,0,1,6,0,"00","01","06","00"]
["00-02-00-05",5,null,7,0,2,0,5,"00","02","00","05"]
["00-02-01-04",5,null,7,0,2,1,4,"00","02","01","04"]
["00-02-02-03",5,null,7,0,2,2,3,"00","02","02","03"]
["00-02-03-02",5,null,7,0,2,3,2,"00","02","03","02"]
["00-02-04-01",4,null,7,0,2,4,1,"00","02","04","01"]
["00-02-05-00",4,null,7,0,2,5,0,"00","02","05","00"]
["00-03-00-04",5,null,7,0,3,0,4,"00","03","00","04"]
["00-03-01-03",5,null,7,0,3,1,3,"00","03","01","03"]
["00-03-02-02",4,null,7,0,3,2,2,"00","03","02","02"]
["00-03-03-01",4,null,7,0,3,3,1,"00","03","03","01"]
["00-03-04-00",4,null,7,0,3,4,0,"00","03","04","00"]
["00-04-00-03",3,null,7,0,4,0,3,"00","04","00","03"]
["00-04-01-02",3,null,7,0,4,1,2,"00","04","01","02"]
["00-04-02-01",3,null,7,0,4,2,1,"00","04","02","01"]
["00-04-03-00",3,null,7,0,4,3,0,"00","04","03","00"]
["00-05-00-02",3,null,7,0,5,0,2,"00","05","00","02"]
["00-05-01-01",3,null,7,0,5,1,1,"00","05","01","01"]
["00-05-02-00",3,null,7,0,5,2,0,"00","05","02","00"]
["00-06-00-01",3,null,7,0,6,0,1,"00","06","00","01"]
["00-06-01-00",2,null,7,0,6,1,0,"00","06","01","00"]
["00-07-00-00",2,null,7,0,7,0,0,"00","07","00","00"]
["01-00-00-06",5,null,7,1,0,0,6,"01","00","00","06"]
["01-00-01-05",5,null,7,1,0,1,5,"01","00","01","05"]
["01-00-02-04",5,null,7,1,0,2,4,"01","00","02","04"]
["01-00-03-03",5,null,7,1,0,3,3,"01","00","03","03"]
["01-00-04-02",5,null,7,1,0,4,2,"01","00","04","02"]
["01-00-05-01",4,null,7,1,0,5,1,"01","00","05","01"]
["01-00-06-00",4,null,7,1,0,6,0,"01","00","06","00"]
["01-01-00-05",5,null,7,1,1,0,5,"01","01","00","05"]
["01-01-01-04",5,null,7,1,1,1,4,"01","01","01","04"]
["01-01-02-03",5,null,7,1,1,2,3,"01","01","02","03"]
["01-01-03-02",4,null,7,1,1,3,2,"01","01","03","02"]
["01-01-04-01",4,null,7,1,1,4,1,"01","01","04","01"]
["01-01-05-00",4,null,7,1,1,5,0,"01","01","05","00"]
["01-02-00-04",4,null,7,1,2,0,4,"01","02","00","04"]
["01-02-01-03",4,null,7,1,2,1,3,"01","02","01","03"]
[{"$f":"I263&\"-\"&J263&\"-\"&K263&\"-\"&L263","v":"01-02-02-02"},4,null,7,1,2,2,2,"01","02","02","02"]
["01-02-03-01",4,null,7,1,2,3,1,{"$f":"IF(LEN(E264)=1,0&E264,IF(LEN(E264)=0,\"00\",RIGHT(E264,2)))","v":"01"},{"$f":"IF(LEN(F264)=1,0&F264,IF(LEN(F264)=0,\"00\",RIGHT(F264,2)))","v":"02"},{"$f":"IF(LEN(G264)=1,0&G264,IF(LEN(G264)=0,\"00\",RIGHT(G264,2)))","v":"03"},{"$f":"IF(LEN(H264)=1,0&H264,IF(LEN(H264)=0,\"00\",RIGHT(H264,2)))","v":"01"}]
["01-02-04-00",4,null,7,1,2,4,0,"01","02","04","00"]
["01-03-00-03",3,null,7,1,3,0,3,"01","03","00","03"]
["01-03-01-02",3,null,7,1,3,1,2,"01","03","01","02"]
["01-03-02-01",3,null,7,1,3,2,1,"01","03","02","01"]
["01-03-03-00",3,null,7,1,3,3,0,"01","03","03","00"]
["01-04-00-02",3,null,7,1,4,0,2,"01","04","00","02"]
["01-04-01-01",3,null,7,1,4,1,1,"01","04","01","01"]
["01-04-02-00",3,null,7,1,4,2,0,"01","04","02","00"]
["01-05-00-01",2,null,7,1,5,0,1,"01","05","00","01"]
["01-05-01-00",2,null,7,1,5,1,0,"01","05","01","00"]
["01-06-00-00",2,null,7,1,6,0,0,"01","06","00","00"]
["02-00-00-05",5,null,7,2,0,0,5,"02","00","00","05"]
["02-00-01-04",4,null,7,2,0,1,4,"02","00","01","04"]
["02-00-02-03",4,null,7,2,0,2,3,"02","00","02","03"]
["02-00-03-02",4,null,7,2,0,3,2,"02","00","03","02"]
["02-00-04-01",4,null,7,2,0,4,1,"02","00","04","01"]
["02-00-05-00",4,null,7,2,0,5,0,"02","00","05","00"]
["02-01-00-04",4,null,7,2,1,0,4,"02","01","00","04"]
["02-01-01-03",4,null,7,2,1,1,3,"02","01","01","03"]
["02-01-02-02",4,null,7,2,1,2,2,"02","01","02","02"]
["02-01-03-01",4,null,7,2,1,3,1,"02","01","03","01"]
["02-01-04-00",4,null,7,2,1,4,0,"02","01","04","00"]
["02-02-00-03",3,null,7,2,2,0,3,"02","02","00","03"]
["02-02-01-02",3,null,7,2,2,1,2,"02","02","01","02"]
["02-02-02-01",3,null,7,2,2,2,1,"02","02","02","01"]
["02-02-03-00",3,null,7,2,2,3,0,"02","02","03","00"]
["02-03-00-02",3,null,7,2,3,0,2,"02","03","00","02"]
["02-03-01-01",3,null,7,2,3,1,1,"02","03","01","01"]
["02-03-02-00",3,null,7,2,3,2,0,"02","03","02","00"]
["02-04-00-01",2,null,7,2,4,0,1,"02","04","00","01"]
["02-04-01-00",2,null,7,2,4,1,0,"02","04","01","00"]
["02-05-00-00",2,null,7,2,5,0,0,"02","05","00","00"]
["03-00-00-04",4,null,7,3,0,0,4,"03","00","00","04"]
["03-00-01-03",4,null,7,3,0,1,3,"03","00","01","03"]
["03-00-02-02",4,null,7,3,0,2,2,"03","00","02","02"]
["03-00-03-01",4,null,7,3,0,3,1,"03","00","03","01"]
["03-00-04-00",3,null,7,3,0,4,0,"03","00","04","00"]
["03-01-00-03",3,null,7,3,1,0,3,"03","01","00","03"]
["03-01-01-02",3,null,7,3,1,1,2,"03","01","01","02"]
["03-01-02-01",3,null,7,3,1,2,1,"03","01","02","01"]
["03-01-03-00",3,null,7,3,1,3,0,"03","01","03","00"]
["03-02-00-02",3,null,7,3,2,0,2,"03","02","00","02"]
["03-02-01-01",3,null,7,3,2,1,1,"03","02","01","01"]
["03-02-02-00",3,null,7,3,2,2,0,"03","02","02","00"]
["03-03-00-01",2,null,7,3,3,0,1,"03","03","00","01"]
["03-03-01-00",2,null,7,3,3,1,0,"03","03","01","00"]
["03-04-00-00",2,null,7,3,4,0,0,"03","04","00","00"]
["04-00-00-03",3,null,7,4,0,0,3,"04","00","00","03"]
["04-00-01-02",3,null,7,4,0,1,2,"04","00","01","02"]
["04-00-02-01",3,null,7,4,0,2,1,"04","00","02","01"]
["04-00-03-00",3,null,7,4,0,3,0,"04","00","03","00"]
["04-01-00-02",3,null,7,4,1,0,2,"04","01","00","02"]
["04-01-01-01",3,null,7,4,1,1,1,"04","01","01","01"]
["04-01-02-00",3,null,7,4,1,2,0,"04","01","02","00"]
["04-02-00-01",2,null,7,4,2,0,1,"04","02","00","01"]
["04-02-01-00",2,null,7,4,2,1,0,"04","02","01","00"]
["04-03-00-00",2,null,7,4,3,0,0,"04","03","00","00"]
["05-00-00-02",3,null,7,5,0,0,2,"05","00","00","02"]
["05-00-01-01",3,null,7,5,0,1,1,"05","00","01","01"]
["05-00-02-00",3,null,7,5,0,2,0,"05","00","02","00"]
["05-01-00-01",2,null,7,5,1,0,1,"05","01","00","01"]
["05-01-01-00",2,null,7,5,1,1,0,"05","01","01","00"]
[{"$f":"I327&\"-\"&J327&\"-\"&K327&\"-\"&L327","v":"05-02-00-00"},2,null,7,5,2,0,0,"05","02","00","00"]
["06-00-00-01",2,null,7,6,0,0,1,{"$f":"IF(LEN(E328)=1,0&E328,IF(LEN(E328)=0,\"00\",RIGHT(E328,2)))","v":"06"},{"$f":"IF(LEN(F328)=1,0&F328,IF(LEN(F328)=0,\"00\",RIGHT(F328,2)))","v":"00"},{"$f":"IF(LEN(G328)=1,0&G328,IF(LEN(G328)=0,\"00\",RIGHT(G328,2)))","v":"00"},{"$f":"IF(LEN(H328)=1,0&H328,IF(LEN(H328)=0,\"00\",RIGHT(H328,2)))","v":"01"}]
["06-00-01-00",2,null,7,6,0,1,0,"06","00","01","00"]
["06-01-00-00",2,null,7,6,1,0,0,"06","01","00","00"]
["07-00-00-00",1,null,7,7,0,0,0,"07","00","00","00"]
["00-00-00-08",7,null,8,0,0,0,8,"00","00","00","08"]
["00-00-01-07",6,null,8,0,0,1,7,"00","00","01","07"]
["00-00-02-06",6,null,8,0,0,2,6,"00","00","02","06"]
["00-00-03-05",6,null,8,0,0,3,5,"00","00","03","05"]
["00-00-04-04",6,null,8,0,0,4,4,"00","00","04","04"]
["00-00-05-03",5,null,8,0,0,5,3,"00","00","05","03"]
["00-00-06-02",5,null,8,0,0,6,2,"00","00","06","02"]
["00-00-07-01",4,null,8,0,0,7,1,"00","00","07","01"]
["00-00-08-00",4,null,8,0,0,8,0,"00","00","08","00"]
["00-01-00-07",5,null,8,0,1,0,7,"00","01","00","07"]
["00-01-01-06",5,null,8,0,1,1,6,"00","01","01","06"]
["00-01-02-05",5,null,8,0,1,2,5,"00","01","02","05"]
["00-01-03-04",5,null,8,0,1,3,4,"00","01","03","04"]
["00-01-04-03",5,null,8,0,1,4,3,"00","01","04","03"]
["00-01-05-02",5,null,8,0,1,5,2,"00","01","05","02"]
["00-01-06-01",4,null,8,0,1,6,1,"00","01","06","01"]
["00-01-07-00",4,null,8,0,1,7,0,"00","01","07","00"]
["00-02-00-06",5,null,8,0,2,0,6,"00","02","00","06"]
["00-02-01-05",5,null,8,0,2,1,5,"00","02","01","05"]
["00-02-02-04",5,null,8,0,2,2,4,"00","02","02","04"]
["00-02-03-03",5,null,8,0,2,3,3,"00","02","03","03"]
["00-02-04-02",5,null,8,0,2,4,2,"00","02","04","02"]
["00-02-05-01",4,null,8,0,2,5,1,"00","02","05","01"]
["00-02-06-00",4,null,8,0,2,6,0,"00","02","06","00"]
["00-03-00-05",5,null,8,0,3,0,5,"00","03","00","05"]
["00-03-01-04",5,null,8,0,3,1,4,"00","03","01","04"]
["00-03-02-03",5,null,8,0,3,2,3,"00","03","02","03"]
["00-03-03-02",4,null,8,0,3,3,2,"00","03","03","02"]
["00-03-04-01",4,null,8,0,3,4,1,"00","03","04","01"]
["00-03-05-00",4,null,8,0,3,5,0,"00","03","05","00"]
["00-04-00-04",4,null,8,0,4,0,4,"00","04","00","04"]
["00-04-01-03",4,null,8,0,4,1,3,"00","04","01","03"]
["00-04-02-02",4,null,8,0,4,2,2,"00","04","02","02"]
["00-04-03-01",4,null,8,0,4,3,1,"00","04","03","01"]
["00-04-04-00",4,null,8,0,4,4,0,"00","04","04","00"]
["00-05-00-03",3,null,8,0,5,0,3,"00","05","00","03"]
["00-05-01-02",3,null,8,0,5,1,2,"00","05","01","02"]
["00-05-02-01",3,null,8,0,5,2,1,"00","05","02","01"]
["00-05-03-00",3,null,8,0,5,3,0,"00","05","03","00"]
["00-06-00-02",3,null,8,0,6,0,2,"00","06","00","02"]
["00-06-01-01",3,null,8,0,6,1,1,"00","06","01","01"]
["00-06-02-00",3,null,8,0,6,2,0,"00","06","02","00"]
["00-07-00-01",3,null,8,0,7,0,1,"00","07","00","01"]
["00-07-01-00",2,null,8,0,7,1,0,"00","07","01","00"]
["00-08-00-00",2,null,8,0,8,0,0,"00","08","00","00"]
["01-00-00-07",5,null,8,1,0,0,7,"01","00","00","07"]
["01-00-01-06",5,null,8,1,0,1,6,"01","00","01","06"]
["01-00-02-05",5,null,8,1,0,2,5,"01","00","02","05"]
["01-00-03-04",5,null,8,1,0,3,4,"01","00","03","04"]
["01-00-04-03",5,null,8,1,0,4,3,"01","00","04","03"]
["01-00-05-02",5,null,8,1,0,5,2,"01","00","05","02"]
["01-00-06-01",4,null,8,1,0,6,1,"01","00","06","01"]
["01-00-07-00",4,null,8,1,0,7,0,"01","00","07","00"]
["01-01-00-06",5,null,8,1,1,0,6,"01","01","00","06"]
["01-01-01-05",5,null,8,1,1,1,5,"01","01","01","05"]
["01-01-02-04",5,null,8,1,1,2,4,"01","01","02","04"]
["01-01-03-03",5,null,8,1,1,3,3,"01","01","03","03"]
["01-01-04-02",4,null,8,1,1,4,2,"01","01","04","02"]
["01-01-05-01",4,null,8,1,1,5,1,"01","01","05","01"]
[{"$f":"I391&\"-\"&J391&\"-\"&K391&\"-\"&L391","v":"01-01-06-00"},4,null,8,1,1,6,0,"01","01","06","00"]
["01-02-00-05",5,null,8,1,2,0,5,{"$f":"IF(LEN(E392)=1,0&E392,IF(LEN(E392)=0,\"00\",RIGHT(E392,2)))","v":"01"},{"$f":"IF(LEN(F392)=1,0&F392,IF(LEN(F392)=0,\"00\",RIGHT(F392,2)))","v":"02"},{"$f":"IF(LEN(G392)=1,0&G392,IF(LEN(G392)=0,\"00\",RIGHT(G392,2)))","v":"00"},{"$f":"IF(LEN(H392)=1,0&H392,IF(LEN(H392)=0,\"00\",RIGHT(H392,2)))","v":"05"}]
["01-02-01-04",4,null,8,1,2,1,4,"01","02","01","04"]
["01-02-02-03",4,null,8,1,2,2,3,"01","02","02","03"]
["01-02-03-02",4,null,8,1,2,3,2,"01","02","03","02"]
["01-02-04-01",4,null,8,1,2,4,1,"01","02","04","01"]
["01-02-05-00",4,null,8,1,2,5,0,"01","02","05","00"]
["01-03-00-04",4,null,8,1,3,0,4,"01","03","00","04"]
["01-03-01-03",4,null,8,1,3,1,3,"01","03","01","03"]
["01-03-02-02",4,null,8,1,3,2,2,"01","03","02","02"]
["01-03-03-01",4,null,8,1,3,3,1,"01","03","03","01"]
["01-03-04-00",4,null,8,1,3,4,0,"01","03","04","00"]
["01-04-00-03",3,null,8,1,4,0,3,"01","04","00","03"]
["01-04-01-02",3,null,8,1,4,1,2,"01","04","01","02"]
["01-04-02-01",3,null,8,1,4,2,1,"01","04","02","01"]
["01-04-03-00",3,null,8,1,4,3,0,"01","04","03","00"]
["01-05-00-02",3,null,8,1,5,0,2,"01","05","00","02"]
["01-05-01-01",3,null,8,1,5,1,1,"01","05","01","01"]
["01-05-02-00",2,null,8,1,5,2,0,"01","05","02","00"]
["01-06-00-01",2,null,8,1,6,0,1,"01","06","00","01"]
["01-06-01-00",2,null,8,1,6,1,0,"01","06","01","00"]
["01-07-00-00",2,null,8,1,7,0,0,"01","07","00","00"]
["02-00-00-06",5,null,8,2,0,0,6,"02","00","00","06"]
["02-00-01-05",5,null,8,2,0,1,5,"02","00","01","05"]
["02-00-02-04",4,null,8,2,0,2,4,"02","00","02","04"]
["02-00-03-03",4,null,8,2,0,3,3,"02","00","03","03"]
["02-00-04-02",4,null,8,2,0,4,2,"02","00","04","02"]
["02-00-05-01",4,null,8,2,0,5,1,"02","00","05","01"]
["02-00-06-00",4,null,8,2,0,6,0,"02","00","06","00"]
["02-01-00-05",4,null,8,2,1,0,5,"02","01","00","05"]
["02-01-01-04",4,null,8,2,1,1,4,"02","01","01","04"]
["02-01-02-03",4,null,8,2,1,2,3,"02","01","02","03"]
["02-01-03-02",4,null,8,2,1,3,2,"02","01","03","02"]
["02-01-04-01",4,null,8,2,1,4,1,"02","01","04","01"]
["02-01-05-00",4,null,8,2,1,5,0,"02","01","05","00"]
["02-02-00-04",4,null,8,2,2,0,4,"02","02","00","04"]
["02-02-01-03",4,null,8,2,2,1,3,"02","02","01","03"]
["02-02-02-02",4,null,8,2,2,2,2,"02","02","02","02"]
["02-02-03-01",4,null,8,2,2,3,1,"02","02","03","01"]
["02-02-04-00",4,null,8,2,2,4,0,"02","02","04","00"]
["02-03-00-03",3,null,8,2,3,0,3,"02","03","00","03"]
["02-03-01-02",3,null,8,2,3,1,2,"02","03","01","02"]
["02-03-02-01",3,null,8,2,3,2,1,"02","03","02","01"]
["02-03-03-00",3,null,8,2,3,3,0,"02","03","03","00"]
["02-04-00-02",3,null,8,2,4,0,2,"02","04","00","02"]
["02-04-01-01",3,null,8,2,4,1,1,"02","04","01","01"]
["02-04-02-00",2,null,8,2,4,2,0,"02","04","02","00"]
["02-05-00-01",2,null,8,2,5,0,1,"02","05","00","01"]
["02-05-01-00",2,null,8,2,5,1,0,"02","05","01","00"]
["02-06-00-00",2,null,8,2,6,0,0,"02","06","00","00"]
["03-00-00-05",4,null,8,3,0,0,5,"03","00","00","05"]
["03-00-01-04",4,null,8,3,0,1,4,"03","00","01","04"]
["03-00-02-03",4,null,8,3,0,2,3,"03","00","02","03"]
["03-00-03-02",4,null,8,3,0,3,2,"03","00","03","02"]
["03-00-04-01",4,null,8,3,0,4,1,"03","00","04","01"]
["03-00-05-00",4,null,8,3,0,5,0,"03","00","05","00"]
["03-01-00-04",4,null,8,3,1,0,4,"03","01","00","04"]
["03-01-01-03",4,null,8,3,1,1,3,"03","01","01","03"]
["03-01-02-02",4,null,8,3,1,2,2,"03","01","02","02"]
["03-01-03-01",4,null,8,3,1,3,1,"03","01","03","01"]
["03-01-04-00",3,null,8,3,1,4,0,"03","01","04","00"]
["03-02-00-03",3,null,8,3,2,0,3,"03","02","00","03"]
["03-02-01-02",3,null,8,3,2,1,2,"03","02","01","02"]
["03-02-02-01",3,null,8,3,2,2,1,"03","02","02","01"]
[{"$f":"I455&\"-\"&J455&\"-\"&K455&\"-\"&L455","v":"03-02-03-00"},3,null,8,3,2,3,0,"03","02","03","00"]
["03-03-00-02",3,null,8,3,3,0,2,{"$f":"IF(LEN(E456)=1,0&E456,IF(LEN(E456)=0,\"00\",RIGHT(E456,2)))","v":"03"},{"$f":"IF(LEN(F456)=1,0&F456,IF(LEN(F456)=0,\"00\",RIGHT(F456,2)))","v":"03"},{"$f":"IF(LEN(G456)=1,0&G456,IF(LEN(G456)=0,\"00\",RIGHT(G456,2)))","v":"00"},{"$f":"IF(LEN(H456)=1,0&H456,IF(LEN(H456)=0,\"00\",RIGHT(H456,2)))","v":"02"}]
["03-03-01-01",2,null,8,3,3,1,1,"03","03","01","01"]
["03-03-02-00",2,null,8,3,3,2,0,"03","03","02","00"]
["03-04-00-01",2,null,8,3,4,0,1,"03","04","00","01"]
["03-04-01-00",2,null,8,3,4,1,0,"03","04","01","00"]
["03-05-00-00",2,null,8,3,5,0,0,"03","05","00","00"]
["04-00-00-04",4,null,8,4,0,0,4,"04","00","00","04"]
["04-00-01-03",4,null,8,4,0,1,3,"04","00","01","03"]
["04-00-02-02",3,null,8,4,0,2,2,"04","00","02","02"]
["04-00-03-01",3,null,8,4,0,3,1,"04","00","03","01"]
["04-00-04-00",3,null,8,4,0,4,0,"04","00","04","00"]
["04-01-00-03",3,null,8,4,1,0,3,"04","01","00","03"]
["04-01-01-02",3,null,8,4,1,1,2,"04","01","01","02"]
["04-01-02-01",3,null,8,4,1,2,1,"04","01","02","01"]
["04-01-03-00",3,null,8,4,1,3,0,"04","01","03","00"]
["04-02-00-02",3,null,8,4,2,0,2,"04","02","00","02"]
["04-02-01-01",2,null,8,4,2,1,1,"04","02","01","01"]
["04-02-02-00",2,null,8,4,2,2,0,"04","02","02","00"]
["04-03-00-01",2,null,8,4,3,0,1,"04","03","00","01"]
["04-03-01-00",2,null,8,4,3,1,0,"04","03","01","00"]
["04-04-00-00",2,null,8,4,4,0,0,"04","04","00","00"]
["05-00-00-03",3,null,8,5,0,0,3,"05","00","00","03"]
["05-00-01-02",3,null,8,5,0,1,2,"05","00","01","02"]
["05-00-02-01",3,null,8,5,0,2,1,"05","00","02","01"]
["05-00-03-00",3,null,8,5,0,3,0,"05","00","03","00"]
["05-01-00-02",3,null,8,5,1,0,2,"05","01","00","02"]
["05-01-01-01",2,null,8,5,1,1,1,"05","01","01","01"]
["05-01-02-00",2,null,8,5,1,2,0,"05","01","02","00"]
["05-02-00-01",2,null,8,5,2,0,1,"05","02","00","01"]
["05-02-01-00",2,null,8,5,2,1,0,"05","02","01","00"]
["05-03-00-00",2,null,8,5,3,0,0,"05","03","00","00"]
["06-00-00-02",3,null,8,6,0,0,2,"06","00","00","02"]
["06-00-01-01",2,null,8,6,0,1,1,"06","00","01","01"]
["06-00-02-00",2,null,8,6,0,2,0,"06","00","02","00"]
["06-01-00-01",2,null,8,6,1,0,1,"06","01","00","01"]
["06-01-01-00",2,null,8,6,1,1,0,"06","01","01","00"]
["06-02-00-00",2,null,8,6,2,0,0,"06","02","00","00"]
["07-00-00-01",2,null,8,7,0,0,1,"07","00","00","01"]
["07-00-01-00",2,null,8,7,0,1,0,"07","00","01","00"]
["07-01-00-00",2,null,8,7,1,0,0,"07","01","00","00"]
["08-00-00-00",1,null,8,8,0,0,0,"08","00","00","00"]
["00-00-00-09",7,null,9,0,0,0,9,"00","00","00","09"]
["00-00-01-08",6,null,9,0,0,1,8,"00","00","01","08"]
["00-00-02-07",6,null,9,0,0,2,7,"00","00","02","07"]
["00-00-03-06",6,null,9,0,0,3,6,"00","00","03","06"]
["00-00-04-05",6,null,9,0,0,4,5,"00","00","04","05"]
["00-00-05-04",5,null,9,0,0,5,4,"00","00","05","04"]
["00-00-06-03",5,null,9,0,0,6,3,"00","00","06","03"]
["00-00-07-02",5,null,9,0,0,7,2,"00","00","07","02"]
["00-00-08-01",4,null,9,0,0,8,1,"00","00","08","01"]
["00-00-09-00",4,null,9,0,0,9,0,"00","00","09","00"]
["00-01-00-08",5,null,9,0,1,0,8,"00","01","00","08"]
["00-01-01-07",5,null,9,0,1,1,7,"00","01","01","07"]
["00-01-02-06",5,null,9,0,1,2,6,"00","01","02","06"]
["00-01-03-05",5,null,9,0,1,3,5,"00","01","03","05"]
["00-01-04-04",5,null,9,0,1,4,4,"00","01","04","04"]
["00-01-05-03",5,null,9,0,1,5,3,"00","01","05","03"]
["00-01-06-02",5,null,9,0,1,6,2,"00","01","06","02"]
["00-01-07-01",4,null,9,0,1,7,1,"00","01","07","01"]
["00-01-08-00",4,null,9,0,1,8,0,"00","01","08","00"]
["00-02-00-07",5,null,9,0,2,0,7,"00","02","00","07"]
["00-02-01-06",5,null,9,0,2,1,6,"00","02","01","06"]
["00-02-02-05",5,null,9,0,2,2,5,"00","02","02","05"]
[{"$f":"I519&\"-\"&J519&\"-\"&K519&\"-\"&L519","v":"00-02-03-04"},5,null,9,0,2,3,4,"00","02","03","04"]
["00-02-04-03",5,null,9,0,2,4,3,{"$f":"IF(LEN(E520)=1,0&E520,IF(LEN(E520)=0,\"00\",RIGHT(E520,2)))","v":"00"},{"$f":"IF(LEN(F520)=1,0&F520,IF(LEN(F520)=0,\"00\",RIGHT(F520,2)))","v":"02"},{"$f":"IF(LEN(G520)=1,0&G520,IF(LEN(G520)=0,\"00\",RIGHT(G520,2)))","v":"04"},{"$f":"IF(LEN(H520)=1,0&H520,IF(LEN(H520)=0,\"00\",RIGHT(H520,2)))","v":"03"}]
["00-02-05-02",5,null,9,0,2,5,2,"00","02","05","02"]
["00-02-06-01",4,null,9,0,2,6,1,"00","02","06","01"]
["00-02-07-00",4,null,9,0,2,7,0,"00","02","07","00"]
["00-03-00-06",5,null,9,0,3,0,6,"00","03","00","06"]
["00-03-01-05",5,null,9,0,3,1,5,"00","03","01","05"]
["00-03-02-04",5,null,9,0,3,2,4,"00","03","02","04"]
["00-03-03-03",5,null,9,0,3,3,3,"00","03","03","03"]
["00-03-04-02",4,null,9,0,3,4,2,"00","03","04","02"]
["00-03-05-01",4,null,9,0,3,5,1,"00","03","05","01"]
["00-03-06-00",4,null,9,0,3,6,0,"00","03","06","00"]
["00-04-00-05",5,null,9,0,4,0,5,"00","04","00","05"]
["00-04-01-04",4,null,9,0,4,1,4,"00","04","01","04"]
["00-04-02-03",4,null,9,0,4,2,3,"00","04","02","03"]
["00-04-03-02",4,null,9,0,4,3,2,"00","04","03","02"]
["00-04-04-01",4,null,9,0,4,4,1,"00","04","04","01"]
["00-04-05-00",4,null,9,0,4,5,0,"00","04","05","00"]
["00-05-00-04",3,null,9,0,5,0,4,"00","05","00","04"]
["00-05-01-03",3,null,9,0,5,1,3,"00","05","01","03"]
["00-05-02-02",3,null,9,0,5,2,2,"00","05","02","02"]
["00-05-03-01",3,null,9,0,5,3,1,"00","05","03","01"]
["00-05-04-00",3,null,9,0,5,4,0,"00","05","04","00"]
["00-06-00-03",3,null,9,0,6,0,3,"00","06","00","03"]
["00-06-01-02",3,null,9,0,6,1,2,"00","06","01","02"]
["00-06-02-01",3,null,9,0,6,2,1,"00","06","02","01"]
["00-06-03-00",3,null,9,0,6,3,0,"00","06","03","00"]
["00-07-00-02",3,null,9,0,7,0,2,"00","07","00","02"]
["00-07-01-01",3,null,9,0,7,1,1,"00","07","01","01"]
["00-07-02-00",3,null,9,0,7,2,0,"00","07","02","00"]
["00-08-00-01",2,null,9,0,8,0,1,"00","08","00","01"]
["00-08-01-00",2,null,9,0,8,1,0,"00","08","01","00"]
["00-09-00-00",2,null,9,0,9,0,0,"00","09","00","00"]
["01-00-00-08",5,null,9,1,0,0,8,"01","00","00","08"]
["01-00-01-07",5,null,9,1,0,1,7,"01","00","01","07"]
["01-00-02-06",5,null,9,1,0,2,6,"01","00","02","06"]
["01-00-03-05",5,null,9,1,0,3,5,"01","00","03","05"]
["01-00-04-04",5,null,9,1,0,4,4,"01","00","04","04"]
["01-00-05-03",5,null,9,1,0,5,3,"01","00","05","03"]
["01-00-06-02",5,null,9,1,0,6,2,"01","00","06","02"]
["01-00-07-01",4,null,9,1,0,7,1,"01","00","07","01"]
["01-00-08-00",4,null,9,1,0,8,0,"01","00","08","00"]
["01-01-00-07",5,null,9,1,1,0,7,"01","01","00","07"]
["01-01-01-06",5,null,9,1,1,1,6,"01","01","01","06"]
["01-01-02-05",5,null,9,1,1,2,5,"01","01","02","05"]
["01-01-03-04",5,null,9,1,1,3,4,"01","01","03","04"]
["01-01-04-03",5,null,9,1,1,4,3,"01","01","04","03"]
["01-01-05-02",4,null,9,1,1,5,2,"01","01","05","02"]
["01-01-06-01",4,null,9,1,1,6,1,"01","01","06","01"]
["01-01-07-00",4,null,9,1,1,7,0,"01","01","07","00"]
["01-02-00-06",5,null,9,1,2,0,6,"01","02","00","06"]
["01-02-01-05",5,null,9,1,2,1,5,"01","02","01","05"]
["01-02-02-04",4,null,9,1,2,2,4,"01","02","02","04"]
["01-02-03-03",4,null,9,1,2,3,3,"01","02","03","03"]
["01-02-04-02",4,null,9,1,2,4,2,"01","02","04","02"]
["01-02-05-01",4,null,9,1,2,5,1,"01","02","05","01"]
["01-02-06-00",4,null,9,1,2,6,0,"01","02","06","00"]
["01-03-00-05",4,null,9,1,3,0,5,"01","03","00","05"]
["01-03-01-04",4,null,9,1,3,1,4,"01","03","01","04"]
["01-03-02-03",4,null,9,1,3,2,3,"01","03","02","03"]
["01-03-03-02",4,null,9,1,3,3,2,"01","03","03","02"]
["01-03-04-01",4,null,9,1,3,4,1,"01","03","04","01"]
["01-03-05-00",4,null,9,1,3,5,0,"01","03","05","00"]
["01-04-00-04",3,null,9,1,4,0,4,"01","04","00","04"]
[{"$f":"I583&\"-\"&J583&\"-\"&K583&\"-\"&L583","v":"01-04-01-03"},3,null,9,1,4,1,3,"01","04","01","03"]
["01-04-02-02",3,null,9,1,4,2,2,{"$f":"IF(LEN(E584)=1,0&E584,IF(LEN(E584)=0,\"00\",RIGHT(E584,2)))","v":"01"},{"$f":"IF(LEN(F584)=1,0&F584,IF(LEN(F584)=0,\"00\",RIGHT(F584,2)))","v":"04"},{"$f":"IF(LEN(G584)=1,0&G584,IF(LEN(G584)=0,\"00\",RIGHT(G584,2)))","v":"02"},{"$f":"IF(LEN(H584)=1,0&H584,IF(LEN(H584)=0,\"00\",RIGHT(H584,2)))","v":"02"}]
["01-04-03-01",3,null,9,1,4,3,1,"01","04","03","01"]
["01-04-04-00",3,null,9,1,4,4,0,"01","04","04","00"]
["01-05-00-03",3,null,9,1,5,0,3,"01","05","00","03"]
["01-05-01-02",3,null,9,1,5,1,2,"01","05","01","02"]
["01-05-02-01",3,null,9,1,5,2,1,"01","05","02","01"]
["01-05-03-00",3,null,9,1,5,3,0,"01","05","03","00"]
["01-06-00-02",3,null,9,1,6,0,2,"01","06","00","02"]
["01-06-01-01",2,null,9,1,6,1,1,"01","06","01","01"]
["01-06-02-00",2,null,9,1,6,2,0,"01","06","02","00"]
["01-07-00-01",2,null,9,1,7,0,1,"01","07","00","01"]
["01-07-01-00",2,null,9,1,7,1,0,"01","07","01","00"]
["01-08-00-00",2,null,9,1,8,0,0,"01","08","00","00"]
["02-00-00-07",5,null,9,2,0,0,7,"02","00","00","07"]
["02-00-01-06",5,null,9,2,0,1,6,"02","00","01","06"]
["02-00-02-05",5,null,9,2,0,2,5,"02","00","02","05"]
["02-00-03-04",4,null,9,2,0,3,4,"02","00","03","04"]
["02-00-04-03",4,null,9,2,0,4,3,"02","00","04","03"]
["02-00-05-02",4,null,9,2,0,5,2,"02","00","05","02"]
["02-00-06-01",4,null,9,2,0,6,1,"02","00","06","01"]
["02-00-07-00",4,null,9,2,0,7,0,"02","00","07","00"]
["02-01-00-06",5,null,9,2,1,0,6,"02","01","00","06"]
["02-01-01-05",4,null,9,2,1,1,5,"02","01","01","05"]
["02-01-02-04",4,null,9,2,1,2,4,"02","01","02","04"]
["02-01-03-03",4,null,9,2,1,3,3,"02","01","03","03"]
["02-01-04-02",4,null,9,2,1,4,2,"02","01","04","02"]
["02-01-05-01",4,null,9,2,1,5,1,"02","01","05","01"]
["02-01-06-00",4,null,9,2,1,6,0,"02","01","06","00"]
["02-02-00-05",4,null,9,2,2,0,5,"02","02","00","05"]
["02-02-01-04",4,null,9,2,2,1,4,"02","02","01","04"]
["02-02-02-03",4,null,9,2,2,2,3,"02","02","02","03"]
["02-02-03-02",4,null,9,2,2,3,2,"02","02","03","02"]
["02-02-04-01",4,null,9,2,2,4,1,"02","02","04","01"]
["02-02-05-00",4,null,9,2,2,5,0,"02","02","05","00"]
["02-03-00-04",3,null,9,2,3,0,4,"02","03","00","04"]
["02-03-01-03",3,null,9,2,3,1,3,"02","03","01","03"]
["02-03-02-02",3,null,9,2,3,2,2,"02","03","02","02"]
["02-03-03-01",3,null,9,2,3,3,1,"02","03","03","01"]
["02-03-04-00",3,null,9,2,3,4,0,"02","03","04","00"]
["02-04-00-03",3,null,9,2,4,0,3,"02","04","00","03"]
["02-04-01-02",3,null,9,2,4,1,2,"02","04","01","02"]
["02-04-02-01",3,null,9,2,4,2,1,"02","04","02","01"]
["02-04-03-00",3,null,9,2,4,3,0,"02","04","03","00"]
["02-05-00-02",3,null,9,2,5,0,2,"02","05","00","02"]
["02-05-01-01",2,null,9,2,5,1,1,"02","05","01","01"]
["02-05-02-00",2,null,9,2,5,2,0,"02","05","02","00"]
["02-06-00-01",2,null,9,2,6,0,1,"02","06","00","01"]
["02-06-01-00",2,null,9,2,6,1,0,"02","06","01","00"]
["02-07-00-00",2,null,9,2,7,0,0,"02","07","00","00"]
["03-00-00-06",4,null,9,3,0,0,6,"03","00","00","06"]
["03-00-01-05",4,null,9,3,0,1,5,"03","00","01","05"]
["03-00-02-04",4,null,9,3,0,2,4,"03","00","02","04"]
["03-00-03-03",4,null,9,3,0,3,3,"03","00","03","03"]
["03-00-04-02",4,null,9,3,0,4,2,"03","00","04","02"]
["03-00-05-01",4,null,9,3,0,5,1,"03","00","05","01"]
["03-00-06-00",4,null,9,3,0,6,0,"03","00","06","00"]
["03-01-00-05",4,null,9,3,1,0,5,"03","01","00","05"]
["03-01-01-04",4,null,9,3,1,1,4,"03","01","01","04"]
["03-01-02-03",4,null,9,3,1,2,3,"03","01","02","03"]
["03-01-03-02",4,null,9,3,1,3,2,"03","01","03","02"]
["03-01-04-01",4,null,9,3,1,4,1,"03","01","04","01"]
["03-01-05-00",4,null,9,3,1,5,0,"03","01","05","00"]
["03-02-00-04",3,null,9,3,2,0,4,"03","02","00","04"]
[{"$f":"I647&\"-\"&J647&\"-\"&K647&\"-\"&L647","v":"03-02-01-03"},3,null,9,3,2,1,3,"03","02","01","03"]
["03-02-02-02",3,null,9,3,2,2,2,{"$f":"IF(LEN(E648)=1,0&E648,IF(LEN(E648)=0,\"00\",RIGHT(E648,2)))","v":"03"},{"$f":"IF(LEN(F648)=1,0&F648,IF(LEN(F648)=0,\"00\",RIGHT(F648,2)))","v":"02"},{"$f":"IF(LEN(G648)=1,0&G648,IF(LEN(G648)=0,\"00\",RIGHT(G648,2)))","v":"02"},{"$f":"IF(LEN(H648)=1,0&H648,IF(LEN(H648)=0,\"00\",RIGHT(H648,2)))","v":"02"}]
["03-02-03-01",3,null,9,3,2,3,1,"03","02","03","01"]
["03-02-04-00",3,null,9,3,2,4,0,"03","02","04","00"]
["03-03-00-03",3,null,9,3,3,0,3,"03","03","00","03"]
["03-03-01-02",3,null,9,3,3,1,2,"03","03","01","02"]
["03-03-02-01",3,null,9,3,3,2,1,"03","03","02","01"]
["03-03-03-00",3,null,9,3,3,3,0,"03","03","03","00"]
["03-04-00-02",3,null,9,3,4,0,2,"03","04","00","02"]
["03-04-01-01",2,null,9,3,4,1,1,"03","04","01","01"]
["03-04-02-00",2,null,9,3,4,2,0,"03","04","02","00"]
["03-05-00-01",2,null,9,3,5,0,1,"03","05","00","01"]
["03-05-01-00",2,null,9,3,5,1,0,"03","05","01","00"]
["03-06-00-00",2,null,9,3,6,0,0,"03","06","00","00"]
["04-00-00-05",4,null,9,4,0,0,5,"04","00","00","05"]
["04-00-01-04",4,null,9,4,0,1,4,"04","00","01","04"]
["04-00-02-03",4,null,9,4,0,2,3,"04","00","02","03"]
["04-00-03-02",4,null,9,4,0,3,2,"04","00","03","02"]
["04-00-04-01",3,null,9,4,0,4,1,"04","00","04","01"]
["04-00-05-00",3,null,9,4,0,5,0,"04","00","05","00"]
["04-01-00-04",3,null,9,4,1,0,4,"04","01","00","04"]
["04-01-01-03",3,null,9,4,1,1,3,"04","01","01","03"]
["04-01-02-02",3,null,9,4,1,2,2,"04","01","02","02"]
["04-01-03-01",3,null,9,4,1,3,1,"04","01","03","01"]
["04-01-04-00",3,null,9,4,1,4,0,"04","01","04","00"]
["04-02-00-03",3,null,9,4,2,0,3,"04","02","00","03"]
["04-02-01-02",3,null,9,4,2,1,2,"04","02","01","02"]
["04-02-02-01",3,null,9,4,2,2,1,"04","02","02","01"]
["04-02-03-00",3,null,9,4,2,3,0,"04","02","03","00"]
["04-03-00-02",3,null,9,4,3,0,2,"04","03","00","02"]
["04-03-01-01",2,null,9,4,3,1,1,"04","03","01","01"]
["04-03-02-00",2,null,9,4,3,2,0,"04","03","02","00"]
["04-04-00-01",2,null,9,4,4,0,1,"04","04","00","01"]
["04-04-01-00",2,null,9,4,4,1,0,"04","04","01","00"]
["04-05-00-00",2,null,9,4,5,0,0,"04","05","00","00"]
["05-00-00-04",3,null,9,5,0,0,4,"05","00","00","04"]
["05-00-01-03",3,null,9,5,0,1,3,"05","00","01","03"]
["05-00-02-02",3,null,9,5,0,2,2,"05","00","02","02"]
["05-00-03-01",3,null,9,5,0,3,1,"05","00","03","01"]
["05-00-04-00",3,null,9,5,0,4,0,"05","00","04","00"]
["05-01-00-03",3,null,9,5,1,0,3,"05","01","00","03"]
["05-01-01-02",3,null,9,5,1,1,2,"05","01","01","02"]
["05-01-02-01",3,null,9,5,1,2,1,"05","01","02","01"]
["05-01-03-00",3,null,9,5,1,3,0,"05","01","03","00"]
["05-02-00-02",3,null,9,5,2,0,2,"05","02","00","02"]
["05-02-01-01",2,null,9,5,2,1,1,"05","02","01","01"]
["05-02-02-00",2,null,9,5,2,2,0,"05","02","02","00"]
["05-03-00-01",2,null,9,5,3,0,1,"05","03","00","01"]
["05-03-01-00",2,null,9,5,3,1,0,"05","03","01","00"]
["05-04-00-00",2,null,9,5,4,0,0,"05","04","00","00"]
["06-00-00-03",3,null,9,6,0,0,3,"06","00","00","03"]
["06-00-01-02",3,null,9,6,0,1,2,"06","00","01","02"]
["06-00-02-01",3,null,9,6,0,2,1,"06","00","02","01"]
["06-00-03-00",3,null,9,6,0,3,0,"06","00","03","00"]
["06-01-00-02",3,null,9,6,1,0,2,"06","01","00","02"]
["06-01-01-01",2,null,9,6,1,1,1,"06","01","01","01"]
["06-01-02-00",2,null,9,6,1,2,0,"06","01","02","00"]
["06-02-00-01",2,null,9,6,2,0,1,"06","02","00","01"]
["06-02-01-00",2,null,9,6,2,1,0,"06","02","01","00"]
["06-03-00-00",2,null,9,6,3,0,0,"06","03","00","00"]
["07-00-00-02",3,null,9,7,0,0,2,"07","00","00","02"]
["07-00-01-01",2,null,9,7,0,1,1,"07","00","01","01"]
["07-00-02-00",2,null,9,7,0,2,0,"07","00","02","00"]
["07-01-00-01",2,null,9,7,1,0,1,"07","01","00","01"]
[{"$f":"I711&\"-\"&J711&\"-\"&K711&\"-\"&L711","v":"07-01-01-00"},2,null,9,7,1,1,0,"07","01","01","00"]
["07-02-00-00",2,null,9,7,2,0,0,{"$f":"IF(LEN(E712)=1,0&E712,IF(LEN(E712)=0,\"00\",RIGHT(E712,2)))","v":"07"},{"$f":"IF(LEN(F712)=1,0&F712,IF(LEN(F712)=0,\"00\",RIGHT(F712,2)))","v":"02"},{"$f":"IF(LEN(G712)=1,0&G712,IF(LEN(G712)=0,\"00\",RIGHT(G712,2)))","v":"00"},{"$f":"IF(LEN(H712)=1,0&H712,IF(LEN(H712)=0,\"00\",RIGHT(H712,2)))","v":"00"}]
["08-00-00-01",2,null,9,8,0,0,1,"08","00","00","01"]
["08-00-01-00",2,null,9,8,0,1,0,"08","00","01","00"]
["08-01-00-00",2,null,9,8,1,0,0,"08","01","00","00"]
["09-00-00-00",1,null,9,9,0,0,0,"09","00","00","00"]
["00-00-00-10",7,null,10,0,0,0,10,"00","00","00","10"]
["00-00-01-09",6,null,10,0,0,1,9,"00","00","01","09"]
["00-00-02-08",6,null,10,0,0,2,8,"00","00","02","08"]
["00-00-03-07",6,null,10,0,0,3,7,"00","00","03","07"]
["00-00-04-06",6,null,10,0,0,4,6,"00","00","04","06"]
["00-00-05-05",6,null,10,0,0,5,5,"00","00","05","05"]
["00-00-06-04",5,null,10,0,0,6,4,"00","00","06","04"]
["00-00-07-03",5,null,10,0,0,7,3,"00","00","07","03"]
["00-00-08-02",5,null,10,0,0,8,2,"00","00","08","02"]
["00-00-09-01",4,null,10,0,0,9,1,"00","00","09","01"]
["00-00-10-00",4,null,10,0,0,10,0,"00","00","10","00"]
["00-01-00-09",5,null,10,0,1,0,9,"00","01","00","09"]
["00-01-01-08",5,null,10,0,1,1,8,"00","01","01","08"]
["00-01-02-07",5,null,10,0,1,2,7,"00","01","02","07"]
["00-01-03-06",5,null,10,0,1,3,6,"00","01","03","06"]
["00-01-04-05",5,null,10,0,1,4,5,"00","01","04","05"]
["00-01-05-04",5,null,10,0,1,5,4,"00","01","05","04"]
["00-01-06-03",5,null,10,0,1,6,3,"00","01","06","03"]
["00-01-07-02",5,null,10,0,1,7,2,"00","01","07","02"]
["00-01-08-01",4,null,10,0,1,8,1,"00","01","08","01"]
["00-01-09-00",4,null,10,0,1,9,0,"00","01","09","00"]
["00-02-00-08",5,null,10,0,2,0,8,"00","02","00","08"]
["00-02-01-07",5,null,10,0,2,1,7,"00","02","01","07"]
["00-02-02-06",5,null,10,0,2,2,6,"00","02","02","06"]
["00-02-03-05",5,null,10,0,2,3,5,"00","02","03","05"]
["00-02-04-04",5,null,10,0,2,4,4,"00","02","04","04"]
["00-02-05-03",5,null,10,0,2,5,3,"00","02","05","03"]
["00-02-06-02",5,null,10,0,2,6,2,"00","02","06","02"]
["00-02-07-01",4,null,10,0,2,7,1,"00","02","07","01"]
["00-02-08-00",4,null,10,0,2,8,0,"00","02","08","00"]
["00-03-00-07",5,null,10,0,3,0,7,"00","03","00","07"]
["00-03-01-06",5,null,10,0,3,1,6,"00","03","01","06"]
["00-03-02-05",5,null,10,0,3,2,5,"00","03","02","05"]
["00-03-03-04",5,null,10,0,3,3,4,"00","03","03","04"]
["00-03-04-03",5,null,10,0,3,4,3,"00","03","04","03"]
["00-03-05-02",4,null,10,0,3,5,2,"00","03","05","02"]
["00-03-06-01",4,null,10,0,3,6,1,"00","03","06","01"]
["00-03-07-00",4,null,10,0,3,7,0,"00","03","07","00"]
["00-04-00-06",5,null,10,0,4,0,6,"00","04","00","06"]
["00-04-01-05",5,null,10,0,4,1,5,"00","04","01","05"]
["00-04-02-04",5,null,10,0,4,2,4,"00","04","02","04"]
["00-04-03-03",4,null,10,0,4,3,3,"00","04","03","03"]
["00-04-04-02",4,null,10,0,4,4,2,"00","04","04","02"]
["00-04-05-01",4,null,10,0,4,5,1,"00","04","05","01"]
["00-04-06-00",4,null,10,0,4,6,0,"00","04","06","00"]
["00-05-00-05",4,null,10,0,5,0,5,"00","05","00","05"]
["00-05-01-04",4,null,10,0,5,1,4,"00","05","01","04"]
["00-05-02-03",4,null,10,0,5,2,3,"00","05","02","03"]
["00-05-03-02",4,null,10,0,5,3,2,"00","05","03","02"]
["00-05-04-01",4,null,10,0,5,4,1,"00","05","04","01"]
["00-05-05-00",4,null,10,0,5,5,0,"00","05","05","00"]
["00-06-00-04",3,null,10,0,6,0,4,"00","06","00","04"]
["00-06-01-03",3,null,10,0,6,1,3,"00","06","01","03"]
["00-06-02-02",3,null,10,0,6,2,2,"00","06","02","02"]
["00-06-03-01",3,null,10,0,6,3,1,"00","06","03","01"]
["00-06-04-00",3,null,10,0,6,4,0,"00","06","04","00"]
["00-07-00-03",3,null,10,0,7,0,3,"00","07","00","03"]
["00-07-01-02",3,null,10,0,7,1,2,"00","07","01","02"]
[{"$f":"I775&\"-\"&J775&\"-\"&K775&\"-\"&L775","v":"00-07-02-01"},3,null,10,0,7,2,1,"00","07","02","01"]
["00-07-03-00",3,null,10,0,7,3,0,{"$f":"IF(LEN(E776)=1,0&E776,IF(LEN(E776)=0,\"00\",RIGHT(E776,2)))","v":"00"},{"$f":"IF(LEN(F776)=1,0&F776,IF(LEN(F776)=0,\"00\",RIGHT(F776,2)))","v":"07"},{"$f":"IF(LEN(G776)=1,0&G776,IF(LEN(G776)=0,\"00\",RIGHT(G776,2)))","v":"03"},{"$f":"IF(LEN(H776)=1,0&H776,IF(LEN(H776)=0,\"00\",RIGHT(H776,2)))","v":"00"}]
["00-08-00-02",3,null,10,0,8,0,2,"00","08","00","02"]
["00-08-01-01",3,null,10,0,8,1,1,"00","08","01","01"]
["00-08-02-00",3,null,10,0,8,2,0,"00","08","02","00"]
["00-09-00-01",2,null,10,0,9,0,1,"00","09","00","01"]
["00-09-01-00",2,null,10,0,9,1,0,"00","09","01","00"]
["00-10-00-00",2,null,10,0,10,0,0,"00","10","00","00"]
["01-00-00-09",5,null,10,1,0,0,9,"01","00","00","09"]
["01-00-01-08",5,null,10,1,0,1,8,"01","00","01","08"]
["01-00-02-07",5,null,10,1,0,2,7,"01","00","02","07"]
["01-00-03-06",5,null,10,1,0,3,6,"01","00","03","06"]
["01-00-04-05",5,null,10,1,0,4,5,"01","00","04","05"]
["01-00-05-04",5,null,10,1,0,5,4,"01","00","05","04"]
["01-00-06-03",5,null,10,1,0,6,3,"01","00","06","03"]
["01-00-07-02",5,null,10,1,0,7,2,"01","00","07","02"]
["01-00-08-01",4,null,10,1,0,8,1,"01","00","08","01"]
["01-00-09-00",4,null,10,1,0,9,0,"01","00","09","00"]
["01-01-00-08",5,null,10,1,1,0,8,"01","01","00","08"]
["01-01-01-07",5,null,10,1,1,1,7,"01","01","01","07"]
["01-01-02-06",5,null,10,1,1,2,6,"01","01","02","06"]
["01-01-03-05",5,null,10,1,1,3,5,"01","01","03","05"]
["01-01-04-04",5,null,10,1,1,4,4,"01","01","04","04"]
["01-01-05-03",5,null,10,1,1,5,3,"01","01","05","03"]
["01-01-06-02",4,null,10,1,1,6,2,"01","01","06","02"]
["01-01-07-01",4,null,10,1,1,7,1,"01","01","07","01"]
["01-01-08-00",4,null,10,1,1,8,0,"01","01","08","00"]
["01-02-00-07",5,null,10,1,2,0,7,"01","02","00","07"]
["01-02-01-06",5,null,10,1,2,1,6,"01","02","01","06"]
["01-02-02-05",5,null,10,1,2,2,5,"01","02","02","05"]
["01-02-03-04",5,null,10,1,2,3,4,"01","02","03","04"]
["01-02-04-03",4,null,10,1,2,4,3,"01","02","04","03"]
["01-02-05-02",4,null,10,1,2,5,2,"01","02","05","02"]
["01-02-06-01",4,null,10,1,2,6,1,"01","02","06","01"]
["01-02-07-00",4,null,10,1,2,7,0,"01","02","07","00"]
["01-03-00-06",5,null,10,1,3,0,6,"01","03","00","06"]
["01-03-01-05",4,null,10,1,3,1,5,"01","03","01","05"]
["01-03-02-04",4,null,10,1,3,2,4,"01","03","02","04"]
["01-03-03-03",4,null,10,1,3,3,3,"01","03","03","03"]
["01-03-04-02",4,null,10,1,3,4,2,"01","03","04","02"]
["01-03-05-01",4,null,10,1,3,5,1,"01","03","05","01"]
["01-03-06-00",4,null,10,1,3,6,0,"01","03","06","00"]
["01-04-00-05",4,null,10,1,4,0,5,"01","04","00","05"]
["01-04-01-04",4,null,10,1,4,1,4,"01","04","01","04"]
["01-04-02-03",4,null,10,1,4,2,3,"01","04","02","03"]
["01-04-03-02",4,null,10,1,4,3,2,"01","04","03","02"]
["01-04-04-01",4,null,10,1,4,4,1,"01","04","04","01"]
["01-04-05-00",4,null,10,1,4,5,0,"01","04","05","00"]
["01-05-00-04",3,null,10,1,5,0,4,"01","05","00","04"]
["01-05-01-03",3,null,10,1,5,1,3,"01","05","01","03"]
["01-05-02-02",3,null,10,1,5,2,2,"01","05","02","02"]
["01-05-03-01",3,null,10,1,5,3,1,"01","05","03","01"]
["01-05-04-00",3,null,10,1,5,4,0,"01","05","04","00"]
["01-06-00-03",3,null,10,1,6,0,3,"01","06","00","03"]
["01-06-01-02",3,null,10,1,6,1,2,"01","06","01","02"]
["01-06-02-01",3,null,10,1,6,2,1,"01","06","02","01"]
["01-06-03-00",3,null,10,1,6,3,0,"01","06","03","00"]
["01-07-00-02",3,null,10,1,7,0,2,"01","07","00","02"]
["01-07-01-01",2,null,10,1,7,1,1,"01","07","01","01"]
["01-07-02-00",2,null,10,1,7,2,0,"01","07","02","00"]
["01-08-00-01",2,null,10,1,8,0,1,"01","08","00","01"]
["01-08-01-00",2,null,10,1,8,1,0,"01","08","01","00"]
["01-09-00-00",2,null,10,1,9,0,0,"01","09","00","00"]
["02-00-00-08",5,null,10,2,0,0,8,"02","00","00","08"]
[{"$f":"I839&\"-\"&J839&\"-\"&K839&\"-\"&L839","v":"02-00-01-07"},5,null,10,2,0,1,7,"02","00","01","07"]
["02-00-02-06",5,null,10,2,0,2,6,{"$f":"IF(LEN(E840)=1,0&E840,IF(LEN(E840)=0,\"00\",RIGHT(E840,2)))","v":"02"},{"$f":"IF(LEN(F840)=1,0&F840,IF(LEN(F840)=0,\"00\",RIGHT(F840,2)))","v":"00"},{"$f":"IF(LEN(G840)=1,0&G840,IF(LEN(G840)=0,\"00\",RIGHT(G840,2)))","v":"02"},{"$f":"IF(LEN(H840)=1,0&H840,IF(LEN(H840)=0,\"00\",RIGHT(H840,2)))","v":"06"}]
["02-00-03-05",5,null,10,2,0,3,5,"02","00","03","05"]
["02-00-04-04",5,null,10,2,0,4,4,"02","00","04","04"]
["02-00-05-03",4,null,10,2,0,5,3,"02","00","05","03"]
["02-00-06-02",4,null,10,2,0,6,2,"02","00","06","02"]
["02-00-07-01",4,null,10,2,0,7,1,"02","00","07","01"]
["02-00-08-00",4,null,10,2,0,8,0,"02","00","08","00"]
["02-01-00-07",5,null,10,2,1,0,7,"02","01","00","07"]
["02-01-01-06",5,null,10,2,1,1,6,"02","01","01","06"]
["02-01-02-05",4,null,10,2,1,2,5,"02","01","02","05"]
["02-01-03-04",4,null,10,2,1,3,4,"02","01","03","04"]
["02-01-04-03",4,null,10,2,1,4,3,"02","01","04","03"]
["02-01-05-02",4,null,10,2,1,5,2,"02","01","05","02"]
["02-01-06-01",4,null,10,2,1,6,1,"02","01","06","01"]
["02-01-07-00",4,null,10,2,1,7,0,"02","01","07","00"]
["02-02-00-06",4,null,10,2,2,0,6,"02","02","00","06"]
["02-02-01-05",4,null,10,2,2,1,5,"02","02","01","05"]
["02-02-02-04",4,null,10,2,2,2,4,"02","02","02","04"]
["02-02-03-03",4,null,10,2,2,3,3,"02","02","03","03"]
["02-02-04-02",4,null,10,2,2,4,2,"02","02","04","02"]
["02-02-05-01",4,null,10,2,2,5,1,"02","02","05","01"]
["02-02-06-00",4,null,10,2,2,6,0,"02","02","06","00"]
["02-03-00-05",4,null,10,2,3,0,5,"02","03","00","05"]
["02-03-01-04",4,null,10,2,3,1,4,"02","03","01","04"]
["02-03-02-03",4,null,10,2,3,2,3,"02","03","02","03"]
["02-03-03-02",4,null,10,2,3,3,2,"02","03","03","02"]
["02-03-04-01",4,null,10,2,3,4,1,"02","03","04","01"]
["02-03-05-00",4,null,10,2,3,5,0,"02","03","05","00"]
["02-04-00-04",3,null,10,2,4,0,4,"02","04","00","04"]
["02-04-01-03",3,null,10,2,4,1,3,"02","04","01","03"]
["02-04-02-02",3,null,10,2,4,2,2,"02","04","02","02"]
["02-04-03-01",3,null,10,2,4,3,1,"02","04","03","01"]
["02-04-04-00",3,null,10,2,4,4,0,"02","04","04","00"]
["02-05-00-03",3,null,10,2,5,0,3,"02","05","00","03"]
["02-05-01-02",3,null,10,2,5,1,2,"02","05","01","02"]
["02-05-02-01",3,null,10,2,5,2,1,"02","05","02","01"]
["02-05-03-00",3,null,10,2,5,3,0,"02","05","03","00"]
["02-06-00-02",3,null,10,2,6,0,2,"02","06","00","02"]
["02-06-01-01",2,null,10,2,6,1,1,"02","06","01","01"]
["02-06-02-00",2,null,10,2,6,2,0,"02","06","02","00"]
["02-07-00-01",2,null,10,2,7,0,1,"02","07","00","01"]
["02-07-01-00",2,null,10,2,7,1,0,"02","07","01","00"]
["02-08-00-00",2,null,10,2,8,0,0,"02","08","00","00"]
["03-00-00-07",5,null,10,3,0,0,7,"03","00","00","07"]
["03-00-01-06",4,null,10,3,0,1,6,"03","00","01","06"]
["03-00-02-05",4,null,10,3,0,2,5,"03","00","02","05"]
["03-00-03-04",4,null,10,3,0,3,4,"03","00","03","04"]
["03-00-04-03",4,null,10,3,0,4,3,"03","00","04","03"]
["03-00-05-02",4,null,10,3,0,5,2,"03","00","05","02"]
["03-00-06-01",4,null,10,3,0,6,1,"03","00","06","01"]
["03-00-07-00",4,null,10,3,0,7,0,"03","00","07","00"]
["03-01-00-06",4,null,10,3,1,0,6,"03","01","00","06"]
["03-01-01-05",4,null,10,3,1,1,5,"03","01","01","05"]
["03-01-02-04",4,null,10,3,1,2,4,"03","01","02","04"]
["03-01-03-03",4,null,10,3,1,3,3,"03","01","03","03"]
["03-01-04-02",4,null,10,3,1,4,2,"03","01","04","02"]
["03-01-05-01",4,null,10,3,1,5,1,"03","01","05","01"]
["03-01-06-00",4,null,10,3,1,6,0,"03","01","06","00"]
["03-02-00-05",4,null,10,3,2,0,5,"03","02","00","05"]
["03-02-01-04",4,null,10,3,2,1,4,"03","02","01","04"]
["03-02-02-03",4,null,10,3,2,2,3,"03","02","02","03"]
["03-02-03-02",4,null,10,3,2,3,2,"03","02","03","02"]
["03-02-04-01",4,null,10,3,2,4,1,"03","02","04","01"]
[{"$f":"I903&\"-\"&J903&\"-\"&K903&\"-\"&L903","v":"03-02-05-00"},4,null,10,3,2,5,0,"03","02","05","00"]
["03-03-00-04",3,null,10,3,3,0,4,{"$f":"IF(LEN(E904)=1,0&E904,IF(LEN(E904)=0,\"00\",RIGHT(E904,2)))","v":"03"},{"$f":"IF(LEN(F904)=1,0&F904,IF(LEN(F904)=0,\"00\",RIGHT(F904,2)))","v":"03"},{"$f":"IF(LEN(G904)=1,0&G904,IF(LEN(G904)=0,\"00\",RIGHT(G904,2)))","v":"00"},{"$f":"IF(LEN(H904)=1,0&H904,IF(LEN(H904)=0,\"00\",RIGHT(H904,2)))","v":"04"}]
["03-03-01-03",3,null,10,3,3,1,3,"03","03","01","03"]
["03-03-02-02",3,null,10,3,3,2,2,"03","03","02","02"]
["03-03-03-01",3,null,10,3,3,3,1,"03","03","03","01"]
["03-03-04-00",3,null,10,3,3,4,0,"03","03","04","00"]
["03-04-00-03",3,null,10,3,4,0,3,"03","04","00","03"]
["03-04-01-02",3,null,10,3,4,1,2,"03","04","01","02"]
["03-04-02-01",3,null,10,3,4,2,1,"03","04","02","01"]
["03-04-03-00",3,null,10,3,4,3,0,"03","04","03","00"]
["03-05-00-02",3,null,10,3,5,0,2,"03","05","00","02"]
["03-05-01-01",2,null,10,3,5,1,1,"03","05","01","01"]
["03-05-02-00",2,null,10,3,5,2,0,"03","05","02","00"]
["03-06-00-01",2,null,10,3,6,0,1,"03","06","00","01"]
["03-06-01-00",2,null,10,3,6,1,0,"03","06","01","00"]
["03-07-00-00",2,null,10,3,7,0,0,"03","07","00","00"]
["04-00-00-06",4,null,10,4,0,0,6,"04","00","00","06"]
["04-00-01-05",4,null,10,4,0,1,5,"04","00","01","05"]
["04-00-02-04",4,null,10,4,0,2,4,"04","00","02","04"]
["04-00-03-03",4,null,10,4,0,3,3,"04","00","03","03"]
["04-00-04-02",4,null,10,4,0,4,2,"04","00","04","02"]
["04-00-05-01",4,null,10,4,0,5,1,"04","00","05","01"]
["04-00-06-00",4,null,10,4,0,6,0,"04","00","06","00"]
["04-01-00-05",4,null,10,4,1,0,5,"04","01","00","05"]
["04-01-01-04",4,null,10,4,1,1,4,"04","01","01","04"]
["04-01-02-03",4,null,10,4,1,2,3,"04","01","02","03"]
["04-01-03-02",4,null,10,4,1,3,2,"04","01","03","02"]
["04-01-04-01",3,null,10,4,1,4,1,"04","01","04","01"]
["04-01-05-00",3,null,10,4,1,5,0,"04","01","05","00"]
["04-02-00-04",3,null,10,4,2,0,4,"04","02","00","04"]
["04-02-01-03",3,null,10,4,2,1,3,"04","02","01","03"]
["04-02-02-02",3,null,10,4,2,2,2,"04","02","02","02"]
["04-02-03-01",3,null,10,4,2,3,1,"04","02","03","01"]
["04-02-04-00",3,null,10,4,2,4,0,"04","02","04","00"]
["04-03-00-03",3,null,10,4,3,0,3,"04","03","00","03"]
["04-03-01-02",3,null,10,4,3,1,2,"04","03","01","02"]
["04-03-02-01",3,null,10,4,3,2,1,"04","03","02","01"]
["04-03-03-00",3,null,10,4,3,3,0,"04","03","03","00"]
["04-04-00-02",3,null,10,4,4,0,2,"04","04","00","02"]
["04-04-01-01",2,null,10,4,4,1,1,"04","04","01","01"]
["04-04-02-00",2,null,10,4,4,2,0,"04","04","02","00"]
["04-05-00-01",2,null,10,4,5,0,1,"04","05","00","01"]
["04-05-01-00",2,null,10,4,5,1,0,"04","05","01","00"]
["04-06-00-00",2,null,10,4,6,0,0,"04","06","00","00"]
["05-00-00-05",4,null,10,5,0,0,5,"05","00","00","05"]
["05-00-01-04",4,null,10,5,0,1,4,"05","00","01","04"]
["05-00-02-03",4,null,10,5,0,2,3,"05","00","02","03"]
["05-00-03-02",3,null,10,5,0,3,2,"05","00","03","02"]
["05-00-04-01",3,null,10,5,0,4,1,"05","00","04","01"]
["05-00-05-00",3,null,10,5,0,5,0,"05","00","05","00"]
["05-01-00-04",3,null,10,5,1,0,4,"05","01","00","04"]
["05-01-01-03",3,null,10,5,1,1,3,"05","01","01","03"]
["05-01-02-02",3,null,10,5,1,2,2,"05","01","02","02"]
["05-01-03-01",3,null,10,5,1,3,1,"05","01","03","01"]
["05-01-04-00",3,null,10,5,1,4,0,"05","01","04","00"]
["05-02-00-03",3,null,10,5,2,0,3,"05","02","00","03"]
["05-02-01-02",3,null,10,5,2,1,2,"05","02","01","02"]
["05-02-02-01",3,null,10,5,2,2,1,"05","02","02","01"]
["05-02-03-00",3,null,10,5,2,3,0,"05","02","03","00"]
["05-03-00-02",3,null,10,5,3,0,2,"05","03","00","02"]
["05-03-01-01",2,null,10,5,3,1,1,"05","03","01","01"]
["05-03-02-00",2,null,10,5,3,2,0,"05","03","02","00"]
["05-04-00-01",2,null,10,5,4,0,1,"05","04","00","01"]
["05-04-01-00",2,null,10,5,4,1,0,"05","04","01","00"]
[{"$f":"I967&\"-\"&J967&\"-\"&K967&\"-\"&L967","v":"05-05-00-00"},2,null,10,5,5,0,0,"05","05","00","00"]
["06-00-00-04",3,null,10,6,0,0,4,{"$f":"IF(LEN(E968)=1,0&E968,IF(LEN(E968)=0,\"00\",RIGHT(E968,2)))","v":"06"},{"$f":"IF(LEN(F968)=1,0&F968,IF(LEN(F968)=0,\"00\",RIGHT(F968,2)))","v":"00"},{"$f":"IF(LEN(G968)=1,0&G968,IF(LEN(G968)=0,\"00\",RIGHT(G968,2)))","v":"00"},{"$f":"IF(LEN(H968)=1,0&H968,IF(LEN(H968)=0,\"00\",RIGHT(H968,2)))","v":"04"}]
["06-00-01-03",3,null,10,6,0,1,3,"06","00","01","03"]
["06-00-02-02",3,null,10,6,0,2,2,"06","00","02","02"]
["06-00-03-01",3,null,10,6,0,3,1,"06","00","03","01"]
["06-00-04-00",3,null,10,6,0,4,0,"06","00","04","00"]
["06-01-00-03",3,null,10,6,1,0,3,"06","01","00","03"]
["06-01-01-02",3,null,10,6,1,1,2,"06","01","01","02"]
["06-01-02-01",3,null,10,6,1,2,1,"06","01","02","01"]
["06-01-03-00",3,null,10,6,1,3,0,"06","01","03","00"]
["06-02-00-02",3,null,10,6,2,0,2,"06","02","00","02"]
["06-02-01-01",2,null,10,6,2,1,1,"06","02","01","01"]
["06-02-02-00",2,null,10,6,2,2,0,"06","02","02","00"]
["06-03-00-01",2,null,10,6,3,0,1,"06","03","00","01"]
["06-03-01-00",2,null,10,6,3,1,0,"06","03","01","00"]
["06-04-00-00",2,null,10,6,4,0,0,"06","04","00","00"]
["07-00-00-03",3,null,10,7,0,0,3,"07","00","00","03"]
["07-00-01-02",3,null,10,7,0,1,2,"07","00","01","02"]
["07-00-02-01",3,null,10,7,0,2,1,"07","00","02","01"]
["07-00-03-00",3,null,10,7,0,3,0,"07","00","03","00"]
["07-01-00-02",3,null,10,7,1,0,2,"07","01","00","02"]
["07-01-01-01",2,null,10,7,1,1,1,"07","01","01","01"]
["07-01-02-00",2,null,10,7,1,2,0,"07","01","02","00"]
["07-02-00-01",2,null,10,7,2,0,1,"07","02","00","01"]
["07-02-01-00",2,null,10,7,2,1,0,"07","02","01","00"]
["07-03-00-00",2,null,10,7,3,0,0,"07","03","00","00"]
["08-00-00-02",3,null,10,8,0,0,2,"08","00","00","02"]
["08-00-01-01",2,null,10,8,0,1,1,"08","00","01","01"]
["08-00-02-00",2,null,10,8,0,2,0,"08","00","02","00"]
["08-01-00-01",2,null,10,8,1,0,1,"08","01","00","01"]
["08-01-01-00",2,null,10,8,1,1,0,"08","01","01","00"]
["08-02-00-00",2,null,10,8,2,0,0,"08","02","00","00"]
["09-00-00-01",2,null,10,9,0,0,1,"09","00","00","01"]
["09-00-01-00",2,null,10,9,0,1,0,"09","00","01","00"]
["09-01-00-00",2,null,10,9,1,0,0,"09","01","00","00"]
["10-00-00-00",1,null,10,10,0,0,0,"10","00","00","00"]
["00-00-00-11",7,null,11,0,0,0,11,"00","00","00","11"]
["00-00-01-10",6,null,11,0,0,1,10,"00","00","01","10"]
["00-00-02-09",6,null,11,0,0,2,9,"00","00","02","09"]
["00-00-03-08",6,null,11,0,0,3,8,"00","00","03","08"]
["00-00-04-07",6,null,11,0,0,4,7,"00","00","04","07"]
["00-00-05-06",6,null,11,0,0,5,6,"00","00","05","06"]
["00-00-06-05",5,null,11,0,0,6,5,"00","00","06","05"]
["00-00-07-04",5,null,11,0,0,7,4,"00","00","07","04"]
["00-00-08-03",5,null,11,0,0,8,3,"00","00","08","03"]
["00-00-09-02",4,null,11,0,0,9,2,"00","00","09","02"]
["00-00-10-01",4,null,11,0,0,10,1,"00","00","10","01"]
["00-00-11-00",4,null,11,0,0,11,0,"00","00","11","00"]
["00-01-00-10",5,null,11,0,1,0,10,"00","01","00","10"]
["00-01-01-09",5,null,11,0,1,1,9,"00","01","01","09"]
["00-01-02-08",5,null,11,0,1,2,8,"00","01","02","08"]
["00-01-03-07",5,null,11,0,1,3,7,"00","01","03","07"]
["00-01-04-06",5,null,11,0,1,4,6,"00","01","04","06"]
["00-01-05-05",5,null,11,0,1,5,5,"00","01","05","05"]
["00-01-06-04",5,null,11,0,1,6,4,"00","01","06","04"]
["00-01-07-03",5,null,11,0,1,7,3,"00","01","07","03"]
["00-01-08-02",4,null,11,0,1,8,2,"00","01","08","02"]
["00-01-09-01",4,null,11,0,1,9,1,"00","01","09","01"]
["00-01-10-00",4,null,11,0,1,10,0,"00","01","10","00"]
["00-02-00-09",5,null,11,0,2,0,9,"00","02","00","09"]
["00-02-01-08",5,null,11,0,2,1,8,"00","02","01","08"]
["00-02-02-07",5,null,11,0,2,2,7,"00","02","02","07"]
["00-02-03-06",5,null,11,0,2,3,6,"00","02","03","06"]
["00-02-04-05",5,null,11,0,2,4,5,"00","02","04","05"]
[{"$f":"I1031&\"-\"&J1031&\"-\"&K1031&\"-\"&L1031","v":"00-02-05-04"},5,null,11,0,2,5,4,"00","02","05","04"]
["00-02-06-03",5,null,11,0,2,6,3,{"$f":"IF(LEN(E1032)=1,0&E1032,IF(LEN(E1032)=0,\"00\",RIGHT(E1032,2)))","v":"00"},{"$f":"IF(LEN(F1032)=1,0&F1032,IF(LEN(F1032)=0,\"00\",RIGHT(F1032,2)))","v":"02"},{"$f":"IF(LEN(G1032)=1,0&G1032,IF(LEN(G1032)=0,\"00\",RIGHT(G1032,2)))","v":"06"},{"$f":"IF(LEN(H1032)=1,0&H1032,IF(LEN(H1032)=0,\"00\",RIGHT(H1032,2)))","v":"03"}]
["00-02-07-02",4,null,11,0,2,7,2,"00","02","07","02"]
["00-02-08-01",4,null,11,0,2,8,1,"00","02","08","01"]
["00-02-09-00",4,null,11,0,2,9,0,"00","02","09","00"]
["00-03-00-08",5,null,11,0,3,0,8,"00","03","00","08"]
["00-03-01-07",5,null,11,0,3,1,7,"00","03","01","07"]
["00-03-02-06",5,null,11,0,3,2,6,"00","03","02","06"]
["00-03-03-05",5,null,11,0,3,3,5,"00","03","03","05"]
["00-03-04-04",5,null,11,0,3,4,4,"00","03","04","04"]
["00-03-05-03",5,null,11,0,3,5,3,"00","03","05","03"]
["00-03-06-02",4,null,11,0,3,6,2,"00","03","06","02"]
["00-03-07-01",4,null,11,0,3,7,1,"00","03","07","01"]
["00-03-08-00",4,null,11,0,3,8,0,"00","03","08","00"]
["00-04-00-07",5,null,11,0,4,0,7,"00","04","00","07"]
["00-04-01-06",5,null,11,0,4,1,6,"00","04","01","06"]
["00-04-02-05",5,null,11,0,4,2,5,"00","04","02","05"]
["00-04-03-04",5,null,11,0,4,3,4,"00","04","03","04"]
["00-04-04-03",4,null,11,0,4,4,3,"00","04","04","03"]
["00-04-05-02",4,null,11,0,4,5,2,"00","04","05","02"]
["00-04-06-01",4,null,11,0,4,6,1,"00","04","06","01"]
["00-04-07-00",4,null,11,0,4,7,0,"00","04","07","00"]
["00-05-00-06",5,null,11,0,5,0,6,"00","05","00","06"]
["00-05-01-05",4,null,11,0,5,1,5,"00","05","01","05"]
["00-05-02-04",4,null,11,0,5,2,4,"00","05","02","04"]
["00-05-03-03",4,null,11,0,5,3,3,"00","05","03","03"]
["00-05-04-02",4,null,11,0,5,4,2,"00","05","04","02"]
["00-05-05-01",4,null,11,0,5,5,1,"00","05","05","01"]
["00-05-06-00",4,null,11,0,5,6,0,"00","05","06","00"]
["00-06-00-05",3,null,11,0,6,0,5,"00","06","00","05"]
["00-06-01-04",3,null,11,0,6,1,4,"00","06","01","04"]
["00-06-02-03",3,null,11,0,6,2,3,"00","06","02","03"]
["00-06-03-02",3,null,11,0,6,3,2,"00","06","03","02"]
["00-06-04-01",3,null,11,0,6,4,1,"00","06","04","01"]
["00-06-05-00",3,null,11,0,6,5,0,"00","06","05","00"]
["00-07-00-04",3,null,11,0,7,0,4,"00","07","00","04"]
["00-07-01-03",3,null,11,0,7,1,3,"00","07","01","03"]
["00-07-02-02",3,null,11,0,7,2,2,"00","07","02","02"]
["00-07-03-01",3,null,11,0,7,3,1,"00","07","03","01"]
["00-07-04-00",3,null,11,0,7,4,0,"00","07","04","00"]
["00-08-00-03",3,null,11,0,8,0,3,"00","08","00","03"]
["00-08-01-02",3,null,11,0,8,1,2,"00","08","01","02"]
["00-08-02-01",3,null,11,0,8,2,1,"00","08","02","01"]
["00-08-03-00",3,null,11,0,8,3,0,"00","08","03","00"]
["00-09-00-02",3,null,11,0,9,0,2,"00","09","00","02"]
["00-09-01-01",3,null,11,0,9,1,1,"00","09","01","01"]
["00-09-02-00",2,null,11,0,9,2,0,"00","09","02","00"]
["00-10-00-01",2,null,11,0,10,0,1,"00","10","00","01"]
["00-10-01-00",2,null,11,0,10,1,0,"00","10","01","00"]
["00-11-00-00",2,null,11,0,11,0,0,"00","11","00","00"]
["01-00-00-10",5,null,11,1,0,0,10,"01","00","00","10"]
["01-00-01-09",5,null,11,1,0,1,9,"01","00","01","09"]
["01-00-02-08",5,null,11,1,0,2,8,"01","00","02","08"]
["01-00-03-07",5,null,11,1,0,3,7,"01","00","03","07"]
["01-00-04-06",5,null,11,1,0,4,6,"01","00","04","06"]
["01-00-05-05",5,null,11,1,0,5,5,"01","00","05","05"]
["01-00-06-04",5,null,11,1,0,6,4,"01","00","06","04"]
["01-00-07-03",5,null,11,1,0,7,3,"01","00","07","03"]
["01-00-08-02",4,null,11,1,0,8,2,"01","00","08","02"]
["01-00-09-01",4,null,11,1,0,9,1,"01","00","09","01"]
["01-00-10-00",4,null,11,1,0,10,0,"01","00","10","00"]
["01-01-00-09",5,null,11,1,1,0,9,"01","01","00","09"]
["01-01-01-08",5,null,11,1,1,1,8,"01","01","01","08"]
["01-01-02-07",5,null,11,1,1,2,7,"01","01","02","07"]
[{"$f":"I1095&\"-\"&J1095&\"-\"&K1095&\"-\"&L1095","v":"01-01-03-06"},5,null,11,1,1,3,6,"01","01","03","06"]
["01-01-04-05",5,null,11,1,1,4,5,{"$f":"IF(LEN(E1096)=1,0&E1096,IF(LEN(E1096)=0,\"00\",RIGHT(E1096,2)))","v":"01"},{"$f":"IF(LEN(F1096)=1,0&F1096,IF(LEN(F1096)=0,\"00\",RIGHT(F1096,2)))","v":"01"},{"$f":"IF(LEN(G1096)=1,0&G1096,IF(LEN(G1096)=0,\"00\",RIGHT(G1096,2)))","v":"04"},{"$f":"IF(LEN(H1096)=1,0&H1096,IF(LEN(H1096)=0,\"00\",RIGHT(H1096,2)))","v":"05"}]
["01-01-05-04",5,null,11,1,1,5,4,"01","01","05","04"]
["01-01-06-03",5,null,11,1,1,6,3,"01","01","06","03"]
["01-01-07-02",4,null,11,1,1,7,2,"01","01","07","02"]
["01-01-08-01",4,null,11,1,1,8,1,"01","01","08","01"]
["01-01-09-00",4,null,11,1,1,9,0,"01","01","09","00"]
["01-02-00-08",5,null,11,1,2,0,8,"01","02","00","08"]
["01-02-01-07",5,null,11,1,2,1,7,"01","02","01","07"]
["01-02-02-06",5,null,11,1,2,2,6,"01","02","02","06"]
["01-02-03-05",5,null,11,1,2,3,5,"01","02","03","05"]
["01-02-04-04",5,null,11,1,2,4,4,"01","02","04","04"]
["01-02-05-03",4,null,11,1,2,5,3,"01","02","05","03"]
["01-02-06-02",4,null,11,1,2,6,2,"01","02","06","02"]
["01-02-07-01",4,null,11,1,2,7,1,"01","02","07","01"]
["01-02-08-00",4,null,11,1,2,8,0,"01","02","08","00"]
["01-03-00-07",5,null,11,1,3,0,7,"01","03","00","07"]
["01-03-01-06",5,null,11,1,3,1,6,"01","03","01","06"]
["01-03-02-05",4,null,11,1,3,2,5,"01","03","02","05"]
["01-03-03-04",4,null,11,1,3,3,4,"01","03","03","04"]
["01-03-04-03",4,null,11,1,3,4,3,"01","03","04","03"]
["01-03-05-02",4,null,11,1,3,5,2,"01","03","05","02"]
["01-03-06-01",4,null,11,1,3,6,1,"01","03","06","01"]
["01-03-07-00",4,null,11,1,3,7,0,"01","03","07","00"]
["01-04-00-06",4,null,11,1,4,0,6,"01","04","00","06"]
["01-04-01-05",4,null,11,1,4,1,5,"01","04","01","05"]
["01-04-02-04",4,null,11,1,4,2,4,"01","04","02","04"]
["01-04-03-03",4,null,11,1,4,3,3,"01","04","03","03"]
["01-04-04-02",4,null,11,1,4,4,2,"01","04","04","02"]
["01-04-05-01",4,null,11,1,4,5,1,"01","04","05","01"]
["01-04-06-00",4,null,11,1,4,6,0,"01","04","06","00"]
["01-05-00-05",3,null,11,1,5,0,5,"01","05","00","05"]
["01-05-01-04",3,null,11,1,5,1,4,"01","05","01","04"]
["01-05-02-03",3,null,11,1,5,2,3,"01","05","02","03"]
["01-05-03-02",3,null,11,1,5,3,2,"01","05","03","02"]
["01-05-04-01",3,null,11,1,5,4,1,"01","05","04","01"]
["01-05-05-00",3,null,11,1,5,5,0,"01","05","05","00"]
["01-06-00-04",3,null,11,1,6,0,4,"01","06","00","04"]
["01-06-01-03",3,null,11,1,6,1,3,"01","06","01","03"]
["01-06-02-02",3,null,11,1,6,2,2,"01","06","02","02"]
["01-06-03-01",3,null,11,1,6,3,1,"01","06","03","01"]
["01-06-04-00",3,null,11,1,6,4,0,"01","06","04","00"]
["01-07-00-03",3,null,11,1,7,0,3,"01","07","00","03"]
["01-07-01-02",3,null,11,1,7,1,2,"01","07","01","02"]
["01-07-02-01",3,null,11,1,7,2,1,"01","07","02","01"]
["01-07-03-00",3,null,11,1,7,3,0,"01","07","03","00"]
["01-08-00-02",3,null,11,1,8,0,2,"01","08","00","02"]
["01-08-01-01",2,null,11,1,8,1,1,"01","08","01","01"]
["01-08-02-00",2,null,11,1,8,2,0,"01","08","02","00"]
["01-09-00-01",2,null,11,1,9,0,1,"01","09","00","01"]
["01-09-01-00",2,null,11,1,9,1,0,"01","09","01","00"]
["01-10-00-00",2,null,11,1,10,0,0,"01","10","00","00"]
["02-00-00-09",5,null,11,2,0,0,9,"02","00","00","09"]
["02-00-01-08",5,null,11,2,0,1,8,"02","00","01","08"]
["02-00-02-07",5,null,11,2,0,2,7,"02","00","02","07"]
["02-00-03-06",5,null,11,2,0,3,6,"02","00","03","06"]
["02-00-04-05",5,null,11,2,0,4,5,"02","00","04","05"]
["02-00-05-04",5,null,11,2,0,5,4,"02","00","05","04"]
["02-00-06-03",4,null,11,2,0,6,3,"02","00","06","03"]
["02-00-07-02",4,null,11,2,0,7,2,"02","00","07","02"]
["02-00-08-01",4,null,11,2,0,8,1,"02","00","08","01"]
["02-00-09-00",4,null,11,2,0,9,0,"02","00","09","00"]
["02-01-00-08",5,null,11,2,1,0,8,"02","01","00","08"]
["02-01-01-07",5,null,11,2,1,1,7,"02","01","01","07"]
[{"$f":"I1159&\"-\"&J1159&\"-\"&K1159&\"-\"&L1159","v":"02-01-02-06"},5,null,11,2,1,2,6,"02","01","02","06"]
["02-01-03-05",4,null,11,2,1,3,5,{"$f":"IF(LEN(E1160)=1,0&E1160,IF(LEN(E1160)=0,\"00\",RIGHT(E1160,2)))","v":"02"},{"$f":"IF(LEN(F1160)=1,0&F1160,IF(LEN(F1160)=0,\"00\",RIGHT(F1160,2)))","v":"01"},{"$f":"IF(LEN(G1160)=1,0&G1160,IF(LEN(G1160)=0,\"00\",RIGHT(G1160,2)))","v":"03"},{"$f":"IF(LEN(H1160)=1,0&H1160,IF(LEN(H1160)=0,\"00\",RIGHT(H1160,2)))","v":"05"}]
["02-01-04-04",4,null,11,2,1,4,4,"02","01","04","04"]
["02-01-05-03",4,null,11,2,1,5,3,"02","01","05","03"]
["02-01-06-02",4,null,11,2,1,6,2,"02","01","06","02"]
["02-01-07-01",4,null,11,2,1,7,1,"02","01","07","01"]
["02-01-08-00",4,null,11,2,1,8,0,"02","01","08","00"]
["02-02-00-07",5,null,11,2,2,0,7,"02","02","00","07"]
["02-02-01-06",4,null,11,2,2,1,6,"02","02","01","06"]
["02-02-02-05",4,null,11,2,2,2,5,"02","02","02","05"]
["02-02-03-04",4,null,11,2,2,3,4,"02","02","03","04"]
["02-02-04-03",4,null,11,2,2,4,3,"02","02","04","03"]
["02-02-05-02",4,null,11,2,2,5,2,"02","02","05","02"]
["02-02-06-01",4,null,11,2,2,6,1,"02","02","06","01"]
["02-02-07-00",4,null,11,2,2,7,0,"02","02","07","00"]
["02-03-00-06",4,null,11,2,3,0,6,"02","03","00","06"]
["02-03-01-05",4,null,11,2,3,1,5,"02","03","01","05"]
["02-03-02-04",4,null,11,2,3,2,4,"02","03","02","04"]
["02-03-03-03",4,null,11,2,3,3,3,"02","03","03","03"]
["02-03-04-02",4,null,11,2,3,4,2,"02","03","04","02"]
["02-03-05-01",4,null,11,2,3,5,1,"02","03","05","01"]
["02-03-06-00",4,null,11,2,3,6,0,"02","03","06","00"]
["02-04-00-05",3,null,11,2,4,0,5,"02","04","00","05"]
["02-04-01-04",3,null,11,2,4,1,4,"02","04","01","04"]
["02-04-02-03",3,null,11,2,4,2,3,"02","04","02","03"]
["02-04-03-02",3,null,11,2,4,3,2,"02","04","03","02"]
["02-04-04-01",3,null,11,2,4,4,1,"02","04","04","01"]
["02-04-05-00",3,null,11,2,4,5,0,"02","04","05","00"]
["02-05-00-04",3,null,11,2,5,0,4,"02","05","00","04"]
["02-05-01-03",3,null,11,2,5,1,3,"02","05","01","03"]
["02-05-02-02",3,null,11,2,5,2,2,"02","05","02","02"]
["02-05-03-01",3,null,11,2,5,3,1,"02","05","03","01"]
["02-05-04-00",3,null,11,2,5,4,0,"02","05","04","00"]
["02-06-00-03",3,null,11,2,6,0,3,"02","06","00","03"]
["02-06-01-02",3,null,11,2,6,1,2,"02","06","01","02"]
["02-06-02-01",3,null,11,2,6,2,1,"02","06","02","01"]
["02-06-03-00",3,null,11,2,6,3,0,"02","06","03","00"]
["02-07-00-02",2,null,11,2,7,0,2,"02","07","00","02"]
["02-07-01-01",2,null,11,2,7,1,1,"02","07","01","01"]
["02-07-02-00",2,null,11,2,7,2,0,"02","07","02","00"]
["02-08-00-01",2,null,11,2,8,0,1,"02","08","00","01"]
["02-08-01-00",2,null,11,2,8,1,0,"02","08","01","00"]
["02-09-00-00",2,null,11,2,9,0,0,"02","09","00","00"]
["03-00-00-08",5,null,11,3,0,0,8,"03","00","00","08"]
["03-00-01-07",5,null,11,3,0,1,7,"03","00","01","07"]
["03-00-02-06",4,null,11,3,0,2,6,"03","00","02","06"]
["03-00-03-05",4,null,11,3,0,3,5,"03","00","03","05"]
["03-00-04-04",4,null,11,3,0,4,4,"03","00","04","04"]
["03-00-05-03",4,null,11,3,0,5,3,"03","00","05","03"]
["03-00-06-02",4,null,11,3,0,6,2,"03","00","06","02"]
["03-00-07-01",4,null,11,3,0,7,1,"03","00","07","01"]
["03-00-08-00",4,null,11,3,0,8,0,"03","00","08","00"]
["03-01-00-07",4,null,11,3,1,0,7,"03","01","00","07"]
["03-01-01-06",4,null,11,3,1,1,6,"03","01","01","06"]
["03-01-02-05",4,null,11,3,1,2,5,"03","01","02","05"]
["03-01-03-04",4,null,11,3,1,3,4,"03","01","03","04"]
["03-01-04-03",4,null,11,3,1,4,3,"03","01","04","03"]
["03-01-05-02",4,null,11,3,1,5,2,"03","01","05","02"]
["03-01-06-01",4,null,11,3,1,6,1,"03","01","06","01"]
["03-01-07-00",4,null,11,3,1,7,0,"03","01","07","00"]
["03-02-00-06",4,null,11,3,2,0,6,"03","02","00","06"]
["03-02-01-05",4,null,11,3,2,1,5,"03","02","01","05"]
["03-02-02-04",4,null,11,3,2,2,4,"03","02","02","04"]
["03-02-03-03",4,null,11,3,2,3,3,"03","02","03","03"]
[{"$f":"I1223&\"-\"&J1223&\"-\"&K1223&\"-\"&L1223","v":"03-02-04-02"},4,null,11,3,2,4,2,"03","02","04","02"]
["03-02-05-01",4,null,11,3,2,5,1,{"$f":"IF(LEN(E1224)=1,0&E1224,IF(LEN(E1224)=0,\"00\",RIGHT(E1224,2)))","v":"03"},{"$f":"IF(LEN(F1224)=1,0&F1224,IF(LEN(F1224)=0,\"00\",RIGHT(F1224,2)))","v":"02"},{"$f":"IF(LEN(G1224)=1,0&G1224,IF(LEN(G1224)=0,\"00\",RIGHT(G1224,2)))","v":"05"},{"$f":"IF(LEN(H1224)=1,0&H1224,IF(LEN(H1224)=0,\"00\",RIGHT(H1224,2)))","v":"01"}]
["03-02-06-00",4,null,11,3,2,6,0,"03","02","06","00"]
["03-03-00-05",3,null,11,3,3,0,5,"03","03","00","05"]
["03-03-01-04",3,null,11,3,3,1,4,"03","03","01","04"]
["03-03-02-03",3,null,11,3,3,2,3,"03","03","02","03"]
["03-03-03-02",3,null,11,3,3,3,2,"03","03","03","02"]
["03-03-04-01",3,null,11,3,3,4,1,"03","03","04","01"]
["03-03-05-00",3,null,11,3,3,5,0,"03","03","05","00"]
["03-04-00-04",3,null,11,3,4,0,4,"03","04","00","04"]
["03-04-01-03",3,null,11,3,4,1,3,"03","04","01","03"]
["03-04-02-02",3,null,11,3,4,2,2,"03","04","02","02"]
["03-04-03-01",3,null,11,3,4,3,1,"03","04","03","01"]
["03-04-04-00",3,null,11,3,4,4,0,"03","04","04","00"]
["03-05-00-03",3,null,11,3,5,0,3,"03","05","00","03"]
["03-05-01-02",3,null,11,3,5,1,2,"03","05","01","02"]
["03-05-02-01",3,null,11,3,5,2,1,"03","05","02","01"]
["03-05-03-00",3,null,11,3,5,3,0,"03","05","03","00"]
["03-06-00-02",2,null,11,3,6,0,2,"03","06","00","02"]
["03-06-01-01",2,null,11,3,6,1,1,"03","06","01","01"]
["03-06-02-00",2,null,11,3,6,2,0,"03","06","02","00"]
["03-07-00-01",2,null,11,3,7,0,1,"03","07","00","01"]
["03-07-01-00",2,null,11,3,7,1,0,"03","07","01","00"]
["03-08-00-00",2,null,11,3,8,0,0,"03","08","00","00"]
["04-00-00-07",4,null,11,4,0,0,7,"04","00","00","07"]
["04-00-01-06",4,null,11,4,0,1,6,"04","00","01","06"]
["04-00-02-05",4,null,11,4,0,2,5,"04","00","02","05"]
["04-00-03-04",4,null,11,4,0,3,4,"04","00","03","04"]
["04-00-04-03",4,null,11,4,0,4,3,"04","00","04","03"]
["04-00-05-02",4,null,11,4,0,5,2,"04","00","05","02"]
["04-00-06-01",4,null,11,4,0,6,1,"04","00","06","01"]
["04-00-07-00",4,null,11,4,0,7,0,"04","00","07","00"]
["04-01-00-06",4,null,11,4,1,0,6,"04","01","00","06"]
["04-01-01-05",4,null,11,4,1,1,5,"04","01","01","05"]
["04-01-02-04",4,null,11,4,1,2,4,"04","01","02","04"]
["04-01-03-03",4,null,11,4,1,3,3,"04","01","03","03"]
["04-01-04-02",4,null,11,4,1,4,2,"04","01","04","02"]
["04-01-05-01",4,null,11,4,1,5,1,"04","01","05","01"]
["04-01-06-00",3,null,11,4,1,6,0,"04","01","06","00"]
["04-02-00-05",3,null,11,4,2,0,5,"04","02","00","05"]
["04-02-01-04",3,null,11,4,2,1,4,"04","02","01","04"]
["04-02-02-03",3,null,11,4,2,2,3,"04","02","02","03"]
["04-02-03-02",3,null,11,4,2,3,2,"04","02","03","02"]
["04-02-04-01",3,null,11,4,2,4,1,"04","02","04","01"]
["04-02-05-00",3,null,11,4,2,5,0,"04","02","05","00"]
["04-03-00-04",3,null,11,4,3,0,4,"04","03","00","04"]
["04-03-01-03",3,null,11,4,3,1,3,"04","03","01","03"]
["04-03-02-02",3,null,11,4,3,2,2,"04","03","02","02"]
["04-03-03-01",3,null,11,4,3,3,1,"04","03","03","01"]
["04-03-04-00",3,null,11,4,3,4,0,"04","03","04","00"]
["04-04-00-03",3,null,11,4,4,0,3,"04","04","00","03"]
["04-04-01-02",3,null,11,4,4,1,2,"04","04","01","02"]
["04-04-02-01",3,null,11,4,4,2,1,"04","04","02","01"]
["04-04-03-00",3,null,11,4,4,3,0,"04","04","03","00"]
["04-05-00-02",2,null,11,4,5,0,2,"04","05","00","02"]
["04-05-01-01",2,null,11,4,5,1,1,"04","05","01","01"]
["04-05-02-00",2,null,11,4,5,2,0,"04","05","02","00"]
["04-06-00-01",2,null,11,4,6,0,1,"04","06","00","01"]
["04-06-01-00",2,null,11,4,6,1,0,"04","06","01","00"]
["04-07-00-00",2,null,11,4,7,0,0,"04","07","00","00"]
["05-00-00-06",4,null,11,5,0,0,6,"05","00","00","06"]
["05-00-01-05",4,null,11,5,0,1,5,"05","00","01","05"]
["05-00-02-04",4,null,11,5,0,2,4,"05","00","02","04"]
["05-00-03-03",4,null,11,5,0,3,3,"05","00","03","03"]
[{"$f":"I1287&\"-\"&J1287&\"-\"&K1287&\"-\"&L1287","v":"05-00-04-02"},4,null,11,5,0,4,2,"05","00","04","02"]
["05-00-05-01",3,null,11,5,0,5,1,{"$f":"IF(LEN(E1288)=1,0&E1288,IF(LEN(E1288)=0,\"00\",RIGHT(E1288,2)))","v":"05"},{"$f":"IF(LEN(F1288)=1,0&F1288,IF(LEN(F1288)=0,\"00\",RIGHT(F1288,2)))","v":"00"},{"$f":"IF(LEN(G1288)=1,0&G1288,IF(LEN(G1288)=0,\"00\",RIGHT(G1288,2)))","v":"05"},{"$f":"IF(LEN(H1288)=1,0&H1288,IF(LEN(H1288)=0,\"00\",RIGHT(H1288,2)))","v":"01"}]
["05-00-06-00",3,null,11,5,0,6,0,"05","00","06","00"]
["05-01-00-05",3,null,11,5,1,0,5,"05","01","00","05"]
["05-01-01-04",3,null,11,5,1,1,4,"05","01","01","04"]
["05-01-02-03",3,null,11,5,1,2,3,"05","01","02","03"]
["05-01-03-02",3,null,11,5,1,3,2,"05","01","03","02"]
["05-01-04-01",3,null,11,5,1,4,1,"05","01","04","01"]
["05-01-05-00",3,null,11,5,1,5,0,"05","01","05","00"]
["05-02-00-04",3,null,11,5,2,0,4,"05","02","00","04"]
["05-02-01-03",3,null,11,5,2,1,3,"05","02","01","03"]
["05-02-02-02",3,null,11,5,2,2,2,"05","02","02","02"]
["05-02-03-01",3,null,11,5,2,3,1,"05","02","03","01"]
["05-02-04-00",3,null,11,5,2,4,0,"05","02","04","00"]
["05-03-00-03",3,null,11,5,3,0,3,"05","03","00","03"]
["05-03-01-02",3,null,11,5,3,1,2,"05","03","01","02"]
["05-03-02-01",3,null,11,5,3,2,1,"05","03","02","01"]
["05-03-03-00",3,null,11,5,3,3,0,"05","03","03","00"]
["05-04-00-02",2,null,11,5,4,0,2,"05","04","00","02"]
["05-04-01-01",2,null,11,5,4,1,1,"05","04","01","01"]
["05-04-02-00",2,null,11,5,4,2,0,"05","04","02","00"]
["05-05-00-01",2,null,11,5,5,0,1,"05","05","00","01"]
["05-05-01-00",2,null,11,5,5,1,0,"05","05","01","00"]
["05-06-00-00",2,null,11,5,6,0,0,"05","06","00","00"]
["06-00-00-05",3,null,11,6,0,0,5,"06","00","00","05"]
["06-00-01-04",3,null,11,6,0,1,4,"06","00","01","04"]
["06-00-02-03",3,null,11,6,0,2,3,"06","00","02","03"]
["06-00-03-02",3,null,11,6,0,3,2,"06","00","03","02"]
["06-00-04-01",3,null,11,6,0,4,1,"06","00","04","01"]
["06-00-05-00",3,null,11,6,0,5,0,"06","00","05","00"]
["06-01-00-04",3,null,11,6,1,0,4,"06","01","00","04"]
["06-01-01-03",3,null,11,6,1,1,3,"06","01","01","03"]
["06-01-02-02",3,null,11,6,1,2,2,"06","01","02","02"]
["06-01-03-01",3,null,11,6,1,3,1,"06","01","03","01"]
["06-01-04-00",3,null,11,6,1,4,0,"06","01","04","00"]
["06-02-00-03",3,null,11,6,2,0,3,"06","02","00","03"]
["06-02-01-02",3,null,11,6,2,1,2,"06","02","01","02"]
["06-02-02-01",3,null,11,6,2,2,1,"06","02","02","01"]
["06-02-03-00",3,null,11,6,2,3,0,"06","02","03","00"]
["06-03-00-02",2,null,11,6,3,0,2,"06","03","00","02"]
["06-03-01-01",2,null,11,6,3,1,1,"06","03","01","01"]
["06-03-02-00",2,null,11,6,3,2,0,"06","03","02","00"]
["06-04-00-01",2,null,11,6,4,0,1,"06","04","00","01"]
["06-04-01-00",2,null,11,6,4,1,0,"06","04","01","00"]
["06-05-00-00",2,null,11,6,5,0,0,"06","05","00","00"]
["07-00-00-04",3,null,11,7,0,0,4,"07","00","00","04"]
["07-00-01-03",3,null,11,7,0,1,3,"07","00","01","03"]
["07-00-02-02",3,null,11,7,0,2,2,"07","00","02","02"]
["07-00-03-01",3,null,11,7,0,3,1,"07","00","03","01"]
["07-00-04-00",3,null,11,7,0,4,0,"07","00","04","00"]
["07-01-00-03",3,null,11,7,1,0,3,"07","01","00","03"]
["07-01-01-02",3,null,11,7,1,1,2,"07","01","01","02"]
["07-01-02-01",3,null,11,7,1,2,1,"07","01","02","01"]
["07-01-03-00",3,null,11,7,1,3,0,"07","01","03","00"]
["07-02-00-02",2,null,11,7,2,0,2,"07","02","00","02"]
["07-02-01-01",2,null,11,7,2,1,1,"07","02","01","01"]
["07-02-02-00",2,null,11,7,2,2,0,"07","02","02","00"]
["07-03-00-01",2,null,11,7,3,0,1,"07","03","00","01"]
["07-03-01-00",2,null,11,7,3,1,0,"07","03","01","00"]
["07-04-00-00",2,null,11,7,4,0,0,"07","04","00","00"]
["08-00-00-03",3,null,11,8,0,0,3,"08","00","00","03"]
["08-00-01-02",3,null,11,8,0,1,2,"08","00","01","02"]
["08-00-02-01",3,null,11,8,0,2,1,"08","00","02","01"]
["08-00-03-00",3,null,11,8,0,3,0,"08","00","03","00"]
[{"$f":"I1351&\"-\"&J1351&\"-\"&K1351&\"-\"&L1351","v":"08-01-00-02"},2,null,11,8,1,0,2,"08","01","00","02"]
["08-01-01-01",2,null,11,8,1,1,1,{"$f":"IF(LEN(E1352)=1,0&E1352,IF(LEN(E1352)=0,\"00\",RIGHT(E1352,2)))","v":"08"},{"$f":"IF(LEN(F1352)=1,0&F1352,IF(LEN(F1352)=0,\"00\",RIGHT(F1352,2)))","v":"01"},{"$f":"IF(LEN(G1352)=1,0&G1352,IF(LEN(G1352)=0,\"00\",RIGHT(G1352,2)))","v":"01"},{"$f":"IF(LEN(H1352)=1,0&H1352,IF(LEN(H1352)=0,\"00\",RIGHT(H1352,2)))","v":"01"}]
["08-01-02-00",2,null,11,8,1,2,0,"08","01","02","00"]
["08-02-00-01",2,null,11,8,2,0,1,"08","02","00","01"]
["08-02-01-00",2,null,11,8,2,1,0,"08","02","01","00"]
["08-03-00-00",2,null,11,8,3,0,0,"08","03","00","00"]
["09-00-00-02",2,null,11,9,0,0,2,"09","00","00","02"]
["09-00-01-01",2,null,11,9,0,1,1,"09","00","01","01"]
["09-00-02-00",2,null,11,9,0,2,0,"09","00","02","00"]
["09-01-00-01",2,null,11,9,1,0,1,"09","01","00","01"]
["09-01-01-00",2,null,11,9,1,1,0,"09","01","01","00"]
["09-02-00-00",2,null,11,9,2,0,0,"09","02","00","00"]
["10-00-00-01",2,null,11,10,0,0,1,"10","00","00","01"]
["10-00-01-00",2,null,11,10,0,1,0,"10","00","01","00"]
["10-01-00-00",2,null,11,10,1,0,0,"10","01","00","00"]
["11-00-00-00",1,null,11,11,0,0,0,"11","00","00","00"]
["00-00-00-12",7,null,12,0,0,0,12,"00","00","00","12"]
["00-00-01-11",6,null,12,0,0,1,11,"00","00","01","11"]
["00-00-02-10",6,null,12,0,0,2,10,"00","00","02","10"]
["00-00-03-09",6,null,12,0,0,3,9,"00","00","03","09"]
["00-00-04-08",6,null,12,0,0,4,8,"00","00","04","08"]
["00-00-05-07",6,null,12,0,0,5,7,"00","00","05","07"]
["00-00-06-06",6,null,12,0,0,6,6,"00","00","06","06"]
["00-00-07-05",5,null,12,0,0,7,5,"00","00","07","05"]
["00-00-08-04",5,null,12,0,0,8,4,"00","00","08","04"]
["00-00-09-03",5,null,12,0,0,9,3,"00","00","09","03"]
["00-00-10-02",4,null,12,0,0,10,2,"00","00","10","02"]
["00-00-11-01",4,null,12,0,0,11,1,"00","00","11","01"]
["00-00-12-00",4,null,12,0,0,12,0,"00","00","12","00"]
["00-01-00-11",5,null,12,0,1,0,11,"00","01","00","11"]
["00-01-01-10",5,null,12,0,1,1,10,"00","01","01","10"]
["00-01-02-09",5,null,12,0,1,2,9,"00","01","02","09"]
["00-01-03-08",5,null,12,0,1,3,8,"00","01","03","08"]
["00-01-04-07",5,null,12,0,1,4,7,"00","01","04","07"]
["00-01-05-06",5,null,12,0,1,5,6,"00","01","05","06"]
["00-01-06-05",5,null,12,0,1,6,5,"00","01","06","05"]
["00-01-07-04",5,null,12,0,1,7,4,"00","01","07","04"]
["00-01-08-03",5,null,12,0,1,8,3,"00","01","08","03"]
["00-01-09-02",4,null,12,0,1,9,2,"00","01","09","02"]
["00-01-10-01",4,null,12,0,1,10,1,"00","01","10","01"]
["00-01-11-00",4,null,12,0,1,11,0,"00","01","11","00"]
["00-02-00-10",5,null,12,0,2,0,10,"00","02","00","10"]
["00-02-01-09",5,null,12,0,2,1,9,"00","02","01","09"]
["00-02-02-08",5,null,12,0,2,2,8,"00","02","02","08"]
["00-02-03-07",5,null,12,0,2,3,7,"00","02","03","07"]
["00-02-04-06",5,null,12,0,2,4,6,"00","02","04","06"]
["00-02-05-05",5,null,12,0,2,5,5,"00","02","05","05"]
["00-02-06-04",5,null,12,0,2,6,4,"00","02","06","04"]
["00-02-07-03",5,null,12,0,2,7,3,"00","02","07","03"]
["00-02-08-02",4,null,12,0,2,8,2,"00","02","08","02"]
["00-02-09-01",4,null,12,0,2,9,1,"00","02","09","01"]
["00-02-10-00",4,null,12,0,2,10,0,"00","02","10","00"]
["00-03-00-09",5,null,12,0,3,0,9,"00","03","00","09"]
["00-03-01-08",5,null,12,0,3,1,8,"00","03","01","08"]
["00-03-02-07",5,null,12,0,3,2,7,"00","03","02","07"]
["00-03-03-06",5,null,12,0,3,3,6,"00","03","03","06"]
["00-03-04-05",5,null,12,0,3,4,5,"00","03","04","05"]
["00-03-05-04",5,null,12,0,3,5,4,"00","03","05","04"]
["00-03-06-03",5,null,12,0,3,6,3,"00","03","06","03"]
["00-03-07-02",4,null,12,0,3,7,2,"00","03","07","02"]
["00-03-08-01",4,null,12,0,3,8,1,"00","03","08","01"]
["00-03-09-00",4,null,12,0,3,9,0,"00","03","09","00"]
["00-04-00-08",5,null,12,0,4,0,8,"00","04","00","08"]
["00-04-01-07",5,null,12,0,4,1,7,"00","04","01","07"]
[{"$f":"I1415&\"-\"&J1415&\"-\"&K1415&\"-\"&L1415","v":"00-04-02-06"},5,null,12,0,4,2,6,"00","04","02","06"]
["00-04-03-05",5,null,12,0,4,3,5,{"$f":"IF(LEN(E1416)=1,0&E1416,IF(LEN(E1416)=0,\"00\",RIGHT(E1416,2)))","v":"00"},{"$f":"IF(LEN(F1416)=1,0&F1416,IF(LEN(F1416)=0,\"00\",RIGHT(F1416,2)))","v":"04"},{"$f":"IF(LEN(G1416)=1,0&G1416,IF(LEN(G1416)=0,\"00\",RIGHT(G1416,2)))","v":"03"},{"$f":"IF(LEN(H1416)=1,0&H1416,IF(LEN(H1416)=0,\"00\",RIGHT(H1416,2)))","v":"05"}]
["00-04-04-04",5,null,12,0,4,4,4,"00","04","04","04"]
["00-04-05-03",4,null,12,0,4,5,3,"00","04","05","03"]
["00-04-06-02",4,null,12,0,4,6,2,"00","04","06","02"]
["00-04-07-01",4,null,12,0,4,7,1,"00","04","07","01"]
["00-04-08-00",4,null,12,0,4,8,0,"00","04","08","00"]
["00-05-00-07",5,null,12,0,5,0,7,"00","05","00","07"]
["00-05-01-06",5,null,12,0,5,1,6,"00","05","01","06"]
["00-05-02-05",5,null,12,0,5,2,5,"00","05","02","05"]
["00-05-03-04",4,null,12,0,5,3,4,"00","05","03","04"]
["00-05-04-03",4,null,12,0,5,4,3,"00","05","04","03"]
["00-05-05-02",4,null,12,0,5,5,2,"00","05","05","02"]
["00-05-06-01",4,null,12,0,5,6,1,"00","05","06","01"]
["00-05-07-00",4,null,12,0,5,7,0,"00","05","07","00"]
["00-06-00-06",4,null,12,0,6,0,6,"00","06","00","06"]
["00-06-01-05",4,null,12,0,6,1,5,"00","06","01","05"]
["00-06-02-04",4,null,12,0,6,2,4,"00","06","02","04"]
["00-06-03-03",4,null,12,0,6,3,3,"00","06","03","03"]
["00-06-04-02",4,null,12,0,6,4,2,"00","06","04","02"]
["00-06-05-01",4,null,12,0,6,5,1,"00","06","05","01"]
["00-06-06-00",4,null,12,0,6,6,0,"00","06","06","00"]
["00-07-00-05",3,null,12,0,7,0,5,"00","07","00","05"]
["00-07-01-04",3,null,12,0,7,1,4,"00","07","01","04"]
["00-07-02-03",3,null,12,0,7,2,3,"00","07","02","03"]
["00-07-03-02",3,null,12,0,7,3,2,"00","07","03","02"]
["00-07-04-01",3,null,12,0,7,4,1,"00","07","04","01"]
["00-07-05-00",3,null,12,0,7,5,0,"00","07","05","00"]
["00-08-00-04",3,null,12,0,8,0,4,"00","08","00","04"]
["00-08-01-03",3,null,12,0,8,1,3,"00","08","01","03"]
["00-08-02-02",3,null,12,0,8,2,2,"00","08","02","02"]
["00-08-03-01",3,null,12,0,8,3,1,"00","08","03","01"]
["00-08-04-00",3,null,12,0,8,4,0,"00","08","04","00"]
["00-09-00-03",3,null,12,0,9,0,3,"00","09","00","03"]
["00-09-01-02",3,null,12,0,9,1,2,"00","09","01","02"]
["00-09-02-01",3,null,12,0,9,2,1,"00","09","02","01"]
["00-09-03-00",3,null,12,0,9,3,0,"00","09","03","00"]
["00-10-00-02",3,null,12,0,10,0,2,"00","10","00","02"]
["00-10-01-01",3,null,12,0,10,1,1,"00","10","01","01"]
["00-10-02-00",2,null,12,0,10,2,0,"00","10","02","00"]
["00-11-00-01",2,null,12,0,11,0,1,"00","11","00","01"]
["00-11-01-00",2,null,12,0,11,1,0,"00","11","01","00"]
["00-12-00-00",2,null,12,0,12,0,0,"00","12","00","00"]
["01-00-00-11",5,null,12,1,0,0,11,"01","00","00","11"]
["01-00-01-10",5,null,12,1,0,1,10,"01","00","01","10"]
["01-00-02-09",5,null,12,1,0,2,9,"01","00","02","09"]
["01-00-03-08",5,null,12,1,0,3,8,"01","00","03","08"]
["01-00-04-07",5,null,12,1,0,4,7,"01","00","04","07"]
["01-00-05-06",5,null,12,1,0,5,6,"01","00","05","06"]
["01-00-06-05",5,null,12,1,0,6,5,"01","00","06","05"]
["01-00-07-04",5,null,12,1,0,7,4,"01","00","07","04"]
["01-00-08-03",5,null,12,1,0,8,3,"01","00","08","03"]
["01-00-09-02",4,null,12,1,0,9,2,"01","00","09","02"]
["01-00-10-01",4,null,12,1,0,10,1,"01","00","10","01"]
["01-00-11-00",4,null,12,1,0,11,0,"01","00","11","00"]
["01-01-00-10",5,null,12,1,1,0,10,"01","01","00","10"]
["01-01-01-09",5,null,12,1,1,1,9,"01","01","01","09"]
["01-01-02-08",5,null,12,1,1,2,8,"01","01","02","08"]
["01-01-03-07",5,null,12,1,1,3,7,"01","01","03","07"]
["01-01-04-06",5,null,12,1,1,4,6,"01","01","04","06"]
["01-01-05-05",5,null,12,1,1,5,5,"01","01","05","05"]
["01-01-06-04",5,null,12,1,1,6,4,"01","01","06","04"]
["01-01-07-03",5,null,12,1,1,7,3,"01","01","07","03"]
["01-01-08-02",4,null,12,1,1,8,2,"01","01","08","02"]
[{"$f":"I1479&\"-\"&J1479&\"-\"&K1479&\"-\"&L1479","v":"01-01-09-01"},4,null,12,1,1,9,1,"01","01","09","01"]
["01-01-10-00",4,null,12,1,1,10,0,{"$f":"IF(LEN(E1480)=1,0&E1480,IF(LEN(E1480)=0,\"00\",RIGHT(E1480,2)))","v":"01"},{"$f":"IF(LEN(F1480)=1,0&F1480,IF(LEN(F1480)=0,\"00\",RIGHT(F1480,2)))","v":"01"},{"$f":"IF(LEN(G1480)=1,0&G1480,IF(LEN(G1480)=0,\"00\",RIGHT(G1480,2)))","v":"10"},{"$f":"IF(LEN(H1480)=1,0&H1480,IF(LEN(H1480)=0,\"00\",RIGHT(H1480,2)))","v":"00"}]
["01-02-00-09",5,null,12,1,2,0,9,"01","02","00","09"]
["01-02-01-08",5,null,12,1,2,1,8,"01","02","01","08"]
["01-02-02-07",5,null,12,1,2,2,7,"01","02","02","07"]
["01-02-03-06",5,null,12,1,2,3,6,"01","02","03","06"]
["01-02-04-05",5,null,12,1,2,4,5,"01","02","04","05"]
["01-02-05-04",5,null,12,1,2,5,4,"01","02","05","04"]
["01-02-06-03",4,null,12,1,2,6,3,"01","02","06","03"]
["01-02-07-02",4,null,12,1,2,7,2,"01","02","07","02"]
["01-02-08-01",4,null,12,1,2,8,1,"01","02","08","01"]
["01-02-09-00",4,null,12,1,2,9,0,"01","02","09","00"]
["01-03-00-08",5,null,12,1,3,0,8,"01","03","00","08"]
["01-03-01-07",5,null,12,1,3,1,7,"01","03","01","07"]
["01-03-02-06",5,null,12,1,3,2,6,"01","03","02","06"]
["01-03-03-05",5,null,12,1,3,3,5,"01","03","03","05"]
["01-03-04-04",4,null,12,1,3,4,4,"01","03","04","04"]
["01-03-05-03",4,null,12,1,3,5,3,"01","03","05","03"]
["01-03-06-02",4,null,12,1,3,6,2,"01","03","06","02"]
["01-03-07-01",4,null,12,1,3,7,1,"01","03","07","01"]
["01-03-08-00",4,null,12,1,3,8,0,"01","03","08","00"]
["01-04-00-07",5,null,12,1,4,0,7,"01","04","00","07"]
["01-04-01-06",4,null,12,1,4,1,6,"01","04","01","06"]
["01-04-02-05",4,null,12,1,4,2,5,"01","04","02","05"]
["01-04-03-04",4,null,12,1,4,3,4,"01","04","03","04"]
["01-04-04-03",4,null,12,1,4,4,3,"01","04","04","03"]
["01-04-05-02",4,null,12,1,4,5,2,"01","04","05","02"]
["01-04-06-01",4,null,12,1,4,6,1,"01","04","06","01"]
["01-04-07-00",4,null,12,1,4,7,0,"01","04","07","00"]
["01-05-00-06",4,null,12,1,5,0,6,"01","05","00","06"]
["01-05-01-05",4,null,12,1,5,1,5,"01","05","01","05"]
["01-05-02-04",4,null,12,1,5,2,4,"01","05","02","04"]
["01-05-03-03",4,null,12,1,5,3,3,"01","05","03","03"]
["01-05-04-02",4,null,12,1,5,4,2,"01","05","04","02"]
["01-05-05-01",4,null,12,1,5,5,1,"01","05","05","01"]
["01-05-06-00",4,null,12,1,5,6,0,"01","05","06","00"]
["01-06-00-05",3,null,12,1,6,0,5,"01","06","00","05"]
["01-06-01-04",3,null,12,1,6,1,4,"01","06","01","04"]
["01-06-02-03",3,null,12,1,6,2,3,"01","06","02","03"]
["01-06-03-02",3,null,12,1,6,3,2,"01","06","03","02"]
["01-06-04-01",3,null,12,1,6,4,1,"01","06","04","01"]
["01-06-05-00",3,null,12,1,6,5,0,"01","06","05","00"]
["01-07-00-04",3,null,12,1,7,0,4,"01","07","00","04"]
["01-07-01-03",3,null,12,1,7,1,3,"01","07","01","03"]
["01-07-02-02",3,null,12,1,7,2,2,"01","07","02","02"]
["01-07-03-01",3,null,12,1,7,3,1,"01","07","03","01"]
["01-07-04-00",3,null,12,1,7,4,0,"01","07","04","00"]
["01-08-00-03",3,null,12,1,8,0,3,"01","08","00","03"]
["01-08-01-02",3,null,12,1,8,1,2,"01","08","01","02"]
["01-08-02-01",3,null,12,1,8,2,1,"01","08","02","01"]
["01-08-03-00",3,null,12,1,8,3,0,"01","08","03","00"]
["01-09-00-02",3,null,12,1,9,0,2,"01","09","00","02"]
["01-09-01-01",2,null,12,1,9,1,1,"01","09","01","01"]
["01-09-02-00",2,null,12,1,9,2,0,"01","09","02","00"]
["01-10-00-01",2,null,12,1,10,0,1,"01","10","00","01"]
["01-10-01-00",2,null,12,1,10,1,0,"01","10","01","00"]
["01-11-00-00",2,null,12,1,11,0,0,"01","11","00","00"]
["02-00-00-10",5,null,12,2,0,0,10,"02","00","00","10"]
["02-00-01-09",5,null,12,2,0,1,9,"02","00","01","09"]
["02-00-02-08",5,null,12,2,0,2,8,"02","00","02","08"]
["02-00-03-07",5,null,12,2,0,3,7,"02","00","03","07"]
["02-00-04-06",5,null,12,2,0,4,6,"02","00","04","06"]
["02-00-05-05",5,null,12,2,0,5,5,"02","00","05","05"]
["02-00-06-04",5,null,12,2,0,6,4,"02","00","06","04"]
[{"$f":"I1543&\"-\"&J1543&\"-\"&K1543&\"-\"&L1543","v":"02-00-07-03"},4,null,12,2,0,7,3,"02","00","07","03"]
["02-00-08-02",4,null,12,2,0,8,2,{"$f":"IF(LEN(E1544)=1,0&E1544,IF(LEN(E1544)=0,\"00\",RIGHT(E1544,2)))","v":"02"},{"$f":"IF(LEN(F1544)=1,0&F1544,IF(LEN(F1544)=0,\"00\",RIGHT(F1544,2)))","v":"00"},{"$f":"IF(LEN(G1544)=1,0&G1544,IF(LEN(G1544)=0,\"00\",RIGHT(G1544,2)))","v":"08"},{"$f":"IF(LEN(H1544)=1,0&H1544,IF(LEN(H1544)=0,\"00\",RIGHT(H1544,2)))","v":"02"}]
["02-00-09-01",4,null,12,2,0,9,1,"02","00","09","01"]
["02-00-10-00",4,null,12,2,0,10,0,"02","00","10","00"]
["02-01-00-09",5,null,12,2,1,0,9,"02","01","00","09"]
["02-01-01-08",5,null,12,2,1,1,8,"02","01","01","08"]
["02-01-02-07",5,null,12,2,1,2,7,"02","01","02","07"]
["02-01-03-06",5,null,12,2,1,3,6,"02","01","03","06"]
["02-01-04-05",5,null,12,2,1,4,5,"02","01","04","05"]
["02-01-05-04",4,null,12,2,1,5,4,"02","01","05","04"]
["02-01-06-03",4,null,12,2,1,6,3,"02","01","06","03"]
["02-01-07-02",4,null,12,2,1,7,2,"02","01","07","02"]
["02-01-08-01",4,null,12,2,1,8,1,"02","01","08","01"]
["02-01-09-00",4,null,12,2,1,9,0,"02","01","09","00"]
["02-02-00-08",5,null,12,2,2,0,8,"02","02","00","08"]
["02-02-01-07",5,null,12,2,2,1,7,"02","02","01","07"]
["02-02-02-06",4,null,12,2,2,2,6,"02","02","02","06"]
["02-02-03-05",4,null,12,2,2,3,5,"02","02","03","05"]
["02-02-04-04",4,null,12,2,2,4,4,"02","02","04","04"]
["02-02-05-03",4,null,12,2,2,5,3,"02","02","05","03"]
["02-02-06-02",4,null,12,2,2,6,2,"02","02","06","02"]
["02-02-07-01",4,null,12,2,2,7,1,"02","02","07","01"]
["02-02-08-00",4,null,12,2,2,8,0,"02","02","08","00"]
["02-03-00-07",4,null,12,2,3,0,7,"02","03","00","07"]
["02-03-01-06",4,null,12,2,3,1,6,"02","03","01","06"]
["02-03-02-05",4,null,12,2,3,2,5,"02","03","02","05"]
["02-03-03-04",4,null,12,2,3,3,4,"02","03","03","04"]
["02-03-04-03",4,null,12,2,3,4,3,"02","03","04","03"]
["02-03-05-02",4,null,12,2,3,5,2,"02","03","05","02"]
["02-03-06-01",4,null,12,2,3,6,1,"02","03","06","01"]
["02-03-07-00",4,null,12,2,3,7,0,"02","03","07","00"]
["02-04-00-06",4,null,12,2,4,0,6,"02","04","00","06"]
["02-04-01-05",4,null,12,2,4,1,5,"02","04","01","05"]
["02-04-02-04",4,null,12,2,4,2,4,"02","04","02","04"]
["02-04-03-03",4,null,12,2,4,3,3,"02","04","03","03"]
["02-04-04-02",4,null,12,2,4,4,2,"02","04","04","02"]
["02-04-05-01",4,null,12,2,4,5,1,"02","04","05","01"]
["02-04-06-00",4,null,12,2,4,6,0,"02","04","06","00"]
["02-05-00-05",3,null,12,2,5,0,5,"02","05","00","05"]
["02-05-01-04",3,null,12,2,5,1,4,"02","05","01","04"]
["02-05-02-03",3,null,12,2,5,2,3,"02","05","02","03"]
["02-05-03-02",3,null,12,2,5,3,2,"02","05","03","02"]
["02-05-04-01",3,null,12,2,5,4,1,"02","05","04","01"]
["02-05-05-00",3,null,12,2,5,5,0,"02","05","05","00"]
["02-06-00-04",3,null,12,2,6,0,4,"02","06","00","04"]
["02-06-01-03",3,null,12,2,6,1,3,"02","06","01","03"]
["02-06-02-02",3,null,12,2,6,2,2,"02","06","02","02"]
["02-06-03-01",3,null,12,2,6,3,1,"02","06","03","01"]
["02-06-04-00",3,null,12,2,6,4,0,"02","06","04","00"]
["02-07-00-03",3,null,12,2,7,0,3,"02","07","00","03"]
["02-07-01-02",3,null,12,2,7,1,2,"02","07","01","02"]
["02-07-02-01",2,null,12,2,7,2,1,"02","07","02","01"]
["02-07-03-00",2,null,12,2,7,3,0,"02","07","03","00"]
["02-08-00-02",2,null,12,2,8,0,2,"02","08","00","02"]
["02-08-01-01",2,null,12,2,8,1,1,"02","08","01","01"]
["02-08-02-00",2,null,12,2,8,2,0,"02","08","02","00"]
["02-09-00-01",2,null,12,2,9,0,1,"02","09","00","01"]
["02-09-01-00",2,null,12,2,9,1,0,"02","09","01","00"]
["02-10-00-00",2,null,12,2,10,0,0,"02","10","00","00"]
["03-00-00-09",5,null,12,3,0,0,9,"03","00","00","09"]
["03-00-01-08",5,null,12,3,0,1,8,"03","00","01","08"]
["03-00-02-07",5,null,12,3,0,2,7,"03","00","02","07"]
["03-00-03-06",4,null,12,3,0,3,6,"03","00","03","06"]
["03-00-04-05",4,null,12,3,0,4,5,"03","00","04","05"]
[{"$f":"I1607&\"-\"&J1607&\"-\"&K1607&\"-\"&L1607","v":"03-00-05-04"},4,null,12,3,0,5,4,"03","00","05","04"]
["03-00-06-03",4,null,12,3,0,6,3,{"$f":"IF(LEN(E1608)=1,0&E1608,IF(LEN(E1608)=0,\"00\",RIGHT(E1608,2)))","v":"03"},{"$f":"IF(LEN(F1608)=1,0&F1608,IF(LEN(F1608)=0,\"00\",RIGHT(F1608,2)))","v":"00"},{"$f":"IF(LEN(G1608)=1,0&G1608,IF(LEN(G1608)=0,\"00\",RIGHT(G1608,2)))","v":"06"},{"$f":"IF(LEN(H1608)=1,0&H1608,IF(LEN(H1608)=0,\"00\",RIGHT(H1608,2)))","v":"03"}]
["03-00-07-02",4,null,12,3,0,7,2,"03","00","07","02"]
["03-00-08-01",4,null,12,3,0,8,1,"03","00","08","01"]
["03-00-09-00",4,null,12,3,0,9,0,"03","00","09","00"]
["03-01-00-08",5,null,12,3,1,0,8,"03","01","00","08"]
["03-01-01-07",4,null,12,3,1,1,7,"03","01","01","07"]
["03-01-02-06",4,null,12,3,1,2,6,"03","01","02","06"]
["03-01-03-05",4,null,12,3,1,3,5,"03","01","03","05"]
["03-01-04-04",4,null,12,3,1,4,4,"03","01","04","04"]
["03-01-05-03",4,null,12,3,1,5,3,"03","01","05","03"]
["03-01-06-02",4,null,12,3,1,6,2,"03","01","06","02"]
["03-01-07-01",4,null,12,3,1,7,1,"03","01","07","01"]
["03-01-08-00",4,null,12,3,1,8,0,"03","01","08","00"]
["03-02-00-07",4,null,12,3,2,0,7,"03","02","00","07"]
["03-02-01-06",4,null,12,3,2,1,6,"03","02","01","06"]
["03-02-02-05",4,null,12,3,2,2,5,"03","02","02","05"]
["03-02-03-04",4,null,12,3,2,3,4,"03","02","03","04"]
["03-02-04-03",4,null,12,3,2,4,3,"03","02","04","03"]
["03-02-05-02",4,null,12,3,2,5,2,"03","02","05","02"]
["03-02-06-01",4,null,12,3,2,6,1,"03","02","06","01"]
["03-02-07-00",4,null,12,3,2,7,0,"03","02","07","00"]
["03-03-00-06",4,null,12,3,3,0,6,"03","03","00","06"]
["03-03-01-05",4,null,12,3,3,1,5,"03","03","01","05"]
["03-03-02-04",4,null,12,3,3,2,4,"03","03","02","04"]
["03-03-03-03",4,null,12,3,3,3,3,"03","03","03","03"]
["03-03-04-02",4,null,12,3,3,4,2,"03","03","04","02"]
["03-03-05-01",4,null,12,3,3,5,1,"03","03","05","01"]
["03-03-06-00",4,null,12,3,3,6,0,"03","03","06","00"]
["03-04-00-05",3,null,12,3,4,0,5,"03","04","00","05"]
["03-04-01-04",3,null,12,3,4,1,4,"03","04","01","04"]
["03-04-02-03",3,null,12,3,4,2,3,"03","04","02","03"]
["03-04-03-02",3,null,12,3,4,3,2,"03","04","03","02"]
["03-04-04-01",3,null,12,3,4,4,1,"03","04","04","01"]
["03-04-05-00",3,null,12,3,4,5,0,"03","04","05","00"]
["03-05-00-04",3,null,12,3,5,0,4,"03","05","00","04"]
["03-05-01-03",3,null,12,3,5,1,3,"03","05","01","03"]
["03-05-02-02",3,null,12,3,5,2,2,"03","05","02","02"]
["03-05-03-01",3,null,12,3,5,3,1,"03","05","03","01"]
["03-05-04-00",3,null,12,3,5,4,0,"03","05","04","00"]
["03-06-00-03",3,null,12,3,6,0,3,"03","06","00","03"]
["03-06-01-02",2,null,12,3,6,1,2,"03","06","01","02"]
["03-06-02-01",3,null,12,3,6,2,1,"03","06","02","01"]
["03-06-03-00",2,null,12,3,6,3,0,"03","06","03","00"]
["03-07-00-02",2,null,12,3,7,0,2,"03","07","00","02"]
["03-07-01-01",2,null,12,3,7,1,1,"03","07","01","01"]
["03-07-02-00",2,null,12,3,7,2,0,"03","07","02","00"]
["03-08-00-01",2,null,12,3,8,0,1,"03","08","00","01"]
["03-08-01-00",2,null,12,3,8,1,0,"03","08","01","00"]
["03-09-00-00",2,null,12,3,9,0,0,"03","09","00","00"]
["04-00-00-08",4,null,12,4,0,0,8,"04","00","00","08"]
["04-00-01-07",4,null,12,4,0,1,7,"04","00","01","07"]
["04-00-02-06",4,null,12,4,0,2,6,"04","00","02","06"]
["04-00-03-05",4,null,12,4,0,3,5,"04","00","03","05"]
["04-00-04-04",4,null,12,4,0,4,4,"04","00","04","04"]
["04-00-05-03",4,null,12,4,0,5,3,"04","00","05","03"]
["04-00-06-02",4,null,12,4,0,6,2,"04","00","06","02"]
["04-00-07-01",4,null,12,4,0,7,1,"04","00","07","01"]
["04-00-08-00",4,null,12,4,0,8,0,"04","00","08","00"]
["04-01-00-07",4,null,12,4,1,0,7,"04","01","00","07"]
["04-01-01-06",4,null,12,4,1,1,6,"04","01","01","06"]
["04-01-02-05",4,null,12,4,1,2,5,"04","01","02","05"]
["04-01-03-04",4,null,12,4,1,3,4,"04","01","03","04"]
["04-01-04-03",4,null,12,4,1,4,3,"04","01","04","03"]
[{"$f":"I1671&\"-\"&J1671&\"-\"&K1671&\"-\"&L1671","v":"04-01-05-02"},4,null,12,4,1,5,2,"04","01","05","02"]
["04-01-06-01",4,null,12,4,1,6,1,{"$f":"IF(LEN(E1672)=1,0&E1672,IF(LEN(E1672)=0,\"00\",RIGHT(E1672,2)))","v":"04"},{"$f":"IF(LEN(F1672)=1,0&F1672,IF(LEN(F1672)=0,\"00\",RIGHT(F1672,2)))","v":"01"},{"$f":"IF(LEN(G1672)=1,0&G1672,IF(LEN(G1672)=0,\"00\",RIGHT(G1672,2)))","v":"06"},{"$f":"IF(LEN(H1672)=1,0&H1672,IF(LEN(H1672)=0,\"00\",RIGHT(H1672,2)))","v":"01"}]
["04-01-07-00",4,null,12,4,1,7,0,"04","01","07","00"]
["04-02-00-06",4,null,12,4,2,0,6,"04","02","00","06"]
["04-02-01-05",4,null,12,4,2,1,5,"04","02","01","05"]
["04-02-02-04",4,null,12,4,2,2,4,"04","02","02","04"]
["04-02-03-03",4,null,12,4,2,3,3,"04","02","03","03"]
["04-02-04-02",4,null,12,4,2,4,2,"04","02","04","02"]
["04-02-05-01",4,null,12,4,2,5,1,"04","02","05","01"]
["04-02-06-00",3,null,12,4,2,6,0,"04","02","06","00"]
["04-03-00-05",3,null,12,4,3,0,5,"04","03","00","05"]
["04-03-01-04",3,null,12,4,3,1,4,"04","03","01","04"]
["04-03-02-03",3,null,12,4,3,2,3,"04","03","02","03"]
["04-03-03-02",3,null,12,4,3,3,2,"04","03","03","02"]
["04-03-04-01",3,null,12,4,3,4,1,"04","03","04","01"]
["04-03-05-00",3,null,12,4,3,5,0,"04","03","05","00"]
["04-04-00-04",3,null,12,4,4,0,4,"04","04","00","04"]
["04-04-01-03",3,null,12,4,4,1,3,"04","04","01","03"]
["04-04-02-02",3,null,12,4,4,2,2,"04","04","02","02"]
["04-04-03-01",3,null,12,4,4,3,1,"04","04","03","01"]
["04-04-04-00",3,null,12,4,4,4,0,"04","04","04","00"]
["04-05-00-03",3,null,12,4,5,0,3,"04","05","00","03"]
["04-05-01-02",2,null,12,4,5,1,2,"04","05","01","02"]
["04-05-02-01",2,null,12,4,5,2,1,"04","05","02","01"]
["04-05-03-00",2,null,12,4,5,3,0,"04","05","03","00"]
["04-06-00-02",2,null,12,4,6,0,2,"04","06","00","02"]
["04-06-01-01",2,null,12,4,6,1,1,"04","06","01","01"]
["04-06-02-00",2,null,12,4,6,2,0,"04","06","02","00"]
["04-07-00-01",2,null,12,4,7,0,1,"04","07","00","01"]
["04-07-01-00",2,null,12,4,7,1,0,"04","07","01","00"]
["04-08-00-00",2,null,12,4,8,0,0,"04","08","00","00"]
["05-00-00-07",4,null,12,5,0,0,7,"05","00","00","07"]
["05-00-01-06",4,null,12,5,0,1,6,"05","00","01","06"]
["05-00-02-05",4,null,12,5,0,2,5,"05","00","02","05"]
["05-00-03-04",4,null,12,5,0,3,4,"05","00","03","04"]
["05-00-04-03",4,null,12,5,0,4,3,"05","00","04","03"]
["05-00-05-02",4,null,12,5,0,5,2,"05","00","05","02"]
["05-00-06-01",4,null,12,5,0,6,1,"05","00","06","01"]
["05-00-07-00",3,null,12,5,0,7,0,"05","00","07","00"]
["05-01-00-06",4,null,12,5,1,0,6,"05","01","00","06"]
["05-01-01-05",4,null,12,5,1,1,5,"05","01","01","05"]
["05-01-02-04",4,null,12,5,1,2,4,"05","01","02","04"]
["05-01-03-03",4,null,12,5,1,3,3,"05","01","03","03"]
["05-01-04-02",4,null,12,5,1,4,2,"05","01","04","02"]
["05-01-05-01",3,null,12,5,1,5,1,"05","01","05","01"]
["05-01-06-00",3,null,12,5,1,6,0,"05","01","06","00"]
["05-02-00-05",3,null,12,5,2,0,5,"05","02","00","05"]
["05-02-01-04",3,null,12,5,2,1,4,"05","02","01","04"]
["05-02-02-03",3,null,12,5,2,2,3,"05","02","02","03"]
["05-02-03-02",3,null,12,5,2,3,2,"05","02","03","02"]
["05-02-04-01",3,null,12,5,2,4,1,"05","02","04","01"]
["05-02-05-00",3,null,12,5,2,5,0,"05","02","05","00"]
["05-03-00-04",3,null,12,5,3,0,4,"05","03","00","04"]
["05-03-01-03",3,null,12,5,3,1,3,"05","03","01","03"]
["05-03-02-02",3,null,12,5,3,2,2,"05","03","02","02"]
["05-03-03-01",3,null,12,5,3,3,1,"05","03","03","01"]
["05-03-04-00",3,null,12,5,3,4,0,"05","03","04","00"]
["05-04-00-03",3,null,12,5,4,0,3,"05","04","00","03"]
["05-04-01-02",2,null,12,5,4,1,2,"05","04","01","02"]
["05-04-02-01",2,null,12,5,4,2,1,"05","04","02","01"]
["05-04-03-00",2,null,12,5,4,3,0,"05","04","03","00"]
["05-05-00-02",2,null,12,5,5,0,2,"05","05","00","02"]
["05-05-01-01",2,null,12,5,5,1,1,"05","05","01","01"]
["05-05-02-00",2,null,12,5,5,2,0,"05","05","02","00"]
[{"$f":"I1735&\"-\"&J1735&\"-\"&K1735&\"-\"&L1735","v":"05-06-00-01"},2,null,12,5,6,0,1,"05","06","00","01"]
["05-06-01-00",2,null,12,5,6,1,0,{"$f":"IF(LEN(E1736)=1,0&E1736,IF(LEN(E1736)=0,\"00\",RIGHT(E1736,2)))","v":"05"},{"$f":"IF(LEN(F1736)=1,0&F1736,IF(LEN(F1736)=0,\"00\",RIGHT(F1736,2)))","v":"06"},{"$f":"IF(LEN(G1736)=1,0&G1736,IF(LEN(G1736)=0,\"00\",RIGHT(G1736,2)))","v":"01"},{"$f":"IF(LEN(H1736)=1,0&H1736,IF(LEN(H1736)=0,\"00\",RIGHT(H1736,2)))","v":"00"}]
["05-07-00-00",2,null,12,5,7,0,0,"05","07","00","00"]
["06-00-00-06",4,null,12,6,0,0,6,"06","00","00","06"]
["06-00-01-05",4,null,12,6,0,1,5,"06","00","01","05"]
["06-00-02-04",4,null,12,6,0,2,4,"06","00","02","04"]
["06-00-03-03",3,null,12,6,0,3,3,"06","00","03","03"]
["06-00-04-02",3,null,12,6,0,4,2,"06","00","04","02"]
["06-00-05-01",3,null,12,6,0,5,1,"06","00","05","01"]
["06-00-06-00",3,null,12,6,0,6,0,"06","00","06","00"]
["06-01-00-05",3,null,12,6,1,0,5,"06","01","00","05"]
["06-01-01-04",3,null,12,6,1,1,4,"06","01","01","04"]
["06-01-02-03",3,null,12,6,1,2,3,"06","01","02","03"]
["06-01-03-02",3,null,12,6,1,3,2,"06","01","03","02"]
["06-01-04-01",3,null,12,6,1,4,1,"06","01","04","01"]
["06-01-05-00",3,null,12,6,1,5,0,"06","01","05","00"]
["06-02-00-04",3,null,12,6,2,0,4,"06","02","00","04"]
["06-02-01-03",3,null,12,6,2,1,3,"06","02","01","03"]
["06-02-02-02",3,null,12,6,2,2,2,"06","02","02","02"]
["06-02-03-01",3,null,12,6,2,3,1,"06","02","03","01"]
["06-02-04-00",3,null,12,6,2,4,0,"06","02","04","00"]
["06-03-00-03",3,null,12,6,3,0,3,"06","03","00","03"]
["06-03-01-02",2,null,12,6,3,1,2,"06","03","01","02"]
["06-03-02-01",2,null,12,6,3,2,1,"06","03","02","01"]
["06-03-03-00",2,null,12,6,3,3,0,"06","03","03","00"]
["06-04-00-02",2,null,12,6,4,0,2,"06","04","00","02"]
["06-04-01-01",2,null,12,6,4,1,1,"06","04","01","01"]
["06-04-02-00",2,null,12,6,4,2,0,"06","04","02","00"]
["06-05-00-01",2,null,12,6,5,0,1,"06","05","00","01"]
["06-05-01-00",2,null,12,6,5,1,0,"06","05","01","00"]
["06-06-00-00",2,null,12,6,6,0,0,"06","06","00","00"]
["07-00-00-05",3,null,12,7,0,0,5,"07","00","00","05"]
["07-00-01-04",3,null,12,7,0,1,4,"07","00","01","04"]
["07-00-02-03",3,null,12,7,0,2,3,"07","00","02","03"]
["07-00-03-02",3,null,12,7,0,3,2,"07","00","03","02"]
["07-00-04-01",3,null,12,7,0,4,1,"07","00","04","01"]
["07-00-05-00",3,null,12,7,0,5,0,"07","00","05","00"]
["07-01-00-04",3,null,12,7,1,0,4,"07","01","00","04"]
["07-01-01-03",3,null,12,7,1,1,3,"07","01","01","03"]
["07-01-02-02",3,null,12,7,1,2,2,"07","01","02","02"]
["07-01-03-01",3,null,12,7,1,3,1,"07","01","03","01"]
["07-01-04-00",3,null,12,7,1,4,0,"07","01","04","00"]
["07-02-00-03",3,null,12,7,2,0,3,"07","02","00","03"]
["07-02-01-02",2,null,12,7,2,1,2,"07","02","01","02"]
["07-02-02-01",2,null,12,7,2,2,1,"07","02","02","01"]
["07-02-03-00",2,null,12,7,2,3,0,"07","02","03","00"]
["07-03-00-02",2,null,12,7,3,0,2,"07","03","00","02"]
["07-03-01-01",2,null,12,7,3,1,1,"07","03","01","01"]
["07-03-02-00",2,null,12,7,3,2,0,"07","03","02","00"]
["07-04-00-01",2,null,12,7,4,0,1,"07","04","00","01"]
["07-04-01-00",2,null,12,7,4,1,0,"07","04","01","00"]
["07-05-00-00",2,null,12,7,5,0,0,"07","05","00","00"]
["08-00-00-04",3,null,12,8,0,0,4,"08","00","00","04"]
["08-00-01-03",3,null,12,8,0,1,3,"08","00","01","03"]
["08-00-02-02",3,null,12,8,0,2,2,"08","00","02","02"]
["08-00-03-01",3,null,12,8,0,3,1,"08","00","03","01"]
["08-00-04-00",3,null,12,8,0,4,0,"08","00","04","00"]
["08-01-00-03",3,null,12,8,1,0,3,"08","01","00","03"]
["08-01-01-02",2,null,12,8,1,1,2,"08","01","01","02"]
["08-01-02-01",2,null,12,8,1,2,1,"08","01","02","01"]
["08-01-03-00",2,null,12,8,1,3,0,"08","01","03","00"]
["08-02-00-02",2,null,12,8,2,0,2,"08","02","00","02"]
["08-02-01-01",2,null,12,8,2,1,1,"08","02","01","01"]
["08-02-02-00",2,null,12,8,2,2,0,"08","02","02","00"]
[{"$f":"I1799&\"-\"&J1799&\"-\"&K1799&\"-\"&L1799","v":"08-03-00-01"},2,null,12,8,3,0,1,"08","03","00","01"]
["08-03-01-00",2,null,12,8,3,1,0,{"$f":"IF(LEN(E1800)=1,0&E1800,IF(LEN(E1800)=0,\"00\",RIGHT(E1800,2)))","v":"08"},{"$f":"IF(LEN(F1800)=1,0&F1800,IF(LEN(F1800)=0,\"00\",RIGHT(F1800,2)))","v":"03"},{"$f":"IF(LEN(G1800)=1,0&G1800,IF(LEN(G1800)=0,\"00\",RIGHT(G1800,2)))","v":"01"},{"$f":"IF(LEN(H1800)=1,0&H1800,IF(LEN(H1800)=0,\"00\",RIGHT(H1800,2)))","v":"00"}]
["08-04-00-00",2,null,12,8,4,0,0,"08","04","00","00"]
["09-00-00-03",3,null,12,9,0,0,3,"09","00","00","03"]
["09-00-01-02",2,null,12,9,0,1,2,"09","00","01","02"]
["09-00-02-01",2,null,12,9,0,2,1,"09","00","02","01"]
["09-00-03-00",2,null,12,9,0,3,0,"09","00","03","00"]
["09-01-00-02",2,null,12,9,1,0,2,"09","01","00","02"]
["09-01-01-01",2,null,12,9,1,1,1,"09","01","01","01"]
["09-01-02-00",2,null,12,9,1,2,0,"09","01","02","00"]
["09-02-00-01",2,null,12,9,2,0,1,"09","02","00","01"]
["09-02-01-00",2,null,12,9,2,1,0,"09","02","01","00"]
["09-03-00-00",2,null,12,9,3,0,0,"09","03","00","00"]
["10-00-00-02",2,null,12,10,0,0,2,"10","00","00","02"]
["10-00-01-01",2,null,12,10,0,1,1,"10","00","01","01"]
["10-00-02-00",2,null,12,10,0,2,0,"10","00","02","00"]
["10-01-00-01",2,null,12,10,1,0,1,"10","01","00","01"]
["10-01-01-00",2,null,12,10,1,1,0,"10","01","01","00"]
["10-02-00-00",2,null,12,10,2,0,0,"10","02","00","00"]
["11-00-00-01",2,null,12,11,0,0,1,"11","00","00","01"]
["11-00-01-00",2,null,12,11,0,1,0,"11","00","01","00"]
["11-01-00-00",2,null,12,11,1,0,0,"11","01","00","00"]
["12-00-00-00",1,null,12,12,0,0,0,"12","00","00","00"]
["00-00-00-13",7,null,13,0,0,0,13,"00","00","00","13"]
["00-00-01-12",6,null,13,0,0,1,12,"00","00","01","12"]
["00-00-02-11",6,null,13,0,0,2,11,"00","00","02","11"]
["00-00-03-10",6,null,13,0,0,3,10,"00","00","03","10"]
["00-00-04-09",6,null,13,0,0,4,9,"00","00","04","09"]
["00-00-05-08",6,null,13,0,0,5,8,"00","00","05","08"]
["00-00-06-07",6,null,13,0,0,6,7,"00","00","06","07"]
["00-00-07-06",5,null,13,0,0,7,6,"00","00","07","06"]
["00-00-08-05",5,null,13,0,0,8,5,"00","00","08","05"]
["00-00-09-04",5,null,13,0,0,9,4,"00","00","09","04"]
["00-00-10-03",5,null,13,0,0,10,3,"00","00","10","03"]
["00-00-11-02",4,null,13,0,0,11,2,"00","00","11","02"]
["00-00-12-01",4,null,13,0,0,12,1,"00","00","12","01"]
["00-00-13-00",4,null,13,0,0,13,0,"00","00","13","00"]
["00-01-00-12",5,null,13,0,1,0,12,"00","01","00","12"]
["00-01-01-11",5,null,13,0,1,1,11,"00","01","01","11"]
["00-01-02-10",5,null,13,0,1,2,10,"00","01","02","10"]
["00-01-03-09",5,null,13,0,1,3,9,"00","01","03","09"]
["00-01-04-08",5,null,13,0,1,4,8,"00","01","04","08"]
["00-01-05-07",5,null,13,0,1,5,7,"00","01","05","07"]
["00-01-06-06",5,null,13,0,1,6,6,"00","01","06","06"]
["00-01-07-05",5,null,13,0,1,7,5,"00","01","07","05"]
["00-01-08-04",5,null,13,0,1,8,4,"00","01","08","04"]
["00-01-09-03",5,null,13,0,1,9,3,"00","01","09","03"]
["00-01-10-02",4,null,13,0,1,10,2,"00","01","10","02"]
["00-01-11-01",4,null,13,0,1,11,1,"00","01","11","01"]
["00-01-12-00",4,null,13,0,1,12,0,"00","01","12","00"]
["00-02-00-11",5,null,13,0,2,0,11,"00","02","00","11"]
["00-02-01-10",5,null,13,0,2,1,10,"00","02","01","10"]
["00-02-02-09",5,null,13,0,2,2,9,"00","02","02","09"]
["00-02-03-08",5,null,13,0,2,3,8,"00","02","03","08"]
["00-02-04-07",5,null,13,0,2,4,7,"00","02","04","07"]
["00-02-05-06",5,null,13,0,2,5,6,"00","02","05","06"]
["00-02-06-05",5,null,13,0,2,6,5,"00","02","06","05"]
["00-02-07-04",5,null,13,0,2,7,4,"00","02","07","04"]
["00-02-08-03",5,null,13,0,2,8,3,"00","02","08","03"]
["00-02-09-02",4,null,13,0,2,9,2,"00","02","09","02"]
["00-02-10-01",4,null,13,0,2,10,1,"00","02","10","01"]
["00-02-11-00",4,null,13,0,2,11,0,"00","02","11","00"]
["00-03-00-10",5,null,13,0,3,0,10,"00","03","00","10"]
["00-03-01-09",5,null,13,0,3,1,9,"00","03","01","09"]
[{"$f":"I1863&\"-\"&J1863&\"-\"&K1863&\"-\"&L1863","v":"00-03-02-08"},5,null,13,0,3,2,8,"00","03","02","08"]
["00-03-03-07",5,null,13,0,3,3,7,{"$f":"IF(LEN(E1864)=1,0&E1864,IF(LEN(E1864)=0,\"00\",RIGHT(E1864,2)))","v":"00"},{"$f":"IF(LEN(F1864)=1,0&F1864,IF(LEN(F1864)=0,\"00\",RIGHT(F1864,2)))","v":"03"},{"$f":"IF(LEN(G1864)=1,0&G1864,IF(LEN(G1864)=0,\"00\",RIGHT(G1864,2)))","v":"03"},{"$f":"IF(LEN(H1864)=1,0&H1864,IF(LEN(H1864)=0,\"00\",RIGHT(H1864,2)))","v":"07"}]
["00-03-04-06",5,null,13,0,3,4,6,"00","03","04","06"]
["00-03-05-05",5,null,13,0,3,5,5,"00","03","05","05"]
["00-03-06-04",5,null,13,0,3,6,4,"00","03","06","04"]
["00-03-07-03",5,null,13,0,3,7,3,"00","03","07","03"]
["00-03-08-02",4,null,13,0,3,8,2,"00","03","08","02"]
["00-03-09-01",4,null,13,0,3,9,1,"00","03","09","01"]
["00-03-10-00",4,null,13,0,3,10,0,"00","03","10","00"]
["00-04-00-09",5,null,13,0,4,0,9,"00","04","00","09"]
["00-04-01-08",5,null,13,0,4,1,8,"00","04","01","08"]
["00-04-02-07",5,null,13,0,4,2,7,"00","04","02","07"]
["00-04-03-06",5,null,13,0,4,3,6,"00","04","03","06"]
["00-04-04-05",5,null,13,0,4,4,5,"00","04","04","05"]
["00-04-05-04",5,null,13,0,4,5,4,"00","04","05","04"]
["00-04-06-03",4,null,13,0,4,6,3,"00","04","06","03"]
["00-04-07-02",4,null,13,0,4,7,2,"00","04","07","02"]
["00-04-08-01",4,null,13,0,4,8,1,"00","04","08","01"]
["00-04-09-00",4,null,13,0,4,9,0,"00","04","09","00"]
["00-05-00-08",5,null,13,0,5,0,8,"00","05","00","08"]
["00-05-01-07",5,null,13,0,5,1,7,"00","05","01","07"]
["00-05-02-06",5,null,13,0,5,2,6,"00","05","02","06"]
["00-05-03-05",5,null,13,0,5,3,5,"00","05","03","05"]
["00-05-04-04",4,null,13,0,5,4,4,"00","05","04","04"]
["00-05-05-03",4,null,13,0,5,5,3,"00","05","05","03"]
["00-05-06-02",4,null,13,0,5,6,2,"00","05","06","02"]
["00-05-07-01",4,null,13,0,5,7,1,"00","05","07","01"]
["00-05-08-00",4,null,13,0,5,8,0,"00","05","08","00"]
["00-06-00-07",5,null,13,0,6,0,7,"00","06","00","07"]
["00-06-01-06",4,null,13,0,6,1,6,"00","06","01","06"]
["00-06-02-05",4,null,13,0,6,2,5,"00","06","02","05"]
["00-06-03-04",4,null,13,0,6,3,4,"00","06","03","04"]
["00-06-04-03",4,null,13,0,6,4,3,"00","06","04","03"]
["00-06-05-02",4,null,13,0,6,5,2,"00","06","05","02"]
["00-06-06-01",4,null,13,0,6,6,1,"00","06","06","01"]
["00-06-07-00",4,null,13,0,6,7,0,"00","06","07","00"]
["00-07-00-06",3,null,13,0,7,0,6,"00","07","00","06"]
["00-07-01-05",3,null,13,0,7,1,5,"00","07","01","05"]
["00-07-02-04",3,null,13,0,7,2,4,"00","07","02","04"]
["00-07-03-03",3,null,13,0,7,3,3,"00","07","03","03"]
["00-07-04-02",3,null,13,0,7,4,2,"00","07","04","02"]
["00-07-05-01",3,null,13,0,7,5,1,"00","07","05","01"]
["00-07-06-00",3,null,13,0,7,6,0,"00","07","06","00"]
["00-08-00-05",3,null,13,0,8,0,5,"00","08","00","05"]
["00-08-01-04",3,null,13,0,8,1,4,"00","08","01","04"]
["00-08-02-03",3,null,13,0,8,2,3,"00","08","02","03"]
["00-08-03-02",3,null,13,0,8,3,2,"00","08","03","02"]
["00-08-04-01",3,null,13,0,8,4,1,"00","08","04","01"]
["00-08-05-00",3,null,13,0,8,5,0,"00","08","05","00"]
["00-09-00-04",3,null,13,0,9,0,4,"00","09","00","04"]
["00-09-01-03",3,null,13,0,9,1,3,"00","09","01","03"]
["00-09-02-02",3,null,13,0,9,2,2,"00","09","02","02"]
["00-09-03-01",3,null,13,0,9,3,1,"00","09","03","01"]
["00-09-04-00",3,null,13,0,9,4,0,"00","09","04","00"]
["00-10-00-03",3,null,13,0,10,0,3,"00","10","00","03"]
["00-10-01-02",3,null,13,0,10,1,2,"00","10","01","02"]
["00-10-02-01",3,null,13,0,10,2,1,"00","10","02","01"]
["00-10-03-00",3,null,13,0,10,3,0,"00","10","03","00"]
["00-11-00-02",3,null,13,0,11,0,2,"00","11","00","02"]
["00-11-01-01",3,null,13,0,11,1,1,"00","11","01","01"]
["00-11-02-00",2,null,13,0,11,2,0,"00","11","02","00"]
["00-12-00-01",2,null,13,0,12,0,1,"00","12","00","01"]
["00-12-01-00",2,null,13,0,12,1,0,"00","12","01","00"]
["00-13-00-00",2,null,13,0,13,0,0,"00","13","00","00"]
[{"$f":"I1927&\"-\"&J1927&\"-\"&K1927&\"-\"&L1927","v":"01-00-00-12"},5,null,13,1,0,0,12,"01","00","00","12"]
["01-00-01-11",5,null,13,1,0,1,11,{"$f":"IF(LEN(E1928)=1,0&E1928,IF(LEN(E1928)=0,\"00\",RIGHT(E1928,2)))","v":"01"},{"$f":"IF(LEN(F1928)=1,0&F1928,IF(LEN(F1928)=0,\"00\",RIGHT(F1928,2)))","v":"00"},{"$f":"IF(LEN(G1928)=1,0&G1928,IF(LEN(G1928)=0,\"00\",RIGHT(G1928,2)))","v":"01"},{"$f":"IF(LEN(H1928)=1,0&H1928,IF(LEN(H1928)=0,\"00\",RIGHT(H1928,2)))","v":"11"}]
["01-00-02-10",5,null,13,1,0,2,10,"01","00","02","10"]
["01-00-03-09",5,null,13,1,0,3,9,"01","00","03","09"]
["01-00-04-08",5,null,13,1,0,4,8,"01","00","04","08"]
["01-00-05-07",5,null,13,1,0,5,7,"01","00","05","07"]
["01-00-06-06",5,null,13,1,0,6,6,"01","00","06","06"]
["01-00-07-05",5,null,13,1,0,7,5,"01","00","07","05"]
["01-00-08-04",5,null,13,1,0,8,4,"01","00","08","04"]
["01-00-09-03",5,null,13,1,0,9,3,"01","00","09","03"]
["01-00-10-02",4,null,13,1,0,10,2,"01","00","10","02"]
["01-00-11-01",4,null,13,1,0,11,1,"01","00","11","01"]
["01-00-12-00",4,null,13,1,0,12,0,"01","00","12","00"]
["01-01-00-11",5,null,13,1,1,0,11,"01","01","00","11"]
["01-01-01-10",5,null,13,1,1,1,10,"01","01","01","10"]
["01-01-02-09",5,null,13,1,1,2,9,"01","01","02","09"]
["01-01-03-08",5,null,13,1,1,3,8,"01","01","03","08"]
["01-01-04-07",5,null,13,1,1,4,7,"01","01","04","07"]
["01-01-05-06",5,null,13,1,1,5,6,"01","01","05","06"]
["01-01-06-05",5,null,13,1,1,6,5,"01","01","06","05"]
["01-01-07-04",5,null,13,1,1,7,4,"01","01","07","04"]
["01-01-08-03",5,null,13,1,1,8,3,"01","01","08","03"]
["01-01-09-02",4,null,13,1,1,9,2,"01","01","09","02"]
["01-01-10-01",4,null,13,1,1,10,1,"01","01","10","01"]
["01-01-11-00",4,null,13,1,1,11,0,"01","01","11","00"]
["01-02-00-10",5,null,13,1,2,0,10,"01","02","00","10"]
["01-02-01-09",5,null,13,1,2,1,9,"01","02","01","09"]
["01-02-02-08",5,null,13,1,2,2,8,"01","02","02","08"]
["01-02-03-07",5,null,13,1,2,3,7,"01","02","03","07"]
["01-02-04-06",5,null,13,1,2,4,6,"01","02","04","06"]
["01-02-05-05",5,null,13,1,2,5,5,"01","02","05","05"]
["01-02-06-04",5,null,13,1,2,6,4,"01","02","06","04"]
["01-02-07-03",4,null,13,1,2,7,3,"01","02","07","03"]
["01-02-08-02",4,null,13,1,2,8,2,"01","02","08","02"]
["01-02-09-01",4,null,13,1,2,9,1,"01","02","09","01"]
["01-02-10-00",4,null,13,1,2,10,0,"01","02","10","00"]
["01-03-00-09",5,null,13,1,3,0,9,"01","03","00","09"]
["01-03-01-08",5,null,13,1,3,1,8,"01","03","01","08"]
["01-03-02-07",5,null,13,1,3,2,7,"01","03","02","07"]
["01-03-03-06",5,null,13,1,3,3,6,"01","03","03","06"]
["01-03-04-05",5,null,13,1,3,4,5,"01","03","04","05"]
["01-03-05-04",4,null,13,1,3,5,4,"01","03","05","04"]
["01-03-06-03",4,null,13,1,3,6,3,"01","03","06","03"]
["01-03-07-02",4,null,13,1,3,7,2,"01","03","07","02"]
["01-03-08-01",4,null,13,1,3,8,1,"01","03","08","01"]
["01-03-09-00",4,null,13,1,3,9,0,"01","03","09","00"]
["01-04-00-08",5,null,13,1,4,0,8,"01","04","00","08"]
["01-04-01-07",5,null,13,1,4,1,7,"01","04","01","07"]
["01-04-02-06",4,null,13,1,4,2,6,"01","04","02","06"]
["01-04-03-05",4,null,13,1,4,3,5,"01","04","03","05"]
["01-04-04-04",4,null,13,1,4,4,4,"01","04","04","04"]
["01-04-05-03",4,null,13,1,4,5,3,"01","04","05","03"]
["01-04-06-02",4,null,13,1,4,6,2,"01","04","06","02"]
["01-04-07-01",4,null,13,1,4,7,1,"01","04","07","01"]
["01-04-08-00",4,null,13,1,4,8,0,"01","04","08","00"]
["01-05-00-07",4,null,13,1,5,0,7,"01","05","00","07"]
["01-05-01-06",4,null,13,1,5,1,6,"01","05","01","06"]
["01-05-02-05",4,null,13,1,5,2,5,"01","05","02","05"]
["01-05-03-04",4,null,13,1,5,3,4,"01","05","03","04"]
["01-05-04-03",4,null,13,1,5,4,3,"01","05","04","03"]
["01-05-05-02",4,null,13,1,5,5,2,"01","05","05","02"]
["01-05-06-01",4,null,13,1,5,6,1,"01","05","06","01"]
["01-05-07-00",4,null,13,1,5,7,0,"01","05","07","00"]
["01-06-00-06",3,null,13,1,6,0,6,"01","06","00","06"]
[{"$f":"I1991&\"-\"&J1991&\"-\"&K1991&\"-\"&L1991","v":"01-06-01-05"},3,null,13,1,6,1,5,"01","06","01","05"]
["01-06-02-04",3,null,13,1,6,2,4,{"$f":"IF(LEN(E1992)=1,0&E1992,IF(LEN(E1992)=0,\"00\",RIGHT(E1992,2)))","v":"01"},{"$f":"IF(LEN(F1992)=1,0&F1992,IF(LEN(F1992)=0,\"00\",RIGHT(F1992,2)))","v":"06"},{"$f":"IF(LEN(G1992)=1,0&G1992,IF(LEN(G1992)=0,\"00\",RIGHT(G1992,2)))","v":"02"},{"$f":"IF(LEN(H1992)=1,0&H1992,IF(LEN(H1992)=0,\"00\",RIGHT(H1992,2)))","v":"04"}]
["01-06-03-03",3,null,13,1,6,3,3,"01","06","03","03"]
["01-06-04-02",3,null,13,1,6,4,2,"01","06","04","02"]
["01-06-05-01",3,null,13,1,6,5,1,"01","06","05","01"]
["01-06-06-00",3,null,13,1,6,6,0,"01","06","06","00"]
["01-07-00-05",3,null,13,1,7,0,5,"01","07","00","05"]
["01-07-01-04",3,null,13,1,7,1,4,"01","07","01","04"]
["01-07-02-03",3,null,13,1,7,2,3,"01","07","02","03"]
["01-07-03-02",3,null,13,1,7,3,2,"01","07","03","02"]
["01-07-04-01",3,null,13,1,7,4,1,"01","07","04","01"]
["01-07-05-00",3,null,13,1,7,5,0,"01","07","05","00"]
["01-08-00-04",3,null,13,1,8,0,4,"01","08","00","04"]
["01-08-01-03",3,null,13,1,8,1,3,"01","08","01","03"]
["01-08-02-02",3,null,13,1,8,2,2,"01","08","02","02"]
["01-08-03-01",3,null,13,1,8,3,1,"01","08","03","01"]
["01-08-04-00",3,null,13,1,8,4,0,"01","08","04","00"]
["01-09-00-03",3,null,13,1,9,0,3,"01","09","00","03"]
["01-09-01-02",3,null,13,1,9,1,2,"01","09","01","02"]
["01-09-02-01",3,null,13,1,9,2,1,"01","09","02","01"]
["01-09-03-00",2,null,13,1,9,3,0,"01","09","03","00"]
["01-10-00-02",2,null,13,1,10,0,2,"01","10","00","02"]
["01-10-01-01",2,null,13,1,10,1,1,"01","10","01","01"]
["01-10-02-00",2,null,13,1,10,2,0,"01","10","02","00"]
["01-11-00-01",2,null,13,1,11,0,1,"01","11","00","01"]
["01-11-01-00",2,null,13,1,11,1,0,"01","11","01","00"]
["01-12-00-00",2,null,13,1,12,0,0,"01","12","00","00"]
["02-00-00-11",5,null,13,2,0,0,11,"02","00","00","11"]
["02-00-01-10",5,null,13,2,0,1,10,"02","00","01","10"]
["02-00-02-09",5,null,13,2,0,2,9,"02","00","02","09"]
["02-00-03-08",5,null,13,2,0,3,8,"02","00","03","08"]
["02-00-04-07",5,null,13,2,0,4,7,"02","00","04","07"]
["02-00-05-06",5,null,13,2,0,5,6,"02","00","05","06"]
["02-00-06-05",5,null,13,2,0,6,5,"02","00","06","05"]
["02-00-07-04",5,null,13,2,0,7,4,"02","00","07","04"]
["02-00-08-03",4,null,13,2,0,8,3,"02","00","08","03"]
["02-00-09-02",4,null,13,2,0,9,2,"02","00","09","02"]
["02-00-10-01",4,null,13,2,0,10,1,"02","00","10","01"]
["02-00-11-00",4,null,13,2,0,11,0,"02","00","11","00"]
["02-01-00-10",5,null,13,2,1,0,10,"02","01","00","10"]
["02-01-01-09",5,null,13,2,1,1,9,"02","01","01","09"]
["02-01-02-08",5,null,13,2,1,2,8,"02","01","02","08"]
["02-01-03-07",5,null,13,2,1,3,7,"02","01","03","07"]
["02-01-04-06",5,null,13,2,1,4,6,"02","01","04","06"]
["02-01-05-05",5,null,13,2,1,5,5,"02","01","05","05"]
["02-01-06-04",4,null,13,2,1,6,4,"02","01","06","04"]
["02-01-07-03",4,null,13,2,1,7,3,"02","01","07","03"]
["02-01-08-02",4,null,13,2,1,8,2,"02","01","08","02"]
["02-01-09-01",4,null,13,2,1,9,1,"02","01","09","01"]
["02-01-10-00",4,null,13,2,1,10,0,"02","01","10","00"]
["02-02-00-09",5,null,13,2,2,0,9,"02","02","00","09"]
["02-02-01-08",5,null,13,2,2,1,8,"02","02","01","08"]
["02-02-02-07",5,null,13,2,2,2,7,"02","02","02","07"]
["02-02-03-06",4,null,13,2,2,3,6,"02","02","03","06"]
["02-02-04-05",4,null,13,2,2,4,5,"02","02","04","05"]
["02-02-05-04",4,null,13,2,2,5,4,"02","02","05","04"]
["02-02-06-03",4,null,13,2,2,6,3,"02","02","06","03"]
["02-02-07-02",4,null,13,2,2,7,2,"02","02","07","02"]
["02-02-08-01",4,null,13,2,2,8,1,"02","02","08","01"]
["02-02-09-00",4,null,13,2,2,9,0,"02","02","09","00"]
["02-03-00-08",5,null,13,2,3,0,8,"02","03","00","08"]
["02-03-01-07",4,null,13,2,3,1,7,"02","03","01","07"]
["02-03-02-06",4,null,13,2,3,2,6,"02","03","02","06"]
["02-03-03-05",4,null,13,2,3,3,5,"02","03","03","05"]
[{"$f":"I2055&\"-\"&J2055&\"-\"&K2055&\"-\"&L2055","v":"02-03-04-04"},4,null,13,2,3,4,4,"02","03","04","04"]
["02-03-05-03",4,null,13,2,3,5,3,{"$f":"IF(LEN(E2056)=1,0&E2056,IF(LEN(E2056)=0,\"00\",RIGHT(E2056,2)))","v":"02"},{"$f":"IF(LEN(F2056)=1,0&F2056,IF(LEN(F2056)=0,\"00\",RIGHT(F2056,2)))","v":"03"},{"$f":"IF(LEN(G2056)=1,0&G2056,IF(LEN(G2056)=0,\"00\",RIGHT(G2056,2)))","v":"05"},{"$f":"IF(LEN(H2056)=1,0&H2056,IF(LEN(H2056)=0,\"00\",RIGHT(H2056,2)))","v":"03"}]
["02-03-06-02",4,null,13,2,3,6,2,"02","03","06","02"]
["02-03-07-01",4,null,13,2,3,7,1,"02","03","07","01"]
["02-03-08-00",4,null,13,2,3,8,0,"02","03","08","00"]
["02-04-00-07",4,null,13,2,4,0,7,"02","04","00","07"]
["02-04-01-06",4,null,13,2,4,1,6,"02","04","01","06"]
["02-04-02-05",4,null,13,2,4,2,5,"02","04","02","05"]
["02-04-03-04",4,null,13,2,4,3,4,"02","04","03","04"]
["02-04-04-03",4,null,13,2,4,4,3,"02","04","04","03"]
["02-04-05-02",4,null,13,2,4,5,2,"02","04","05","02"]
["02-04-06-01",4,null,13,2,4,6,1,"02","04","06","01"]
["02-04-07-00",4,null,13,2,4,7,0,"02","04","07","00"]
["02-05-00-06",3,null,13,2,5,0,6,"02","05","00","06"]
["02-05-01-05",3,null,13,2,5,1,5,"02","05","01","05"]
["02-05-02-04",3,null,13,2,5,2,4,"02","05","02","04"]
["02-05-03-03",3,null,13,2,5,3,3,"02","05","03","03"]
["02-05-04-02",3,null,13,2,5,4,2,"02","05","04","02"]
["02-05-05-01",3,null,13,2,5,5,1,"02","05","05","01"]
["02-05-06-00",3,null,13,2,5,6,0,"02","05","06","00"]
["02-06-00-05",3,null,13,2,6,0,5,"02","06","00","05"]
["02-06-01-04",3,null,13,2,6,1,4,"02","06","01","04"]
["02-06-02-03",3,null,13,2,6,2,3,"02","06","02","03"]
["02-06-03-02",3,null,13,2,6,3,2,"02","06","03","02"]
["02-06-04-01",3,null,13,2,6,4,1,"02","06","04","01"]
["02-06-05-00",3,null,13,2,6,5,0,"02","06","05","00"]
["02-07-00-04",3,null,13,2,7,0,4,"02","07","00","04"]
["02-07-01-03",3,null,13,2,7,1,3,"02","07","01","03"]
["02-07-02-02",3,null,13,2,7,2,2,"02","07","02","02"]
["02-07-03-01",3,null,13,2,7,3,1,"02","07","03","01"]
["02-07-04-00",3,null,13,2,7,4,0,"02","07","04","00"]
["02-08-00-03",3,null,13,2,8,0,3,"02","08","00","03"]
["02-08-01-02",2,null,13,2,8,1,2,"02","08","01","02"]
["02-08-02-01",2,null,13,2,8,2,1,"02","08","02","01"]
["02-08-03-00",2,null,13,2,8,3,0,"02","08","03","00"]
["02-09-00-02",2,null,13,2,9,0,2,"02","09","00","02"]
["02-09-01-01",2,null,13,2,9,1,1,"02","09","01","01"]
["02-09-02-00",2,null,13,2,9,2,0,"02","09","02","00"]
["02-10-00-01",2,null,13,2,10,0,1,"02","10","00","01"]
["02-10-01-00",2,null,13,2,10,1,0,"02","10","01","00"]
["02-11-00-00",2,null,13,2,11,0,0,"02","11","00","00"]
["03-00-00-10",5,null,13,3,0,0,10,"03","00","00","10"]
["03-00-01-09",5,null,13,3,0,1,9,"03","00","01","09"]
["03-00-02-08",5,null,13,3,0,2,8,"03","00","02","08"]
["03-00-03-07",5,null,13,3,0,3,7,"03","00","03","07"]
["03-00-04-06",4,null,13,3,0,4,6,"03","00","04","06"]
["03-00-05-05",4,null,13,3,0,5,5,"03","00","05","05"]
["03-00-06-04",4,null,13,3,0,6,4,"03","00","06","04"]
["03-00-07-03",4,null,13,3,0,7,3,"03","00","07","03"]
["03-00-08-02",4,null,13,3,0,8,2,"03","00","08","02"]
["03-00-09-01",4,null,13,3,0,9,1,"03","00","09","01"]
["03-00-10-00",4,null,13,3,0,10,0,"03","00","10","00"]
["03-01-00-09",5,null,13,3,1,0,9,"03","01","00","09"]
["03-01-01-08",5,null,13,3,1,1,8,"03","01","01","08"]
["03-01-02-07",4,null,13,3,1,2,7,"03","01","02","07"]
["03-01-03-06",4,null,13,3,1,3,6,"03","01","03","06"]
["03-01-04-05",4,null,13,3,1,4,5,"03","01","04","05"]
["03-01-05-04",4,null,13,3,1,5,4,"03","01","05","04"]
["03-01-06-03",4,null,13,3,1,6,3,"03","01","06","03"]
["03-01-07-02",4,null,13,3,1,7,2,"03","01","07","02"]
["03-01-08-01",4,null,13,3,1,8,1,"03","01","08","01"]
["03-01-09-00",4,null,13,3,1,9,0,"03","01","09","00"]
["03-02-00-08",4,null,13,3,2,0,8,"03","02","00","08"]
["03-02-01-07",4,null,13,3,2,1,7,"03","02","01","07"]
[{"$f":"I2119&\"-\"&J2119&\"-\"&K2119&\"-\"&L2119","v":"03-02-02-06"},4,null,13,3,2,2,6,"03","02","02","06"]
["03-02-03-05",4,null,13,3,2,3,5,{"$f":"IF(LEN(E2120)=1,0&E2120,IF(LEN(E2120)=0,\"00\",RIGHT(E2120,2)))","v":"03"},{"$f":"IF(LEN(F2120)=1,0&F2120,IF(LEN(F2120)=0,\"00\",RIGHT(F2120,2)))","v":"02"},{"$f":"IF(LEN(G2120)=1,0&G2120,IF(LEN(G2120)=0,\"00\",RIGHT(G2120,2)))","v":"03"},{"$f":"IF(LEN(H2120)=1,0&H2120,IF(LEN(H2120)=0,\"00\",RIGHT(H2120,2)))","v":"05"}]
["03-02-04-04",4,null,13,3,2,4,4,"03","02","04","04"]
["03-02-05-03",4,null,13,3,2,5,3,"03","02","05","03"]
["03-02-06-02",4,null,13,3,2,6,2,"03","02","06","02"]
["03-02-07-01",4,null,13,3,2,7,1,"03","02","07","01"]
["03-02-08-00",4,null,13,3,2,8,0,"03","02","08","00"]
["03-03-00-07",4,null,13,3,3,0,7,"03","03","00","07"]
["03-03-01-06",4,null,13,3,3,1,6,"03","03","01","06"]
["03-03-02-05",4,null,13,3,3,2,5,"03","03","02","05"]
["03-03-03-04",4,null,13,3,3,3,4,"03","03","03","04"]
["03-03-04-03",4,null,13,3,3,4,3,"03","03","04","03"]
["03-03-05-02",4,null,13,3,3,5,2,"03","03","05","02"]
["03-03-06-01",4,null,13,3,3,6,1,"03","03","06","01"]
["03-03-07-00",4,null,13,3,3,7,0,"03","03","07","00"]
["03-04-00-06",3,null,13,3,4,0,6,"03","04","00","06"]
["03-04-01-05",3,null,13,3,4,1,5,"03","04","01","05"]
["03-04-02-04",3,null,13,3,4,2,4,"03","04","02","04"]
["03-04-03-03",3,null,13,3,4,3,3,"03","04","03","03"]
["03-04-04-02",3,null,13,3,4,4,2,"03","04","04","02"]
["03-04-05-01",3,null,13,3,4,5,1,"03","04","05","01"]
["03-04-06-00",3,null,13,3,4,6,0,"03","04","06","00"]
["03-05-00-05",3,null,13,3,5,0,5,"03","05","00","05"]
["03-05-01-04",3,null,13,3,5,1,4,"03","05","01","04"]
["03-05-02-03",3,null,13,3,5,2,3,"03","05","02","03"]
["03-05-03-02",3,null,13,3,5,3,2,"03","05","03","02"]
["03-05-04-01",3,null,13,3,5,4,1,"03","05","04","01"]
["03-05-05-00",3,null,13,3,5,5,0,"03","05","05","00"]
["03-06-00-04",3,null,13,3,6,0,4,"03","06","00","04"]
["03-06-01-03",3,null,13,3,6,1,3,"03","06","01","03"]
["03-06-02-02",3,null,13,3,6,2,2,"03","06","02","02"]
["03-06-03-01",3,null,13,3,6,3,1,"03","06","03","01"]
["03-06-04-00",3,null,13,3,6,4,0,"03","06","04","00"]
["03-07-00-03",3,null,13,3,7,0,3,"03","07","00","03"]
["03-07-01-02",2,null,13,3,7,1,2,"03","07","01","02"]
["03-07-02-01",2,null,13,3,7,2,1,"03","07","02","01"]
["03-07-03-00",2,null,13,3,7,3,0,"03","07","03","00"]
["03-08-00-02",2,null,13,3,8,0,2,"03","08","00","02"]
["03-08-01-01",2,null,13,3,8,1,1,"03","08","01","01"]
["03-08-02-00",2,null,13,3,8,2,0,"03","08","02","00"]
["03-09-00-01",2,null,13,3,9,0,1,"03","09","00","01"]
["03-09-01-00",2,null,13,3,9,1,0,"03","09","01","00"]
["03-10-00-00",2,null,13,3,10,0,0,"03","10","00","00"]
["04-00-00-09",4,null,13,4,0,0,9,"04","00","00","09"]
["04-00-01-08",4,null,13,4,0,1,8,"04","00","01","08"]
["04-00-02-07",4,null,13,4,0,2,7,"04","00","02","07"]
["04-00-03-06",4,null,13,4,0,3,6,"04","00","03","06"]
["04-00-04-05",4,null,13,4,0,4,5,"04","00","04","05"]
["04-00-05-04",4,null,13,4,0,5,4,"04","00","05","04"]
["04-00-06-03",4,null,13,4,0,6,3,"04","00","06","03"]
["04-00-07-02",4,null,13,4,0,7,2,"04","00","07","02"]
["04-00-08-01",4,null,13,4,0,8,1,"04","00","08","01"]
["04-00-09-00",4,null,13,4,0,9,0,"04","00","09","00"]
["04-01-00-08",4,null,13,4,1,0,8,"04","01","00","08"]
["04-01-01-07",4,null,13,4,1,1,7,"04","01","01","07"]
["04-01-02-06",4,null,13,4,1,2,6,"04","01","02","06"]
["04-01-03-05",4,null,13,4,1,3,5,"04","01","03","05"]
["04-01-04-04",4,null,13,4,1,4,4,"04","01","04","04"]
["04-01-05-03",4,null,13,4,1,5,3,"04","01","05","03"]
["04-01-06-02",4,null,13,4,1,6,2,"04","01","06","02"]
["04-01-07-01",4,null,13,4,1,7,1,"04","01","07","01"]
["04-01-08-00",4,null,13,4,1,8,0,"04","01","08","00"]
["04-02-00-07",4,null,13,4,2,0,7,"04","02","00","07"]
["04-02-01-06",4,null,13,4,2,1,6,"04","02","01","06"]
[{"$f":"I2183&\"-\"&J2183&\"-\"&K2183&\"-\"&L2183","v":"04-02-02-05"},4,null,13,4,2,2,5,"04","02","02","05"]
["04-02-03-04",4,null,13,4,2,3,4,{"$f":"IF(LEN(E2184)=1,0&E2184,IF(LEN(E2184)=0,\"00\",RIGHT(E2184,2)))","v":"04"},{"$f":"IF(LEN(F2184)=1,0&F2184,IF(LEN(F2184)=0,\"00\",RIGHT(F2184,2)))","v":"02"},{"$f":"IF(LEN(G2184)=1,0&G2184,IF(LEN(G2184)=0,\"00\",RIGHT(G2184,2)))","v":"03"},{"$f":"IF(LEN(H2184)=1,0&H2184,IF(LEN(H2184)=0,\"00\",RIGHT(H2184,2)))","v":"04"}]
["04-02-04-03",4,null,13,4,2,4,3,"04","02","04","03"]
["04-02-05-02",4,null,13,4,2,5,2,"04","02","05","02"]
["04-02-06-01",4,null,13,4,2,6,1,"04","02","06","01"]
["04-02-07-00",4,null,13,4,2,7,0,"04","02","07","00"]
["04-03-00-06",3,null,13,4,3,0,6,"04","03","00","06"]
["04-03-01-05",3,null,13,4,3,1,5,"04","03","01","05"]
["04-03-02-04",3,null,13,4,3,2,4,"04","03","02","04"]
["04-03-03-03",3,null,13,4,3,3,3,"04","03","03","03"]
["04-03-04-02",3,null,13,4,3,4,2,"04","03","04","02"]
["04-03-05-01",3,null,13,4,3,5,1,"04","03","05","01"]
["04-03-06-00",3,null,13,4,3,6,0,"04","03","06","00"]
["04-04-00-05",3,null,13,4,4,0,5,"04","04","00","05"]
["04-04-01-04",3,null,13,4,4,1,4,"04","04","01","04"]
["04-04-02-03",3,null,13,4,4,2,3,"04","04","02","03"]
["04-04-03-02",3,null,13,4,4,3,2,"04","04","03","02"]
["04-04-04-01",3,null,13,4,4,4,1,"04","04","04","01"]
["04-04-05-00",3,null,13,4,4,5,0,"04","04","05","00"]
["04-05-00-04",3,null,13,4,5,0,4,"04","05","00","04"]
["04-05-01-03",3,null,13,4,5,1,3,"04","05","01","03"]
["04-05-02-02",3,null,13,4,5,2,2,"04","05","02","02"]
["04-05-03-01",3,null,13,4,5,3,1,"04","05","03","01"]
["04-05-04-00",3,null,13,4,5,4,0,"04","05","04","00"]
["04-06-00-03",3,null,13,4,6,0,3,"04","06","00","03"]
["04-06-01-02",2,null,13,4,6,1,2,"04","06","01","02"]
["04-06-02-01",2,null,13,4,6,2,1,"04","06","02","01"]
["04-06-03-00",2,null,13,4,6,3,0,"04","06","03","00"]
["04-07-00-02",2,null,13,4,7,0,2,"04","07","00","02"]
["04-07-01-01",2,null,13,4,7,1,1,"04","07","01","01"]
["04-07-02-00",2,null,13,4,7,2,0,"04","07","02","00"]
["04-08-00-01",2,null,13,4,8,0,1,"04","08","00","01"]
["04-08-01-00",2,null,13,4,8,1,0,"04","08","01","00"]
["04-09-00-00",2,null,13,4,9,0,0,"04","09","00","00"]
["05-00-00-08",4,null,13,5,0,0,8,"05","00","00","08"]
["05-00-01-07",4,null,13,5,0,1,7,"05","00","01","07"]
["05-00-02-06",4,null,13,5,0,2,6,"05","00","02","06"]
["05-00-03-05",4,null,13,5,0,3,5,"05","00","03","05"]
["05-00-04-04",4,null,13,5,0,4,4,"05","00","04","04"]
["05-00-05-03",4,null,13,5,0,5,3,"05","00","05","03"]
["05-00-06-02",4,null,13,5,0,6,2,"05","00","06","02"]
["05-00-07-01",4,null,13,5,0,7,1,"05","00","07","01"]
["05-00-08-00",4,null,13,5,0,8,0,"05","00","08","00"]
["05-01-00-07",4,null,13,5,1,0,7,"05","01","00","07"]
["05-01-01-06",4,null,13,5,1,1,6,"05","01","01","06"]
["05-01-02-05",4,null,13,5,1,2,5,"05","01","02","05"]
["05-01-03-04",4,null,13,5,1,3,4,"05","01","03","04"]
["05-01-04-03",4,null,13,5,1,4,3,"05","01","04","03"]
["05-01-05-02",4,null,13,5,1,5,2,"05","01","05","02"]
["05-01-06-01",4,null,13,5,1,6,1,"05","01","06","01"]
["05-01-07-00",3,null,13,5,1,7,0,"05","01","07","00"]
["05-02-00-06",3,null,13,5,2,0,6,"05","02","00","06"]
["05-02-01-05",3,null,13,5,2,1,5,"05","02","01","05"]
["05-02-02-04",3,null,13,5,2,2,4,"05","02","02","04"]
["05-02-03-03",3,null,13,5,2,3,3,"05","02","03","03"]
["05-02-04-02",3,null,13,5,2,4,2,"05","02","04","02"]
["05-02-05-01",3,null,13,5,2,5,1,"05","02","05","01"]
["05-02-06-00",3,null,13,5,2,6,0,"05","02","06","00"]
["05-03-00-05",3,null,13,5,3,0,5,"05","03","00","05"]
["05-03-01-04",3,null,13,5,3,1,4,"05","03","01","04"]
["05-03-02-03",3,null,13,5,3,2,3,"05","03","02","03"]
["05-03-03-02",3,null,13,5,3,3,2,"05","03","03","02"]
["05-03-04-01",3,null,13,5,3,4,1,"05","03","04","01"]
["05-03-05-00",3,null,13,5,3,5,0,"05","03","05","00"]
[{"$f":"I2247&\"-\"&J2247&\"-\"&K2247&\"-\"&L2247","v":"05-04-00-04"},3,null,13,5,4,0,4,"05","04","00","04"]
["05-04-01-03",3,null,13,5,4,1,3,{"$f":"IF(LEN(E2248)=1,0&E2248,IF(LEN(E2248)=0,\"00\",RIGHT(E2248,2)))","v":"05"},{"$f":"IF(LEN(F2248)=1,0&F2248,IF(LEN(F2248)=0,\"00\",RIGHT(F2248,2)))","v":"04"},{"$f":"IF(LEN(G2248)=1,0&G2248,IF(LEN(G2248)=0,\"00\",RIGHT(G2248,2)))","v":"01"},{"$f":"IF(LEN(H2248)=1,0&H2248,IF(LEN(H2248)=0,\"00\",RIGHT(H2248,2)))","v":"03"}]
["05-04-02-02",3,null,13,5,4,2,2,"05","04","02","02"]
["05-04-03-01",3,null,13,5,4,3,1,"05","04","03","01"]
["05-04-04-00",3,null,13,5,4,4,0,"05","04","04","00"]
["05-05-00-03",3,null,13,5,5,0,3,"05","05","00","03"]
["05-05-01-02",2,null,13,5,5,1,2,"05","05","01","02"]
["05-05-02-01",2,null,13,5,5,2,1,"05","05","02","01"]
["05-05-03-00",2,null,13,5,5,3,0,"05","05","03","00"]
["05-06-00-02",2,null,13,5,6,0,2,"05","06","00","02"]
["05-06-01-01",2,null,13,5,6,1,1,"05","06","01","01"]
["05-06-02-00",2,null,13,5,6,2,0,"05","06","02","00"]
["05-07-00-01",2,null,13,5,7,0,1,"05","07","00","01"]
["05-07-01-00",2,null,13,5,7,1,0,"05","07","01","00"]
["05-08-00-00",2,null,13,5,8,0,0,"05","08","00","00"]
["06-00-00-07",4,null,13,6,0,0,7,"06","00","00","07"]
["06-00-01-06",4,null,13,6,0,1,6,"06","00","01","06"]
["06-00-02-05",4,null,13,6,0,2,5,"06","00","02","05"]
["06-00-03-04",4,null,13,6,0,3,4,"06","00","03","04"]
["06-00-04-03",4,null,13,6,0,4,3,"06","00","04","03"]
["06-00-05-02",3,null,13,6,0,5,2,"06","00","05","02"]
["06-00-06-01",3,null,13,6,0,6,1,"06","00","06","01"]
["06-00-07-00",3,null,13,6,0,7,0,"06","00","07","00"]
["06-01-00-06",3,null,13,6,1,0,6,"06","01","00","06"]
["06-01-01-05",3,null,13,6,1,1,5,"06","01","01","05"]
["06-01-02-04",3,null,13,6,1,2,4,"06","01","02","04"]
["06-01-03-03",3,null,13,6,1,3,3,"06","01","03","03"]
["06-01-04-02",3,null,13,6,1,4,2,"06","01","04","02"]
["06-01-05-01",3,null,13,6,1,5,1,"06","01","05","01"]
["06-01-06-00",3,null,13,6,1,6,0,"06","01","06","00"]
["06-02-00-05",3,null,13,6,2,0,5,"06","02","00","05"]
["06-02-01-04",3,null,13,6,2,1,4,"06","02","01","04"]
["06-02-02-03",3,null,13,6,2,2,3,"06","02","02","03"]
["06-02-03-02",3,null,13,6,2,3,2,"06","02","03","02"]
["06-02-04-01",3,null,13,6,2,4,1,"06","02","04","01"]
["06-02-05-00",3,null,13,6,2,5,0,"06","02","05","00"]
["06-03-00-04",3,null,13,6,3,0,4,"06","03","00","04"]
["06-03-01-03",3,null,13,6,3,1,3,"06","03","01","03"]
["06-03-02-02",3,null,13,6,3,2,2,"06","03","02","02"]
["06-03-03-01",3,null,13,6,3,3,1,"06","03","03","01"]
["06-03-04-00",3,null,13,6,3,4,0,"06","03","04","00"]
["06-04-00-03",3,null,13,6,4,0,3,"06","04","00","03"]
["06-04-01-02",2,null,13,6,4,1,2,"06","04","01","02"]
["06-04-02-01",2,null,13,6,4,2,1,"06","04","02","01"]
["06-04-03-00",2,null,13,6,4,3,0,"06","04","03","00"]
["06-05-00-02",2,null,13,6,5,0,2,"06","05","00","02"]
["06-05-01-01",2,null,13,6,5,1,1,"06","05","01","01"]
["06-05-02-00",2,null,13,6,5,2,0,"06","05","02","00"]
["06-06-00-01",2,null,13,6,6,0,1,"06","06","00","01"]
["06-06-01-00",2,null,13,6,6,1,0,"06","06","01","00"]
["06-07-00-00",2,null,13,6,7,0,0,"06","07","00","00"]
["07-00-00-06",3,null,13,7,0,0,6,"07","00","00","06"]
["07-00-01-05",3,null,13,7,0,1,5,"07","00","01","05"]
["07-00-02-04",3,null,13,7,0,2,4,"07","00","02","04"]
["07-00-03-03",3,null,13,7,0,3,3,"07","00","03","03"]
["07-00-04-02",3,null,13,7,0,4,2,"07","00","04","02"]
["07-00-05-01",3,null,13,7,0,5,1,"07","00","05","01"]
["07-00-06-00",3,null,13,7,0,6,0,"07","00","06","00"]
["07-01-00-05",3,null,13,7,1,0,5,"07","01","00","05"]
["07-01-01-04",3,null,13,7,1,1,4,"07","01","01","04"]
["07-01-02-03",3,null,13,7,1,2,3,"07","01","02","03"]
["07-01-03-02",3,null,13,7,1,3,2,"07","01","03","02"]
["07-01-04-01",3,null,13,7,1,4,1,"07","01","04","01"]
["07-01-05-00",3,null,13,7,1,5,0,"07","01","05","00"]
[{"$f":"I2311&\"-\"&J2311&\"-\"&K2311&\"-\"&L2311","v":"07-02-00-04"},3,null,13,7,2,0,4,"07","02","00","04"]
["07-02-01-03",3,null,13,7,2,1,3,{"$f":"IF(LEN(E2312)=1,0&E2312,IF(LEN(E2312)=0,\"00\",RIGHT(E2312,2)))","v":"07"},{"$f":"IF(LEN(F2312)=1,0&F2312,IF(LEN(F2312)=0,\"00\",RIGHT(F2312,2)))","v":"02"},{"$f":"IF(LEN(G2312)=1,0&G2312,IF(LEN(G2312)=0,\"00\",RIGHT(G2312,2)))","v":"01"},{"$f":"IF(LEN(H2312)=1,0&H2312,IF(LEN(H2312)=0,\"00\",RIGHT(H2312,2)))","v":"03"}]
["07-02-02-02",3,null,13,7,2,2,2,"07","02","02","02"]
["07-02-03-01",3,null,13,7,2,3,1,"07","02","03","01"]
["07-02-04-00",3,null,13,7,2,4,0,"07","02","04","00"]
["07-03-00-03",3,null,13,7,3,0,3,"07","03","00","03"]
["07-03-01-02",2,null,13,7,3,1,2,"07","03","01","02"]
["07-03-02-01",2,null,13,7,3,2,1,"07","03","02","01"]
["07-03-03-00",2,null,13,7,3,3,0,"07","03","03","00"]
["07-04-00-02",2,null,13,7,4,0,2,"07","04","00","02"]
["07-04-01-01",2,null,13,7,4,1,1,"07","04","01","01"]
["07-04-02-00",2,null,13,7,4,2,0,"07","04","02","00"]
["07-05-00-01",2,null,13,7,5,0,1,"07","05","00","01"]
["07-05-01-00",2,null,13,7,5,1,0,"07","05","01","00"]
["07-06-00-00",2,null,13,7,6,0,0,"07","06","00","00"]
["08-00-00-05",3,null,13,8,0,0,5,"08","00","00","05"]
["08-00-01-04",3,null,13,8,0,1,4,"08","00","01","04"]
["08-00-02-03",3,null,13,8,0,2,3,"08","00","02","03"]
["08-00-03-02",3,null,13,8,0,3,2,"08","00","03","02"]
["08-00-04-01",3,null,13,8,0,4,1,"08","00","04","01"]
["08-00-05-00",3,null,13,8,0,5,0,"08","00","05","00"]
["08-01-00-04",3,null,13,8,1,0,4,"08","01","00","04"]
["08-01-01-03",3,null,13,8,1,1,3,"08","01","01","03"]
["08-01-02-02",3,null,13,8,1,2,2,"08","01","02","02"]
["08-01-03-01",3,null,13,8,1,3,1,"08","01","03","01"]
["08-01-04-00",3,null,13,8,1,4,0,"08","01","04","00"]
["08-02-00-03",3,null,13,8,2,0,3,"08","02","00","03"]
["08-02-01-02",2,null,13,8,2,1,2,"08","02","01","02"]
["08-02-02-01",2,null,13,8,2,2,1,"08","02","02","01"]
["08-02-03-00",2,null,13,8,2,3,0,"08","02","03","00"]
["08-03-00-02",2,null,13,8,3,0,2,"08","03","00","02"]
["08-03-01-01",2,null,13,8,3,1,1,"08","03","01","01"]
["08-03-02-00",2,null,13,8,3,2,0,"08","03","02","00"]
["08-04-00-01",2,null,13,8,4,0,1,"08","04","00","01"]
["08-04-01-00",2,null,13,8,4,1,0,"08","04","01","00"]
["08-05-00-00",2,null,13,8,5,0,0,"08","05","00","00"]
["09-00-00-04",3,null,13,9,0,0,4,"09","00","00","04"]
["09-00-01-03",3,null,13,9,0,1,3,"09","00","01","03"]
["09-00-02-02",3,null,13,9,0,2,2,"09","00","02","02"]
["09-00-03-01",3,null,13,9,0,3,1,"09","00","03","01"]
["09-00-04-00",3,null,13,9,0,4,0,"09","00","04","00"]
["09-01-00-03",3,null,13,9,1,0,3,"09","01","00","03"]
["09-01-01-02",2,null,13,9,1,1,2,"09","01","01","02"]
["09-01-02-01",2,null,13,9,1,2,1,"09","01","02","01"]
["09-01-03-00",2,null,13,9,1,3,0,"09","01","03","00"]
["09-02-00-02",2,null,13,9,2,0,2,"09","02","00","02"]
["09-02-01-01",2,null,13,9,2,1,1,"09","02","01","01"]
["09-02-02-00",2,null,13,9,2,2,0,"09","02","02","00"]
["09-03-00-01",2,null,13,9,3,0,1,"09","03","00","01"]
["09-03-01-00",2,null,13,9,3,1,0,"09","03","01","00"]
["09-04-00-00",2,null,13,9,4,0,0,"09","04","00","00"]
["10-00-00-03",3,null,13,10,0,0,3,"10","00","00","03"]
["10-00-01-02",2,null,13,10,0,1,2,"10","00","01","02"]
["10-00-02-01",2,null,13,10,0,2,1,"10","00","02","01"]
["10-00-03-00",2,null,13,10,0,3,0,"10","00","03","00"]
["10-01-00-02",2,null,13,10,1,0,2,"10","01","00","02"]
["10-01-01-01",2,null,13,10,1,1,1,"10","01","01","01"]
["10-01-02-00",2,null,13,10,1,2,0,"10","01","02","00"]
["10-02-00-01",2,null,13,10,2,0,1,"10","02","00","01"]
["10-02-01-00",2,null,13,10,2,1,0,"10","02","01","00"]
["10-03-00-00",2,null,13,10,3,0,0,"10","03","00","00"]
["11-00-00-02",2,null,13,11,0,0,2,"11","00","00","02"]
["11-00-01-01",2,null,13,11,0,1,1,"11","00","01","01"]
["11-00-02-00",2,null,13,11,0,2,0,"11","00","02","00"]
[{"$f":"I2375&\"-\"&J2375&\"-\"&K2375&\"-\"&L2375","v":"11-01-00-01"},2,null,13,11,1,0,1,"11","01","00","01"]
["11-01-01-00",2,null,13,11,1,1,0,{"$f":"IF(LEN(E2376)=1,0&E2376,IF(LEN(E2376)=0,\"00\",RIGHT(E2376,2)))","v":"11"},{"$f":"IF(LEN(F2376)=1,0&F2376,IF(LEN(F2376)=0,\"00\",RIGHT(F2376,2)))","v":"01"},{"$f":"IF(LEN(G2376)=1,0&G2376,IF(LEN(G2376)=0,\"00\",RIGHT(G2376,2)))","v":"01"},{"$f":"IF(LEN(H2376)=1,0&H2376,IF(LEN(H2376)=0,\"00\",RIGHT(H2376,2)))","v":"00"}]
["11-02-00-00",2,null,13,11,2,0,0,"11","02","00","00"]
["12-00-00-01",2,null,13,12,0,0,1,"12","00","00","01"]
["12-00-01-00",2,null,13,12,0,1,0,"12","00","01","00"]
["12-01-00-00",2,null,13,12,1,0,0,"12","01","00","00"]
["13-00-00-00",1,null,13,13,0,0,0,"13","00","00","00"]
["00-00-00-14",7,null,14,0,0,0,14,"00","00","00","14"]
["00-00-01-13",6,null,14,0,0,1,13,"00","00","01","13"]
["00-00-02-12",6,null,14,0,0,2,12,"00","00","02","12"]
["00-00-03-11",6,null,14,0,0,3,11,"00","00","03","11"]
["00-00-04-10",6,null,14,0,0,4,10,"00","00","04","10"]
["00-00-05-09",6,null,14,0,0,5,9,"00","00","05","09"]
["00-00-06-08",6,null,14,0,0,6,8,"00","00","06","08"]
["00-00-07-07",6,null,14,0,0,7,7,"00","00","07","07"]
["00-00-08-06",5,null,14,0,0,8,6,"00","00","08","06"]
["00-00-09-05",5,null,14,0,0,9,5,"00","00","09","05"]
["00-00-10-04",5,null,14,0,0,10,4,"00","00","10","04"]
["00-00-11-03",5,null,14,0,0,11,3,"00","00","11","03"]
["00-00-12-02",4,null,14,0,0,12,2,"00","00","12","02"]
["00-00-13-01",4,null,14,0,0,13,1,"00","00","13","01"]
["00-00-14-00",4,null,14,0,0,14,0,"00","00","14","00"]
["00-01-00-13",5,null,14,0,1,0,13,"00","01","00","13"]
["00-01-01-12",5,null,14,0,1,1,12,"00","01","01","12"]
["00-01-02-11",5,null,14,0,1,2,11,"00","01","02","11"]
["00-01-03-10",5,null,14,0,1,3,10,"00","01","03","10"]
["00-01-04-09",5,null,14,0,1,4,9,"00","01","04","09"]
["00-01-05-08",5,null,14,0,1,5,8,"00","01","05","08"]
["00-01-06-07",5,null,14,0,1,6,7,"00","01","06","07"]
["00-01-07-06",5,null,14,0,1,7,6,"00","01","07","06"]
["00-01-08-05",5,null,14,0,1,8,5,"00","01","08","05"]
["00-01-09-04",5,null,14,0,1,9,4,"00","01","09","04"]
["00-01-10-03",5,null,14,0,1,10,3,"00","01","10","03"]
["00-01-11-02",4,null,14,0,1,11,2,"00","01","11","02"]
["00-01-12-01",4,null,14,0,1,12,1,"00","01","12","01"]
["00-01-13-00",4,null,14,0,1,13,0,"00","01","13","00"]
["00-02-00-12",5,null,14,0,2,0,12,"00","02","00","12"]
["00-02-01-11",5,null,14,0,2,1,11,"00","02","01","11"]
["00-02-02-10",5,null,14,0,2,2,10,"00","02","02","10"]
["00-02-03-09",5,null,14,0,2,3,9,"00","02","03","09"]
["00-02-04-08",5,null,14,0,2,4,8,"00","02","04","08"]
["00-02-05-07",5,null,14,0,2,5,7,"00","02","05","07"]
["00-02-06-06",5,null,14,0,2,6,6,"00","02","06","06"]
["00-02-07-05",5,null,14,0,2,7,5,"00","02","07","05"]
["00-02-08-04",5,null,14,0,2,8,4,"00","02","08","04"]
["00-02-09-03",5,null,14,0,2,9,3,"00","02","09","03"]
["00-02-10-02",4,null,14,0,2,10,2,"00","02","10","02"]
["00-02-11-01",4,null,14,0,2,11,1,"00","02","11","01"]
["00-02-12-00",4,null,14,0,2,12,0,"00","02","12","00"]
["00-03-00-11",5,null,14,0,3,0,11,"00","03","00","11"]
["00-03-01-10",5,null,14,0,3,1,10,"00","03","01","10"]
["00-03-02-09",5,null,14,0,3,2,9,"00","03","02","09"]
["00-03-03-08",5,null,14,0,3,3,8,"00","03","03","08"]
["00-03-04-07",5,null,14,0,3,4,7,"00","03","04","07"]
["00-03-05-06",5,null,14,0,3,5,6,"00","03","05","06"]
["00-03-06-05",5,null,14,0,3,6,5,"00","03","06","05"]
["00-03-07-04",5,null,14,0,3,7,4,"00","03","07","04"]
["00-03-08-03",5,null,14,0,3,8,3,"00","03","08","03"]
["00-03-09-02",4,null,14,0,3,9,2,"00","03","09","02"]
["00-03-10-01",4,null,14,0,3,10,1,"00","03","10","01"]
["00-03-11-00",4,null,14,0,3,11,0,"00","03","11","00"]
["00-04-00-10",5,null,14,0,4,0,10,"00","04","00","10"]
["00-04-01-09",5,null,14,0,4,1,9,"00","04","01","09"]
["00-04-02-08",5,null,14,0,4,2,8,"00","04","02","08"]
[{"$f":"I2439&\"-\"&J2439&\"-\"&K2439&\"-\"&L2439","v":"00-04-03-07"},5,null,14,0,4,3,7,"00","04","03","07"]
["00-04-04-06",5,null,14,0,4,4,6,{"$f":"IF(LEN(E2440)=1,0&E2440,IF(LEN(E2440)=0,\"00\",RIGHT(E2440,2)))","v":"00"},{"$f":"IF(LEN(F2440)=1,0&F2440,IF(LEN(F2440)=0,\"00\",RIGHT(F2440,2)))","v":"04"},{"$f":"IF(LEN(G2440)=1,0&G2440,IF(LEN(G2440)=0,\"00\",RIGHT(G2440,2)))","v":"04"},{"$f":"IF(LEN(H2440)=1,0&H2440,IF(LEN(H2440)=0,\"00\",RIGHT(H2440,2)))","v":"06"}]
["00-04-05-05",5,null,14,0,4,5,5,"00","04","05","05"]
["00-04-06-04",5,null,14,0,4,6,4,"00","04","06","04"]
["00-04-07-03",5,null,14,0,4,7,3,"00","04","07","03"]
["00-04-08-02",4,null,14,0,4,8,2,"00","04","08","02"]
["00-04-09-01",4,null,14,0,4,9,1,"00","04","09","01"]
["00-04-10-00",4,null,14,0,4,10,0,"00","04","10","00"]
["00-05-00-09",5,null,14,0,5,0,9,"00","05","00","09"]
["00-05-01-08",5,null,14,0,5,1,8,"00","05","01","08"]
["00-05-02-07",5,null,14,0,5,2,7,"00","05","02","07"]
["00-05-03-06",5,null,14,0,5,3,6,"00","05","03","06"]
["00-05-04-05",5,null,14,0,5,4,5,"00","05","04","05"]
["00-05-05-04",4,null,14,0,5,5,4,"00","05","05","04"]
["00-05-06-03",4,null,14,0,5,6,3,"00","05","06","03"]
["00-05-07-02",4,null,14,0,5,7,2,"00","05","07","02"]
["00-05-08-01",4,null,14,0,5,8,1,"00","05","08","01"]
["00-05-09-00",4,null,14,0,5,9,0,"00","05","09","00"]
["00-06-00-08",5,null,14,0,6,0,8,"00","06","00","08"]
["00-06-01-07",5,null,14,0,6,1,7,"00","06","01","07"]
["00-06-02-06",5,null,14,0,6,2,6,"00","06","02","06"]
["00-06-03-05",4,null,14,0,6,3,5,"00","06","03","05"]
["00-06-04-04",4,null,14,0,6,4,4,"00","06","04","04"]
["00-06-05-03",4,null,14,0,6,5,3,"00","06","05","03"]
["00-06-06-02",4,null,14,0,6,6,2,"00","06","06","02"]
["00-06-07-01",4,null,14,0,6,7,1,"00","06","07","01"]
["00-06-08-00",4,null,14,0,6,8,0,"00","06","08","00"]
["00-07-00-07",4,null,14,0,7,0,7,"00","07","00","07"]
["00-07-01-06",4,null,14,0,7,1,6,"00","07","01","06"]
["00-07-02-05",4,null,14,0,7,2,5,"00","07","02","05"]
["00-07-03-04",4,null,14,0,7,3,4,"00","07","03","04"]
["00-07-04-03",4,null,14,0,7,4,3,"00","07","04","03"]
["00-07-05-02",4,null,14,0,7,5,2,"00","07","05","02"]
["00-07-06-01",4,null,14,0,7,6,1,"00","07","06","01"]
["00-07-07-00",4,null,14,0,7,7,0,"00","07","07","00"]
["00-08-00-06",3,null,14,0,8,0,6,"00","08","00","06"]
["00-08-01-05",3,null,14,0,8,1,5,"00","08","01","05"]
["00-08-02-04",3,null,14,0,8,2,4,"00","08","02","04"]
["00-08-03-03",3,null,14,0,8,3,3,"00","08","03","03"]
["00-08-04-02",3,null,14,0,8,4,2,"00","08","04","02"]
["00-08-05-01",3,null,14,0,8,5,1,"00","08","05","01"]
["00-08-06-00",3,null,14,0,8,6,0,"00","08","06","00"]
["00-09-00-05",3,null,14,0,9,0,5,"00","09","00","05"]
["00-09-01-04",3,null,14,0,9,1,4,"00","09","01","04"]
["00-09-02-03",3,null,14,0,9,2,3,"00","09","02","03"]
["00-09-03-02",3,null,14,0,9,3,2,"00","09","03","02"]
["00-09-04-01",3,null,14,0,9,4,1,"00","09","04","01"]
["00-09-05-00",3,null,14,0,9,5,0,"00","09","05","00"]
["00-10-00-04",3,null,14,0,10,0,4,"00","10","00","04"]
["00-10-01-03",3,null,14,0,10,1,3,"00","10","01","03"]
["00-10-02-02",3,null,14,0,10,2,2,"00","10","02","02"]
["00-10-03-01",3,null,14,0,10,3,1,"00","10","03","01"]
["00-10-04-00",3,null,14,0,10,4,0,"00","10","04","00"]
["00-11-00-03",3,null,14,0,11,0,3,"00","11","00","03"]
["00-11-01-02",3,null,14,0,11,1,2,"00","11","01","02"]
["00-11-02-01",3,null,14,0,11,2,1,"00","11","02","01"]
["00-11-03-00",3,null,14,0,11,3,0,"00","11","03","00"]
["00-12-00-02",3,null,14,0,12,0,2,"00","12","00","02"]
["00-12-01-01",3,null,14,0,12,1,1,"00","12","01","01"]
["00-12-02-00",2,null,14,0,12,2,0,"00","12","02","00"]
["00-13-00-01",2,null,14,0,13,0,1,"00","13","00","01"]
["00-13-01-00",2,null,14,0,13,1,0,"00","13","01","00"]
["00-14-00-00",2,null,14,0,14,0,0,"00","14","00","00"]
["01-00-00-13",5,null,14,1,0,0,13,"01","00","00","13"]
[{"$f":"I2503&\"-\"&J2503&\"-\"&K2503&\"-\"&L2503","v":"01-00-01-12"},5,null,14,1,0,1,12,"01","00","01","12"]
["01-00-02-11",5,null,14,1,0,2,11,{"$f":"IF(LEN(E2504)=1,0&E2504,IF(LEN(E2504)=0,\"00\",RIGHT(E2504,2)))","v":"01"},{"$f":"IF(LEN(F2504)=1,0&F2504,IF(LEN(F2504)=0,\"00\",RIGHT(F2504,2)))","v":"00"},{"$f":"IF(LEN(G2504)=1,0&G2504,IF(LEN(G2504)=0,\"00\",RIGHT(G2504,2)))","v":"02"},{"$f":"IF(LEN(H2504)=1,0&H2504,IF(LEN(H2504)=0,\"00\",RIGHT(H2504,2)))","v":"11"}]
["01-00-03-10",5,null,14,1,0,3,10,"01","00","03","10"]
["01-00-04-09",5,null,14,1,0,4,9,"01","00","04","09"]
["01-00-05-08",5,null,14,1,0,5,8,"01","00","05","08"]
["01-00-06-07",5,null,14,1,0,6,7,"01","00","06","07"]
["01-00-07-06",5,null,14,1,0,7,6,"01","00","07","06"]
["01-00-08-05",5,null,14,1,0,8,5,"01","00","08","05"]
["01-00-09-04",5,null,14,1,0,9,4,"01","00","09","04"]
["01-00-10-03",5,null,14,1,0,10,3,"01","00","10","03"]
["01-00-11-02",4,null,14,1,0,11,2,"01","00","11","02"]
["01-00-12-01",4,null,14,1,0,12,1,"01","00","12","01"]
["01-00-13-00",4,null,14,1,0,13,0,"01","00","13","00"]
["01-01-00-12",5,null,14,1,1,0,12,"01","01","00","12"]
["01-01-01-11",5,null,14,1,1,1,11,"01","01","01","11"]
["01-01-02-10",5,null,14,1,1,2,10,"01","01","02","10"]
["01-01-03-09",5,null,14,1,1,3,9,"01","01","03","09"]
["01-01-04-08",5,null,14,1,1,4,8,"01","01","04","08"]
["01-01-05-07",5,null,14,1,1,5,7,"01","01","05","07"]
["01-01-06-06",5,null,14,1,1,6,6,"01","01","06","06"]
["01-01-07-05",5,null,14,1,1,7,5,"01","01","07","05"]
["01-01-08-04",5,null,14,1,1,8,4,"01","01","08","04"]
["01-01-09-03",5,null,14,1,1,9,3,"01","01","09","03"]
["01-01-10-02",4,null,14,1,1,10,2,"01","01","10","02"]
["01-01-11-01",4,null,14,1,1,11,1,"01","01","11","01"]
["01-01-12-00",4,null,14,1,1,12,0,"01","01","12","00"]
["01-02-00-11",5,null,14,1,2,0,11,"01","02","00","11"]
["01-02-01-10",5,null,14,1,2,1,10,"01","02","01","10"]
["01-02-02-09",5,null,14,1,2,2,9,"01","02","02","09"]
["01-02-03-08",5,null,14,1,2,3,8,"01","02","03","08"]
["01-02-04-07",5,null,14,1,2,4,7,"01","02","04","07"]
["01-02-05-06",5,null,14,1,2,5,6,"01","02","05","06"]
["01-02-06-05",5,null,14,1,2,6,5,"01","02","06","05"]
["01-02-07-04",5,null,14,1,2,7,4,"01","02","07","04"]
["01-02-08-03",5,null,14,1,2,8,3,"01","02","08","03"]
["01-02-09-02",4,null,14,1,2,9,2,"01","02","09","02"]
["01-02-10-01",4,null,14,1,2,10,1,"01","02","10","01"]
["01-02-11-00",4,null,14,1,2,11,0,"01","02","11","00"]
["01-03-00-10",5,null,14,1,3,0,10,"01","03","00","10"]
["01-03-01-09",5,null,14,1,3,1,9,"01","03","01","09"]
["01-03-02-08",5,null,14,1,3,2,8,"01","03","02","08"]
["01-03-03-07",5,null,14,1,3,3,7,"01","03","03","07"]
["01-03-04-06",5,null,14,1,3,4,6,"01","03","04","06"]
["01-03-05-05",5,null,14,1,3,5,5,"01","03","05","05"]
["01-03-06-04",4,null,14,1,3,6,4,"01","03","06","04"]
["01-03-07-03",4,null,14,1,3,7,3,"01","03","07","03"]
["01-03-08-02",4,null,14,1,3,8,2,"01","03","08","02"]
["01-03-09-01",4,null,14,1,3,9,1,"01","03","09","01"]
["01-03-10-00",4,null,14,1,3,10,0,"01","03","10","00"]
["01-04-00-09",5,null,14,1,4,0,9,"01","04","00","09"]
["01-04-01-08",5,null,14,1,4,1,8,"01","04","01","08"]
["01-04-02-07",5,null,14,1,4,2,7,"01","04","02","07"]
["01-04-03-06",5,null,14,1,4,3,6,"01","04","03","06"]
["01-04-04-05",4,null,14,1,4,4,5,"01","04","04","05"]
["01-04-05-04",4,null,14,1,4,5,4,"01","04","05","04"]
["01-04-06-03",4,null,14,1,4,6,3,"01","04","06","03"]
["01-04-07-02",4,null,14,1,4,7,2,"01","04","07","02"]
["01-04-08-01",4,null,14,1,4,8,1,"01","04","08","01"]
["01-04-09-00",4,null,14,1,4,9,0,"01","04","09","00"]
["01-05-00-08",5,null,14,1,5,0,8,"01","05","00","08"]
["01-05-01-07",4,null,14,1,5,1,7,"01","05","01","07"]
["01-05-02-06",4,null,14,1,5,2,6,"01","05","02","06"]
["01-05-03-05",4,null,14,1,5,3,5,"01","05","03","05"]
["01-05-04-04",4,null,14,1,5,4,4,"01","05","04","04"]
[{"$f":"I2567&\"-\"&J2567&\"-\"&K2567&\"-\"&L2567","v":"01-05-05-03"},4,null,14,1,5,5,3,"01","05","05","03"]
["01-05-06-02",4,null,14,1,5,6,2,{"$f":"IF(LEN(E2568)=1,0&E2568,IF(LEN(E2568)=0,\"00\",RIGHT(E2568,2)))","v":"01"},{"$f":"IF(LEN(F2568)=1,0&F2568,IF(LEN(F2568)=0,\"00\",RIGHT(F2568,2)))","v":"05"},{"$f":"IF(LEN(G2568)=1,0&G2568,IF(LEN(G2568)=0,\"00\",RIGHT(G2568,2)))","v":"06"},{"$f":"IF(LEN(H2568)=1,0&H2568,IF(LEN(H2568)=0,\"00\",RIGHT(H2568,2)))","v":"02"}]
["01-05-07-01",4,null,14,1,5,7,1,"01","05","07","01"]
["01-05-08-00",4,null,14,1,5,8,0,"01","05","08","00"]
["01-06-00-07",4,null,14,1,6,0,7,"01","06","00","07"]
["01-06-01-06",4,null,14,1,6,1,6,"01","06","01","06"]
["01-06-02-05",4,null,14,1,6,2,5,"01","06","02","05"]
["01-06-03-04",4,null,14,1,6,3,4,"01","06","03","04"]
["01-06-04-03",4,null,14,1,6,4,3,"01","06","04","03"]
["01-06-05-02",4,null,14,1,6,5,2,"01","06","05","02"]
["01-06-06-01",4,null,14,1,6,6,1,"01","06","06","01"]
["01-06-07-00",4,null,14,1,6,7,0,"01","06","07","00"]
["01-07-00-06",3,null,14,1,7,0,6,"01","07","00","06"]
["01-07-01-05",3,null,14,1,7,1,5,"01","07","01","05"]
["01-07-02-04",3,null,14,1,7,2,4,"01","07","02","04"]
["01-07-03-03",3,null,14,1,7,3,3,"01","07","03","03"]
["01-07-04-02",3,null,14,1,7,4,2,"01","07","04","02"]
["01-07-05-01",3,null,14,1,7,5,1,"01","07","05","01"]
["01-07-06-00",3,null,14,1,7,6,0,"01","07","06","00"]
["01-08-00-05",3,null,14,1,8,0,5,"01","08","00","05"]
["01-08-01-04",3,null,14,1,8,1,4,"01","08","01","04"]
["01-08-02-03",3,null,14,1,8,2,3,"01","08","02","03"]
["01-08-03-02",3,null,14,1,8,3,2,"01","08","03","02"]
["01-08-04-01",3,null,14,1,8,4,1,"01","08","04","01"]
["01-08-05-00",3,null,14,1,8,5,0,"01","08","05","00"]
["01-09-00-04",3,null,14,1,9,0,4,"01","09","00","04"]
["01-09-01-03",3,null,14,1,9,1,3,"01","09","01","03"]
["01-09-02-02",3,null,14,1,9,2,2,"01","09","02","02"]
["01-09-03-01",3,null,14,1,9,3,1,"01","09","03","01"]
["01-09-04-00",3,null,14,1,9,4,0,"01","09","04","00"]
["01-10-00-03",3,null,14,1,10,0,3,"01","10","00","03"]
["01-10-01-02",3,null,14,1,10,1,2,"01","10","01","02"]
["01-10-02-01",3,null,14,1,10,2,1,"01","10","02","01"]
["01-10-03-00",2,null,14,1,10,3,0,"01","10","03","00"]
["01-11-00-02",2,null,14,1,11,0,2,"01","11","00","02"]
["01-11-01-01",2,null,14,1,11,1,1,"01","11","01","01"]
["01-11-02-00",2,null,14,1,11,2,0,"01","11","02","00"]
["01-12-00-01",2,null,14,1,12,0,1,"01","12","00","01"]
["01-12-01-00",2,null,14,1,12,1,0,"01","12","01","00"]
["01-13-00-00",2,null,14,1,13,0,0,"01","13","00","00"]
["02-00-00-12",5,null,14,2,0,0,12,"02","00","00","12"]
["02-00-01-11",5,null,14,2,0,1,11,"02","00","01","11"]
["02-00-02-10",5,null,14,2,0,2,10,"02","00","02","10"]
["02-00-03-09",5,null,14,2,0,3,9,"02","00","03","09"]
["02-00-04-08",5,null,14,2,0,4,8,"02","00","04","08"]
["02-00-05-07",5,null,14,2,0,5,7,"02","00","05","07"]
["02-00-06-06",5,null,14,2,0,6,6,"02","00","06","06"]
["02-00-07-05",5,null,14,2,0,7,5,"02","00","07","05"]
["02-00-08-04",5,null,14,2,0,8,4,"02","00","08","04"]
["02-00-09-03",5,null,14,2,0,9,3,"02","00","09","03"]
["02-00-10-02",4,null,14,2,0,10,2,"02","00","10","02"]
["02-00-11-01",4,null,14,2,0,11,1,"02","00","11","01"]
["02-00-12-00",4,null,14,2,0,12,0,"02","00","12","00"]
["02-01-00-11",5,null,14,2,1,0,11,"02","01","00","11"]
["02-01-01-10",5,null,14,2,1,1,10,"02","01","01","10"]
["02-01-02-09",5,null,14,2,1,2,9,"02","01","02","09"]
["02-01-03-08",5,null,14,2,1,3,8,"02","01","03","08"]
["02-01-04-07",5,null,14,2,1,4,7,"02","01","04","07"]
["02-01-05-06",5,null,14,2,1,5,6,"02","01","05","06"]
["02-01-06-05",5,null,14,2,1,6,5,"02","01","06","05"]
["02-01-07-04",4,null,14,2,1,7,4,"02","01","07","04"]
["02-01-08-03",4,null,14,2,1,8,3,"02","01","08","03"]
["02-01-09-02",4,null,14,2,1,9,2,"02","01","09","02"]
["02-01-10-01",4,null,14,2,1,10,1,"02","01","10","01"]
[{"$f":"I2631&\"-\"&J2631&\"-\"&K2631&\"-\"&L2631","v":"02-01-11-00"},4,null,14,2,1,11,0,"02","01","11","00"]
["02-02-00-10",5,null,14,2,2,0,10,{"$f":"IF(LEN(E2632)=1,0&E2632,IF(LEN(E2632)=0,\"00\",RIGHT(E2632,2)))","v":"02"},{"$f":"IF(LEN(F2632)=1,0&F2632,IF(LEN(F2632)=0,\"00\",RIGHT(F2632,2)))","v":"02"},{"$f":"IF(LEN(G2632)=1,0&G2632,IF(LEN(G2632)=0,\"00\",RIGHT(G2632,2)))","v":"00"},{"$f":"IF(LEN(H2632)=1,0&H2632,IF(LEN(H2632)=0,\"00\",RIGHT(H2632,2)))","v":"10"}]
["02-02-01-09",5,null,14,2,2,1,9,"02","02","01","09"]
["02-02-02-08",5,null,14,2,2,2,8,"02","02","02","08"]
["02-02-03-07",5,null,14,2,2,3,7,"02","02","03","07"]
["02-02-04-06",5,null,14,2,2,4,6,"02","02","04","06"]
["02-02-05-05",4,null,14,2,2,5,5,"02","02","05","05"]
["02-02-06-04",4,null,14,2,2,6,4,"02","02","06","04"]
["02-02-07-03",4,null,14,2,2,7,3,"02","02","07","03"]
["02-02-08-02",4,null,14,2,2,8,2,"02","02","08","02"]
["02-02-09-01",4,null,14,2,2,9,1,"02","02","09","01"]
["02-02-10-00",4,null,14,2,2,10,0,"02","02","10","00"]
["02-03-00-09",5,null,14,2,3,0,9,"02","03","00","09"]
["02-03-01-08",5,null,14,2,3,1,8,"02","03","01","08"]
["02-03-02-07",4,null,14,2,3,2,7,"02","03","02","07"]
["02-03-03-06",4,null,14,2,3,3,6,"02","03","03","06"]
["02-03-04-05",4,null,14,2,3,4,5,"02","03","04","05"]
["02-03-05-04",4,null,14,2,3,5,4,"02","03","05","04"]
["02-03-06-03",4,null,14,2,3,6,3,"02","03","06","03"]
["02-03-07-02",4,null,14,2,3,7,2,"02","03","07","02"]
["02-03-08-01",4,null,14,2,3,8,1,"02","03","08","01"]
["02-03-09-00",4,null,14,2,3,9,0,"02","03","09","00"]
["02-04-00-08",4,null,14,2,4,0,8,"02","04","00","08"]
["02-04-01-07",4,null,14,2,4,1,7,"02","04","01","07"]
["02-04-02-06",4,null,14,2,4,2,6,"02","04","02","06"]
["02-04-03-05",4,null,14,2,4,3,5,"02","04","03","05"]
["02-04-04-04",4,null,14,2,4,4,4,"02","04","04","04"]
["02-04-05-03",4,null,14,2,4,5,3,"02","04","05","03"]
["02-04-06-02",4,null,14,2,4,6,2,"02","04","06","02"]
["02-04-07-01",4,null,14,2,4,7,1,"02","04","07","01"]
["02-04-08-00",4,null,14,2,4,8,0,"02","04","08","00"]
["02-05-00-07",4,null,14,2,5,0,7,"02","05","00","07"]
["02-05-01-06",4,null,14,2,5,1,6,"02","05","01","06"]
["02-05-02-05",4,null,14,2,5,2,5,"02","05","02","05"]
["02-05-03-04",4,null,14,2,5,3,4,"02","05","03","04"]
["02-05-04-03",4,null,14,2,5,4,3,"02","05","04","03"]
["02-05-05-02",4,null,14,2,5,5,2,"02","05","05","02"]
["02-05-06-01",4,null,14,2,5,6,1,"02","05","06","01"]
["02-05-07-00",4,null,14,2,5,7,0,"02","05","07","00"]
["02-06-00-06",3,null,14,2,6,0,6,"02","06","00","06"]
["02-06-01-05",3,null,14,2,6,1,5,"02","06","01","05"]
["02-06-02-04",3,null,14,2,6,2,4,"02","06","02","04"]
["02-06-03-03",3,null,14,2,6,3,3,"02","06","03","03"]
["02-06-04-02",3,null,14,2,6,4,2,"02","06","04","02"]
["02-06-05-01",3,null,14,2,6,5,1,"02","06","05","01"]
["02-06-06-00",3,null,14,2,6,6,0,"02","06","06","00"]
["02-07-00-05",3,null,14,2,7,0,5,"02","07","00","05"]
["02-07-01-04",3,null,14,2,7,1,4,"02","07","01","04"]
["02-07-02-03",3,null,14,2,7,2,3,"02","07","02","03"]
["02-07-03-02",3,null,14,2,7,3,2,"02","07","03","02"]
["02-07-04-01",3,null,14,2,7,4,1,"02","07","04","01"]
["02-07-05-00",3,null,14,2,7,5,0,"02","07","05","00"]
["02-08-00-04",3,null,14,2,8,0,4,"02","08","00","04"]
["02-08-01-03",3,null,14,2,8,1,3,"02","08","01","03"]
["02-08-02-02",3,null,14,2,8,2,2,"02","08","02","02"]
["02-08-03-01",3,null,14,2,8,3,1,"02","08","03","01"]
["02-08-04-00",3,null,14,2,8,4,0,"02","08","04","00"]
["02-09-00-03",3,null,14,2,9,0,3,"02","09","00","03"]
["02-09-01-02",2,null,14,2,9,1,2,"02","09","01","02"]
["02-09-02-01",2,null,14,2,9,2,1,"02","09","02","01"]
["02-09-03-00",2,null,14,2,9,3,0,"02","09","03","00"]
["02-10-00-02",2,null,14,2,10,0,2,"02","10","00","02"]
["02-10-01-01",2,null,14,2,10,1,1,"02","10","01","01"]
["02-10-02-00",2,null,14,2,10,2,0,"02","10","02","00"]
[{"$f":"I2695&\"-\"&J2695&\"-\"&K2695&\"-\"&L2695","v":"02-11-00-01"},2,null,14,2,11,0,1,"02","11","00","01"]
["02-11-01-00",2,null,14,2,11,1,0,{"$f":"IF(LEN(E2696)=1,0&E2696,IF(LEN(E2696)=0,\"00\",RIGHT(E2696,2)))","v":"02"},{"$f":"IF(LEN(F2696)=1,0&F2696,IF(LEN(F2696)=0,\"00\",RIGHT(F2696,2)))","v":"11"},{"$f":"IF(LEN(G2696)=1,0&G2696,IF(LEN(G2696)=0,\"00\",RIGHT(G2696,2)))","v":"01"},{"$f":"IF(LEN(H2696)=1,0&H2696,IF(LEN(H2696)=0,\"00\",RIGHT(H2696,2)))","v":"00"}]
["02-12-00-00",2,null,14,2,12,0,0,"02","12","00","00"]
["03-00-00-11",5,null,14,3,0,0,11,"03","00","00","11"]
["03-00-01-10",5,null,14,3,0,1,10,"03","00","01","10"]
["03-00-02-09",5,null,14,3,0,2,9,"03","00","02","09"]
["03-00-03-08",5,null,14,3,0,3,8,"03","00","03","08"]
["03-00-04-07",5,null,14,3,0,4,7,"03","00","04","07"]
["03-00-05-06",5,null,14,3,0,5,6,"03","00","05","06"]
["03-00-06-05",4,null,14,3,0,6,5,"03","00","06","05"]
["03-00-07-04",4,null,14,3,0,7,4,"03","00","07","04"]
["03-00-08-03",4,null,14,3,0,8,3,"03","00","08","03"]
["03-00-09-02",4,null,14,3,0,9,2,"03","00","09","02"]
["03-00-10-01",4,null,14,3,0,10,1,"03","00","10","01"]
["03-00-11-00",4,null,14,3,0,11,0,"03","00","11","00"]
["03-01-00-10",5,null,14,3,1,0,10,"03","01","00","10"]
["03-01-01-09",5,null,14,3,1,1,9,"03","01","01","09"]
["03-01-02-08",5,null,14,3,1,2,8,"03","01","02","08"]
["03-01-03-07",4,null,14,3,1,3,7,"03","01","03","07"]
["03-01-04-06",4,null,14,3,1,4,6,"03","01","04","06"]
["03-01-05-05",4,null,14,3,1,5,5,"03","01","05","05"]
["03-01-06-04",4,null,14,3,1,6,4,"03","01","06","04"]
["03-01-07-03",4,null,14,3,1,7,3,"03","01","07","03"]
["03-01-08-02",4,null,14,3,1,8,2,"03","01","08","02"]
["03-01-09-01",4,null,14,3,1,9,1,"03","01","09","01"]
["03-01-10-00",4,null,14,3,1,10,0,"03","01","10","00"]
["03-02-00-09",5,null,14,3,2,0,9,"03","02","00","09"]
["03-02-01-08",4,null,14,3,2,1,8,"03","02","01","08"]
["03-02-02-07",4,null,14,3,2,2,7,"03","02","02","07"]
["03-02-03-06",4,null,14,3,2,3,6,"03","02","03","06"]
["03-02-04-05",4,null,14,3,2,4,5,"03","02","04","05"]
["03-02-05-04",4,null,14,3,2,5,4,"03","02","05","04"]
["03-02-06-03",4,null,14,3,2,6,3,"03","02","06","03"]
["03-02-07-02",4,null,14,3,2,7,2,"03","02","07","02"]
["03-02-08-01",4,null,14,3,2,8,1,"03","02","08","01"]
["03-02-09-00",4,null,14,3,2,9,0,"03","02","09","00"]
["03-03-00-08",4,null,14,3,3,0,8,"03","03","00","08"]
["03-03-01-07",4,null,14,3,3,1,7,"03","03","01","07"]
["03-03-02-06",4,null,14,3,3,2,6,"03","03","02","06"]
["03-03-03-05",4,null,14,3,3,3,5,"03","03","03","05"]
["03-03-04-04",4,null,14,3,3,4,4,"03","03","04","04"]
["03-03-05-03",4,null,14,3,3,5,3,"03","03","05","03"]
["03-03-06-02",4,null,14,3,3,6,2,"03","03","06","02"]
["03-03-07-01",4,null,14,3,3,7,1,"03","03","07","01"]
["03-03-08-00",4,null,14,3,3,8,0,"03","03","08","00"]
["03-04-00-07",4,null,14,3,4,0,7,"03","04","00","07"]
["03-04-01-06",4,null,14,3,4,1,6,"03","04","01","06"]
["03-04-02-05",4,null,14,3,4,2,5,"03","04","02","05"]
["03-04-03-04",4,null,14,3,4,3,4,"03","04","03","04"]
["03-04-04-03",4,null,14,3,4,4,3,"03","04","04","03"]
["03-04-05-02",4,null,14,3,4,5,2,"03","04","05","02"]
["03-04-06-01",4,null,14,3,4,6,1,"03","04","06","01"]
["03-04-07-00",4,null,14,3,4,7,0,"03","04","07","00"]
["03-05-00-06",3,null,14,3,5,0,6,"03","05","00","06"]
["03-05-01-05",3,null,14,3,5,1,5,"03","05","01","05"]
["03-05-02-04",3,null,14,3,5,2,4,"03","05","02","04"]
["03-05-03-03",3,null,14,3,5,3,3,"03","05","03","03"]
["03-05-04-02",3,null,14,3,5,4,2,"03","05","04","02"]
["03-05-05-01",3,null,14,3,5,5,1,"03","05","05","01"]
["03-05-06-00",3,null,14,3,5,6,0,"03","05","06","00"]
["03-06-00-05",3,null,14,3,6,0,5,"03","06","00","05"]
["03-06-01-04",3,null,14,3,6,1,4,"03","06","01","04"]
["03-06-02-03",3,null,14,3,6,2,3,"03","06","02","03"]
["03-06-03-02",3,null,14,3,6,3,2,"03","06","03","02"]
[{"$f":"I2759&\"-\"&J2759&\"-\"&K2759&\"-\"&L2759","v":"03-06-04-01"},3,null,14,3,6,4,1,"03","06","04","01"]
["03-06-05-00",3,null,14,3,6,5,0,{"$f":"IF(LEN(E2760)=1,0&E2760,IF(LEN(E2760)=0,\"00\",RIGHT(E2760,2)))","v":"03"},{"$f":"IF(LEN(F2760)=1,0&F2760,IF(LEN(F2760)=0,\"00\",RIGHT(F2760,2)))","v":"06"},{"$f":"IF(LEN(G2760)=1,0&G2760,IF(LEN(G2760)=0,\"00\",RIGHT(G2760,2)))","v":"05"},{"$f":"IF(LEN(H2760)=1,0&H2760,IF(LEN(H2760)=0,\"00\",RIGHT(H2760,2)))","v":"00"}]
["03-07-00-04",3,null,14,3,7,0,4,"03","07","00","04"]
["03-07-01-03",3,null,14,3,7,1,3,"03","07","01","03"]
["03-07-02-02",3,null,14,3,7,2,2,"03","07","02","02"]
["03-07-03-01",3,null,14,3,7,3,1,"03","07","03","01"]
["03-07-04-00",3,null,14,3,7,4,0,"03","07","04","00"]
["03-08-00-03",3,null,14,3,8,0,3,"03","08","00","03"]
["03-08-01-02",2,null,14,3,8,1,2,"03","08","01","02"]
["03-08-02-01",2,null,14,3,8,2,1,"03","08","02","01"]
["03-08-03-00",2,null,14,3,8,3,0,"03","08","03","00"]
["03-09-00-02",2,null,14,3,9,0,2,"03","09","00","02"]
["03-09-01-01",2,null,14,3,9,1,1,"03","09","01","01"]
["03-09-02-00",2,null,14,3,9,2,0,"03","09","02","00"]
["03-10-00-01",2,null,14,3,10,0,1,"03","10","00","01"]
["03-10-01-00",2,null,14,3,10,1,0,"03","10","01","00"]
["03-11-00-00",2,null,14,3,11,0,0,"03","11","00","00"]
["04-00-00-10",5,null,14,4,0,0,10,"04","00","00","10"]
["04-00-01-09",5,null,14,4,0,1,9,"04","00","01","09"]
["04-00-02-08",4,null,14,4,0,2,8,"04","00","02","08"]
["04-00-03-07",4,null,14,4,0,3,7,"04","00","03","07"]
["04-00-04-06",4,null,14,4,0,4,6,"04","00","04","06"]
["04-00-05-05",4,null,14,4,0,5,5,"04","00","05","05"]
["04-00-06-04",4,null,14,4,0,6,4,"04","00","06","04"]
["04-00-07-03",4,null,14,4,0,7,3,"04","00","07","03"]
["04-00-08-02",4,null,14,4,0,8,2,"04","00","08","02"]
["04-00-09-01",4,null,14,4,0,9,1,"04","00","09","01"]
["04-00-10-00",4,null,14,4,0,10,0,"04","00","10","00"]
["04-01-00-09",4,null,14,4,1,0,9,"04","01","00","09"]
["04-01-01-08",4,null,14,4,1,1,8,"04","01","01","08"]
["04-01-02-07",4,null,14,4,1,2,7,"04","01","02","07"]
["04-01-03-06",4,null,14,4,1,3,6,"04","01","03","06"]
["04-01-04-05",4,null,14,4,1,4,5,"04","01","04","05"]
["04-01-05-04",4,null,14,4,1,5,4,"04","01","05","04"]
["04-01-06-03",4,null,14,4,1,6,3,"04","01","06","03"]
["04-01-07-02",4,null,14,4,1,7,2,"04","01","07","02"]
["04-01-08-01",4,null,14,4,1,8,1,"04","01","08","01"]
["04-01-09-00",4,null,14,4,1,9,0,"04","01","09","00"]
["04-02-00-08",4,null,14,4,2,0,8,"04","02","00","08"]
["04-02-01-07",4,null,14,4,2,1,7,"04","02","01","07"]
["04-02-02-06",4,null,14,4,2,2,6,"04","02","02","06"]
["04-02-03-05",4,null,14,4,2,3,5,"04","02","03","05"]
["04-02-04-04",4,null,14,4,2,4,4,"04","02","04","04"]
["04-02-05-03",4,null,14,4,2,5,3,"04","02","05","03"]
["04-02-06-02",4,null,14,4,2,6,2,"04","02","06","02"]
["04-02-07-01",4,null,14,4,2,7,1,"04","02","07","01"]
["04-02-08-00",4,null,14,4,2,8,0,"04","02","08","00"]
["04-03-00-07",4,null,14,4,3,0,7,"04","03","00","07"]
["04-03-01-06",4,null,14,4,3,1,6,"04","03","01","06"]
["04-03-02-05",4,null,14,4,3,2,5,"04","03","02","05"]
["04-03-03-04",4,null,14,4,3,3,4,"04","03","03","04"]
["04-03-04-03",4,null,14,4,3,4,3,"04","03","04","03"]
["04-03-05-02",4,null,14,4,3,5,2,"04","03","05","02"]
["04-03-06-01",4,null,14,4,3,6,1,"04","03","06","01"]
["04-03-07-00",4,null,14,4,3,7,0,"04","03","07","00"]
["04-04-00-06",3,null,14,4,4,0,6,"04","04","00","06"]
["04-04-01-05",3,null,14,4,4,1,5,"04","04","01","05"]
["04-04-02-04",3,null,14,4,4,2,4,"04","04","02","04"]
["04-04-03-03",4,null,14,4,4,3,3,"04","04","03","03"]
["04-04-04-02",3,null,14,4,4,4,2,"04","04","04","02"]
["04-04-05-01",3,null,14,4,4,5,1,"04","04","05","01"]
["04-04-06-00",3,null,14,4,4,6,0,"04","04","06","00"]
["04-05-00-05",3,null,14,4,5,0,5,"04","05","00","05"]
["04-05-01-04",3,null,14,4,5,1,4,"04","05","01","04"]
[{"$f":"I2823&\"-\"&J2823&\"-\"&K2823&\"-\"&L2823","v":"04-05-02-03"},3,null,14,4,5,2,3,"04","05","02","03"]
["04-05-03-02",3,null,14,4,5,3,2,{"$f":"IF(LEN(E2824)=1,0&E2824,IF(LEN(E2824)=0,\"00\",RIGHT(E2824,2)))","v":"04"},{"$f":"IF(LEN(F2824)=1,0&F2824,IF(LEN(F2824)=0,\"00\",RIGHT(F2824,2)))","v":"05"},{"$f":"IF(LEN(G2824)=1,0&G2824,IF(LEN(G2824)=0,\"00\",RIGHT(G2824,2)))","v":"03"},{"$f":"IF(LEN(H2824)=1,0&H2824,IF(LEN(H2824)=0,\"00\",RIGHT(H2824,2)))","v":"02"}]
["04-05-04-01",3,null,14,4,5,4,1,"04","05","04","01"]
["04-05-05-00",3,null,14,4,5,5,0,"04","05","05","00"]
["04-06-00-04",3,null,14,4,6,0,4,"04","06","00","04"]
["04-06-01-03",3,null,14,4,6,1,3,"04","06","01","03"]
["04-06-02-02",3,null,14,4,6,2,2,"04","06","02","02"]
["04-06-03-01",3,null,14,4,6,3,1,"04","06","03","01"]
["04-06-04-00",3,null,14,4,6,4,0,"04","06","04","00"]
["04-07-00-03",3,null,14,4,7,0,3,"04","07","00","03"]
["04-07-01-02",2,null,14,4,7,1,2,"04","07","01","02"]
["04-07-02-01",2,null,14,4,7,2,1,"04","07","02","01"]
["04-07-03-00",2,null,14,4,7,3,0,"04","07","03","00"]
["04-08-00-02",2,null,14,4,8,0,2,"04","08","00","02"]
["04-08-01-01",2,null,14,4,8,1,1,"04","08","01","01"]
["04-08-02-00",2,null,14,4,8,2,0,"04","08","02","00"]
["04-09-00-01",2,null,14,4,9,0,1,"04","09","00","01"]
["04-09-01-00",2,null,14,4,9,1,0,"04","09","01","00"]
["04-10-00-00",2,null,14,4,10,0,0,"04","10","00","00"]
["05-00-00-09",4,null,14,5,0,0,9,"05","00","00","09"]
["05-00-01-08",4,null,14,5,0,1,8,"05","00","01","08"]
["05-00-02-07",4,null,14,5,0,2,7,"05","00","02","07"]
["05-00-03-06",4,null,14,5,0,3,6,"05","00","03","06"]
["05-00-04-05",4,null,14,5,0,4,5,"05","00","04","05"]
["05-00-05-04",4,null,14,5,0,5,4,"05","00","05","04"]
["05-00-06-03",4,null,14,5,0,6,3,"05","00","06","03"]
["05-00-07-02",4,null,14,5,0,7,2,"05","00","07","02"]
["05-00-08-01",4,null,14,5,0,8,1,"05","00","08","01"]
["05-00-09-00",4,null,14,5,0,9,0,"05","00","09","00"]
["05-01-00-08",4,null,14,5,1,0,8,"05","01","00","08"]
["05-01-01-07",4,null,14,5,1,1,7,"05","01","01","07"]
["05-01-02-06",4,null,14,5,1,2,6,"05","01","02","06"]
["05-01-03-05",4,null,14,5,1,3,5,"05","01","03","05"]
["05-01-04-04",4,null,14,5,1,4,4,"05","01","04","04"]
["05-01-05-03",4,null,14,5,1,5,3,"05","01","05","03"]
["05-01-06-02",4,null,14,5,1,6,2,"05","01","06","02"]
["05-01-07-01",4,null,14,5,1,7,1,"05","01","07","01"]
["05-01-08-00",4,null,14,5,1,8,0,"05","01","08","00"]
["05-02-00-07",4,null,14,5,2,0,7,"05","02","00","07"]
["05-02-01-06",4,null,14,5,2,1,6,"05","02","01","06"]
["05-02-02-05",4,null,14,5,2,2,5,"05","02","02","05"]
["05-02-03-04",4,null,14,5,2,3,4,"05","02","03","04"]
["05-02-04-03",4,null,14,5,2,4,3,"05","02","04","03"]
["05-02-05-02",4,null,14,5,2,5,2,"05","02","05","02"]
["05-02-06-01",4,null,14,5,2,6,1,"05","02","06","01"]
["05-02-07-00",3,null,14,5,2,7,0,"05","02","07","00"]
["05-03-00-06",3,null,14,5,3,0,6,"05","03","00","06"]
["05-03-01-05",3,null,14,5,3,1,5,"05","03","01","05"]
["05-03-02-04",3,null,14,5,3,2,4,"05","03","02","04"]
["05-03-03-03",3,null,14,5,3,3,3,"05","03","03","03"]
["05-03-04-02",3,null,14,5,3,4,2,"05","03","04","02"]
["05-03-05-01",3,null,14,5,3,5,1,"05","03","05","01"]
["05-03-06-00",3,null,14,5,3,6,0,"05","03","06","00"]
["05-04-00-05",3,null,14,5,4,0,5,"05","04","00","05"]
["05-04-01-04",3,null,14,5,4,1,4,"05","04","01","04"]
["05-04-02-03",3,null,14,5,4,2,3,"05","04","02","03"]
["05-04-03-02",3,null,14,5,4,3,2,"05","04","03","02"]
["05-04-04-01",3,null,14,5,4,4,1,"05","04","04","01"]
["05-04-05-00",3,null,14,5,4,5,0,"05","04","05","00"]
["05-05-00-04",3,null,14,5,5,0,4,"05","05","00","04"]
["05-05-01-03",3,null,14,5,5,1,3,"05","05","01","03"]
["05-05-02-02",3,null,14,5,5,2,2,"05","05","02","02"]
["05-05-03-01",3,null,14,5,5,3,1,"05","05","03","01"]
["05-05-04-00",3,null,14,5,5,4,0,"05","05","04","00"]
[{"$f":"I2887&\"-\"&J2887&\"-\"&K2887&\"-\"&L2887","v":"05-06-00-03"},3,null,14,5,6,0,3,"05","06","00","03"]
["05-06-01-02",2,null,14,5,6,1,2,{"$f":"IF(LEN(E2888)=1,0&E2888,IF(LEN(E2888)=0,\"00\",RIGHT(E2888,2)))","v":"05"},{"$f":"IF(LEN(F2888)=1,0&F2888,IF(LEN(F2888)=0,\"00\",RIGHT(F2888,2)))","v":"06"},{"$f":"IF(LEN(G2888)=1,0&G2888,IF(LEN(G2888)=0,\"00\",RIGHT(G2888,2)))","v":"01"},{"$f":"IF(LEN(H2888)=1,0&H2888,IF(LEN(H2888)=0,\"00\",RIGHT(H2888,2)))","v":"02"}]
["05-06-02-01",2,null,14,5,6,2,1,"05","06","02","01"]
["05-06-03-00",2,null,14,5,6,3,0,"05","06","03","00"]
["05-07-00-02",2,null,14,5,7,0,2,"05","07","00","02"]
["05-07-01-01",2,null,14,5,7,1,1,"05","07","01","01"]
["05-07-02-00",2,null,14,5,7,2,0,"05","07","02","00"]
["05-08-00-01",2,null,14,5,8,0,1,"05","08","00","01"]
["05-08-01-00",2,null,14,5,8,1,0,"05","08","01","00"]
["05-09-00-00",2,null,14,5,9,0,0,"05","09","00","00"]
["06-00-00-08",4,null,14,6,0,0,8,"06","00","00","08"]
["06-00-01-07",4,null,14,6,0,1,7,"06","00","01","07"]
["06-00-02-06",4,null,14,6,0,2,6,"06","00","02","06"]
["06-00-03-05",4,null,14,6,0,3,5,"06","00","03","05"]
["06-00-04-04",4,null,14,6,0,4,4,"06","00","04","04"]
["06-00-05-03",4,null,14,6,0,5,3,"06","00","05","03"]
["06-00-06-02",4,null,14,6,0,6,2,"06","00","06","02"]
["06-00-07-01",4,null,14,6,0,7,1,"06","00","07","01"]
["06-00-08-00",3,null,14,6,0,8,0,"06","00","08","00"]
["06-01-00-07",4,null,14,6,1,0,7,"06","01","00","07"]
["06-01-01-06",4,null,14,6,1,1,6,"06","01","01","06"]
["06-01-02-05",4,null,14,6,1,2,5,"06","01","02","05"]
["06-01-03-04",4,null,14,6,1,3,4,"06","01","03","04"]
["06-01-04-03",4,null,14,6,1,4,3,"06","01","04","03"]
["06-01-05-02",3,null,14,6,1,5,2,"06","01","05","02"]
["06-01-06-01",3,null,14,6,1,6,1,"06","01","06","01"]
["06-01-07-00",3,null,14,6,1,7,0,"06","01","07","00"]
["06-02-00-06",3,null,14,6,2,0,6,"06","02","00","06"]
["06-02-01-05",3,null,14,6,2,1,5,"06","02","01","05"]
["06-02-02-04",3,null,14,6,2,2,4,"06","02","02","04"]
["06-02-03-03",3,null,14,6,2,3,3,"06","02","03","03"]
["06-02-04-02",3,null,14,6,2,4,2,"06","02","04","02"]
["06-02-05-01",3,null,14,6,2,5,1,"06","02","05","01"]
["06-02-06-00",3,null,14,6,2,6,0,"06","02","06","00"]
["06-03-00-05",3,null,14,6,3,0,5,"06","03","00","05"]
["06-03-01-04",3,null,14,6,3,1,4,"06","03","01","04"]
["06-03-02-03",3,null,14,6,3,2,3,"06","03","02","03"]
["06-03-03-02",3,null,14,6,3,3,2,"06","03","03","02"]
["06-03-04-01",3,null,14,6,3,4,1,"06","03","04","01"]
["06-03-05-00",3,null,14,6,3,5,0,"06","03","05","00"]
["06-04-00-04",3,null,14,6,4,0,4,"06","04","00","04"]
["06-04-01-03",3,null,14,6,4,1,3,"06","04","01","03"]
["06-04-02-02",3,null,14,6,4,2,2,"06","04","02","02"]
["06-04-03-01",3,null,14,6,4,3,1,"06","04","03","01"]
["06-04-04-00",3,null,14,6,4,4,0,"06","04","04","00"]
["06-05-00-03",3,null,14,6,5,0,3,"06","05","00","03"]
["06-05-01-02",2,null,14,6,5,1,2,"06","05","01","02"]
["06-05-02-01",2,null,14,6,5,2,1,"06","05","02","01"]
["06-05-03-00",2,null,14,6,5,3,0,"06","05","03","00"]
["06-06-00-02",2,null,14,6,6,0,2,"06","06","00","02"]
["06-06-01-01",2,null,14,6,6,1,1,"06","06","01","01"]
["06-06-02-00",2,null,14,6,6,2,0,"06","06","02","00"]
["06-07-00-01",2,null,14,6,7,0,1,"06","07","00","01"]
["06-07-01-00",2,null,14,6,7,1,0,"06","07","01","00"]
["06-08-00-00",2,null,14,6,8,0,0,"06","08","00","00"]
["07-00-00-07",4,null,14,7,0,0,7,"07","00","00","07"]
["07-00-01-06",4,null,14,7,0,1,6,"07","00","01","06"]
["07-00-02-05",4,null,14,7,0,2,5,"07","00","02","05"]
["07-00-03-04",4,null,14,7,0,3,4,"07","00","03","04"]
["07-00-04-03",3,null,14,7,0,4,3,"07","00","04","03"]
["07-00-05-02",3,null,14,7,0,5,2,"07","00","05","02"]
["07-00-06-01",3,null,14,7,0,6,1,"07","00","06","01"]
["07-00-07-00",3,null,14,7,0,7,0,"07","00","07","00"]
["07-01-00-06",3,null,14,7,1,0,6,"07","01","00","06"]
[{"$f":"I2951&\"-\"&J2951&\"-\"&K2951&\"-\"&L2951","v":"07-01-01-05"},3,null,14,7,1,1,5,"07","01","01","05"]
["07-01-02-04",3,null,14,7,1,2,4,{"$f":"IF(LEN(E2952)=1,0&E2952,IF(LEN(E2952)=0,\"00\",RIGHT(E2952,2)))","v":"07"},{"$f":"IF(LEN(F2952)=1,0&F2952,IF(LEN(F2952)=0,\"00\",RIGHT(F2952,2)))","v":"01"},{"$f":"IF(LEN(G2952)=1,0&G2952,IF(LEN(G2952)=0,\"00\",RIGHT(G2952,2)))","v":"02"},{"$f":"IF(LEN(H2952)=1,0&H2952,IF(LEN(H2952)=0,\"00\",RIGHT(H2952,2)))","v":"04"}]
["07-01-03-03",3,null,14,7,1,3,3,"07","01","03","03"]
["07-01-04-02",3,null,14,7,1,4,2,"07","01","04","02"]
["07-01-05-01",3,null,14,7,1,5,1,"07","01","05","01"]
["07-01-06-00",3,null,14,7,1,6,0,"07","01","06","00"]
["07-02-00-05",3,null,14,7,2,0,5,"07","02","00","05"]
["07-02-01-04",3,null,14,7,2,1,4,"07","02","01","04"]
["07-02-02-03",3,null,14,7,2,2,3,"07","02","02","03"]
["07-02-03-02",3,null,14,7,2,3,2,"07","02","03","02"]
["07-02-04-01",3,null,14,7,2,4,1,"07","02","04","01"]
["07-02-05-00",3,null,14,7,2,5,0,"07","02","05","00"]
["07-03-00-04",3,null,14,7,3,0,4,"07","03","00","04"]
["07-03-01-03",3,null,14,7,3,1,3,"07","03","01","03"]
["07-03-02-02",3,null,14,7,3,2,2,"07","03","02","02"]
["07-03-03-01",3,null,14,7,3,3,1,"07","03","03","01"]
["07-03-04-00",3,null,14,7,3,4,0,"07","03","04","00"]
["07-04-00-03",3,null,14,7,4,0,3,"07","04","00","03"]
["07-04-01-02",2,null,14,7,4,1,2,"07","04","01","02"]
["07-04-02-01",2,null,14,7,4,2,1,"07","04","02","01"]
["07-04-03-00",2,null,14,7,4,3,0,"07","04","03","00"]
["07-05-00-02",2,null,14,7,5,0,2,"07","05","00","02"]
["07-05-01-01",2,null,14,7,5,1,1,"07","05","01","01"]
["07-05-02-00",2,null,14,7,5,2,0,"07","05","02","00"]
["07-06-00-01",2,null,14,7,6,0,1,"07","06","00","01"]
["07-06-01-00",2,null,14,7,6,1,0,"07","06","01","00"]
["07-07-00-00",2,null,14,7,7,0,0,"07","07","00","00"]
["08-00-00-06",3,null,14,8,0,0,6,"08","00","00","06"]
["08-00-01-05",3,null,14,8,0,1,5,"08","00","01","05"]
["08-00-02-04",3,null,14,8,0,2,4,"08","00","02","04"]
["08-00-03-03",3,null,14,8,0,3,3,"08","00","03","03"]
["08-00-04-02",3,null,14,8,0,4,2,"08","00","04","02"]
["08-00-05-01",3,null,14,8,0,5,1,"08","00","05","01"]
["08-00-06-00",3,null,14,8,0,6,0,"08","00","06","00"]
["08-01-00-05",3,null,14,8,1,0,5,"08","01","00","05"]
["08-01-01-04",3,null,14,8,1,1,4,"08","01","01","04"]
["08-01-02-03",3,null,14,8,1,2,3,"08","01","02","03"]
["08-01-03-02",3,null,14,8,1,3,2,"08","01","03","02"]
["08-01-04-01",3,null,14,8,1,4,1,"08","01","04","01"]
["08-01-05-00",3,null,14,8,1,5,0,"08","01","05","00"]
["08-02-00-04",3,null,14,8,2,0,4,"08","02","00","04"]
["08-02-01-03",3,null,14,8,2,1,3,"08","02","01","03"]
["08-02-02-02",3,null,14,8,2,2,2,"08","02","02","02"]
["08-02-03-01",3,null,14,8,2,3,1,"08","02","03","01"]
["08-02-04-00",3,null,14,8,2,4,0,"08","02","04","00"]
["08-03-00-03",3,null,14,8,3,0,3,"08","03","00","03"]
["08-03-01-02",2,null,14,8,3,1,2,"08","03","01","02"]
["08-03-02-01",2,null,14,8,3,2,1,"08","03","02","01"]
["08-03-03-00",2,null,14,8,3,3,0,"08","03","03","00"]
["08-04-00-02",2,null,14,8,4,0,2,"08","04","00","02"]
["08-04-01-01",2,null,14,8,4,1,1,"08","04","01","01"]
["08-04-02-00",2,null,14,8,4,2,0,"08","04","02","00"]
["08-05-00-01",2,null,14,8,5,0,1,"08","05","00","01"]
["08-05-01-00",2,null,14,8,5,1,0,"08","05","01","00"]
["08-06-00-00",2,null,14,8,6,0,0,"08","06","00","00"]
["09-00-00-05",3,null,14,9,0,0,5,"09","00","00","05"]
["09-00-01-04",3,null,14,9,0,1,4,"09","00","01","04"]
["09-00-02-03",3,null,14,9,0,2,3,"09","00","02","03"]
["09-00-03-02",3,null,14,9,0,3,2,"09","00","03","02"]
["09-00-04-01",3,null,14,9,0,4,1,"09","00","04","01"]
["09-00-05-00",3,null,14,9,0,5,0,"09","00","05","00"]
["09-01-00-04",3,null,14,9,1,0,4,"09","01","00","04"]
["09-01-01-03",3,null,14,9,1,1,3,"09","01","01","03"]
["09-01-02-02",3,null,14,9,1,2,2,"09","01","02","02"]
[{"$f":"I3015&\"-\"&J3015&\"-\"&K3015&\"-\"&L3015","v":"09-01-03-01"},3,null,14,9,1,3,1,"09","01","03","01"]
["09-01-04-00",3,null,14,9,1,4,0,{"$f":"IF(LEN(E3016)=1,0&E3016,IF(LEN(E3016)=0,\"00\",RIGHT(E3016,2)))","v":"09"},{"$f":"IF(LEN(F3016)=1,0&F3016,IF(LEN(F3016)=0,\"00\",RIGHT(F3016,2)))","v":"01"},{"$f":"IF(LEN(G3016)=1,0&G3016,IF(LEN(G3016)=0,\"00\",RIGHT(G3016,2)))","v":"04"},{"$f":"IF(LEN(H3016)=1,0&H3016,IF(LEN(H3016)=0,\"00\",RIGHT(H3016,2)))","v":"00"}]
["09-02-00-03",3,null,14,9,2,0,3,"09","02","00","03"]
["09-02-01-02",2,null,14,9,2,1,2,"09","02","01","02"]
["09-02-02-01",2,null,14,9,2,2,1,"09","02","02","01"]
["09-02-03-00",2,null,14,9,2,3,0,"09","02","03","00"]
["09-03-00-02",2,null,14,9,3,0,2,"09","03","00","02"]
["09-03-01-01",2,null,14,9,3,1,1,"09","03","01","01"]
["09-03-02-00",2,null,14,9,3,2,0,"09","03","02","00"]
["09-04-00-01",2,null,14,9,4,0,1,"09","04","00","01"]
["09-04-01-00",2,null,14,9,4,1,0,"09","04","01","00"]
["09-05-00-00",2,null,14,9,5,0,0,"09","05","00","00"]
["10-00-00-04",3,null,14,10,0,0,4,"10","00","00","04"]
["10-00-01-03",3,null,14,10,0,1,3,"10","00","01","03"]
["10-00-02-02",3,null,14,10,0,2,2,"10","00","02","02"]
["10-00-03-01",3,null,14,10,0,3,1,"10","00","03","01"]
["10-00-04-00",3,null,14,10,0,4,0,"10","00","04","00"]
["10-01-00-03",3,null,14,10,1,0,3,"10","01","00","03"]
["10-01-01-02",2,null,14,10,1,1,2,"10","01","01","02"]
["10-01-02-01",2,null,14,10,1,2,1,"10","01","02","01"]
["10-01-03-00",2,null,14,10,1,3,0,"10","01","03","00"]
["10-02-00-02",2,null,14,10,2,0,2,"10","02","00","02"]
["10-02-01-01",2,null,14,10,2,1,1,"10","02","01","01"]
["10-02-02-00",2,null,14,10,2,2,0,"10","02","02","00"]
["10-03-00-01",2,null,14,10,3,0,1,"10","03","00","01"]
["10-03-01-00",2,null,14,10,3,1,0,"10","03","01","00"]
["10-04-00-00",2,null,14,10,4,0,0,"10","04","00","00"]
["11-00-00-03",3,null,14,11,0,0,3,"11","00","00","03"]
["11-00-01-02",2,null,14,11,0,1,2,"11","00","01","02"]
["11-00-02-01",2,null,14,11,0,2,1,"11","00","02","01"]
["11-00-03-00",2,null,14,11,0,3,0,"11","00","03","00"]
["11-01-00-02",2,null,14,11,1,0,2,"11","01","00","02"]
["11-01-01-01",2,null,14,11,1,1,1,"11","01","01","01"]
["11-01-02-00",2,null,14,11,1,2,0,"11","01","02","00"]
["11-02-00-01",2,null,14,11,2,0,1,"11","02","00","01"]
["11-02-01-00",2,null,14,11,2,1,0,"11","02","01","00"]
["11-03-00-00",2,null,14,11,3,0,0,"11","03","00","00"]
["12-00-00-02",2,null,14,12,0,0,2,"12","00","00","02"]
["12-00-01-01",2,null,14,12,0,1,1,"12","00","01","01"]
["12-00-02-00",2,null,14,12,0,2,0,"12","00","02","00"]
["12-01-00-01",2,null,14,12,1,0,1,"12","01","00","01"]
["12-01-01-00",2,null,14,12,1,1,0,"12","01","01","00"]
["12-02-00-00",2,null,14,12,2,0,0,"12","02","00","00"]
["13-00-00-01",2,null,14,13,0,0,1,"13","00","00","01"]
["13-00-01-00",2,null,14,13,0,1,0,"13","00","01","00"]
["13-01-00-00",2,null,14,13,1,0,0,"13","01","00","00"]
["14-00-00-00",1,null,14,14,0,0,0,"14","00","00","00"]
["00-00-00-15",7,null,15,0,0,0,15,"00","00","00","15"]
["00-00-01-14",6,null,15,0,0,1,14,"00","00","01","14"]
["00-00-02-13",6,null,15,0,0,2,13,"00","00","02","13"]
["00-00-03-12",6,null,15,0,0,3,12,"00","00","03","12"]
["00-00-04-11",6,null,15,0,0,4,11,"00","00","04","11"]
["00-00-05-10",6,null,15,0,0,5,10,"00","00","05","10"]
["00-00-06-09",6,null,15,0,0,6,9,"00","00","06","09"]
["00-00-07-08",6,null,15,0,0,7,8,"00","00","07","08"]
["00-00-08-07",5,null,15,0,0,8,7,"00","00","08","07"]
["00-00-09-06",5,null,15,0,0,9,6,"00","00","09","06"]
["00-00-10-05",5,null,15,0,0,10,5,"00","00","10","05"]
["00-00-11-04",5,null,15,0,0,11,4,"00","00","11","04"]
["00-00-12-03",5,null,15,0,0,12,3,"00","00","12","03"]
["00-00-13-02",4,null,15,0,0,13,2,"00","00","13","02"]
["00-00-14-01",4,null,15,0,0,14,1,"00","00","14","01"]
["00-00-15-00",4,null,15,0,0,15,0,"00","00","15","00"]
["00-01-00-14",5,null,15,0,1,0,14,"00","01","00","14"]
[{"$f":"I3079&\"-\"&J3079&\"-\"&K3079&\"-\"&L3079","v":"00-01-01-13"},5,null,15,0,1,1,13,"00","01","01","13"]
["00-01-02-12",5,null,15,0,1,2,12,{"$f":"IF(LEN(E3080)=1,0&E3080,IF(LEN(E3080)=0,\"00\",RIGHT(E3080,2)))","v":"00"},{"$f":"IF(LEN(F3080)=1,0&F3080,IF(LEN(F3080)=0,\"00\",RIGHT(F3080,2)))","v":"01"},{"$f":"IF(LEN(G3080)=1,0&G3080,IF(LEN(G3080)=0,\"00\",RIGHT(G3080,2)))","v":"02"},{"$f":"IF(LEN(H3080)=1,0&H3080,IF(LEN(H3080)=0,\"00\",RIGHT(H3080,2)))","v":"12"}]
["00-01-03-11",5,null,15,0,1,3,11,"00","01","03","11"]
["00-01-04-10",5,null,15,0,1,4,10,"00","01","04","10"]
["00-01-05-09",5,null,15,0,1,5,9,"00","01","05","09"]
["00-01-06-08",5,null,15,0,1,6,8,"00","01","06","08"]
["00-01-07-07",5,null,15,0,1,7,7,"00","01","07","07"]
["00-01-08-06",5,null,15,0,1,8,6,"00","01","08","06"]
["00-01-09-05",5,null,15,0,1,9,5,"00","01","09","05"]
["00-01-10-04",5,null,15,0,1,10,4,"00","01","10","04"]
["00-01-11-03",5,null,15,0,1,11,3,"00","01","11","03"]
["00-01-12-02",4,null,15,0,1,12,2,"00","01","12","02"]
["00-01-13-01",4,null,15,0,1,13,1,"00","01","13","01"]
["00-01-14-00",4,null,15,0,1,14,0,"00","01","14","00"]
["00-02-00-13",5,null,15,0,2,0,13,"00","02","00","13"]
["00-02-01-12",5,null,15,0,2,1,12,"00","02","01","12"]
["00-02-02-11",5,null,15,0,2,2,11,"00","02","02","11"]
["00-02-03-10",5,null,15,0,2,3,10,"00","02","03","10"]
["00-02-04-09",5,null,15,0,2,4,9,"00","02","04","09"]
["00-02-05-08",5,null,15,0,2,5,8,"00","02","05","08"]
["00-02-06-07",5,null,15,0,2,6,7,"00","02","06","07"]
["00-02-07-06",5,null,15,0,2,7,6,"00","02","07","06"]
["00-02-08-05",5,null,15,0,2,8,5,"00","02","08","05"]
["00-02-09-04",5,null,15,0,2,9,4,"00","02","09","04"]
["00-02-10-03",5,null,15,0,2,10,3,"00","02","10","03"]
["00-02-11-02",4,null,15,0,2,11,2,"00","02","11","02"]
["00-02-12-01",4,null,15,0,2,12,1,"00","02","12","01"]
["00-02-13-00",4,null,15,0,2,13,0,"00","02","13","00"]
["00-03-00-12",5,null,15,0,3,0,12,"00","03","00","12"]
["00-03-01-11",5,null,15,0,3,1,11,"00","03","01","11"]
["00-03-02-10",5,null,15,0,3,2,10,"00","03","02","10"]
["00-03-03-09",5,null,15,0,3,3,9,"00","03","03","09"]
["00-03-04-08",5,null,15,0,3,4,8,"00","03","04","08"]
["00-03-05-07",5,null,15,0,3,5,7,"00","03","05","07"]
["00-03-06-06",5,null,15,0,3,6,6,"00","03","06","06"]
["00-03-07-05",5,null,15,0,3,7,5,"00","03","07","05"]
["00-03-08-04",5,null,15,0,3,8,4,"00","03","08","04"]
["00-03-09-03",5,null,15,0,3,9,3,"00","03","09","03"]
["00-03-10-02",4,null,15,0,3,10,2,"00","03","10","02"]
["00-03-11-01",4,null,15,0,3,11,1,"00","03","11","01"]
["00-03-12-00",4,null,15,0,3,12,0,"00","03","12","00"]
["00-04-00-11",5,null,15,0,4,0,11,"00","04","00","11"]
["00-04-01-10",5,null,15,0,4,1,10,"00","04","01","10"]
["00-04-02-09",5,null,15,0,4,2,9,"00","04","02","09"]
["00-04-03-08",5,null,15,0,4,3,8,"00","04","03","08"]
["00-04-04-07",5,null,15,0,4,4,7,"00","04","04","07"]
["00-04-05-06",5,null,15,0,4,5,6,"00","04","05","06"]
["00-04-06-05",5,null,15,0,4,6,5,"00","04","06","05"]
["00-04-07-04",5,null,15,0,4,7,4,"00","04","07","04"]
["00-04-08-03",5,null,15,0,4,8,3,"00","04","08","03"]
["00-04-09-02",4,null,15,0,4,9,2,"00","04","09","02"]
["00-04-10-01",4,null,15,0,4,10,1,"00","04","10","01"]
["00-04-11-00",4,null,15,0,4,11,0,"00","04","11","00"]
["00-05-00-10",5,null,15,0,5,0,10,"00","05","00","10"]
["00-05-01-09",5,null,15,0,5,1,9,"00","05","01","09"]
["00-05-02-08",5,null,15,0,5,2,8,"00","05","02","08"]
["00-05-03-07",5,null,15,0,5,3,7,"00","05","03","07"]
["00-05-04-06",5,null,15,0,5,4,6,"00","05","04","06"]
["00-05-05-05",5,null,15,0,5,5,5,"00","05","05","05"]
["00-05-06-04",4,null,15,0,5,6,4,"00","05","06","04"]
["00-05-07-03",4,null,15,0,5,7,3,"00","05","07","03"]
["00-05-08-02",4,null,15,0,5,8,2,"00","05","08","02"]
["00-05-09-01",4,null,15,0,5,9,1,"00","05","09","01"]
["00-05-10-00",4,null,15,0,5,10,0,"00","05","10","00"]
[{"$f":"I3143&\"-\"&J3143&\"-\"&K3143&\"-\"&L3143","v":"00-06-00-09"},5,null,15,0,6,0,9,"00","06","00","09"]
["00-06-01-08",5,null,15,0,6,1,8,{"$f":"IF(LEN(E3144)=1,0&E3144,IF(LEN(E3144)=0,\"00\",RIGHT(E3144,2)))","v":"00"},{"$f":"IF(LEN(F3144)=1,0&F3144,IF(LEN(F3144)=0,\"00\",RIGHT(F3144,2)))","v":"06"},{"$f":"IF(LEN(G3144)=1,0&G3144,IF(LEN(G3144)=0,\"00\",RIGHT(G3144,2)))","v":"01"},{"$f":"IF(LEN(H3144)=1,0&H3144,IF(LEN(H3144)=0,\"00\",RIGHT(H3144,2)))","v":"08"}]
["00-06-02-07",5,null,15,0,6,2,7,"00","06","02","07"]
["00-06-03-06",5,null,15,0,6,3,6,"00","06","03","06"]
["00-06-04-05",4,null,15,0,6,4,5,"00","06","04","05"]
["00-06-05-04",4,null,15,0,6,5,4,"00","06","05","04"]
["00-06-06-03",4,null,15,0,6,6,3,"00","06","06","03"]
["00-06-07-02",4,null,15,0,6,7,2,"00","06","07","02"]
["00-06-08-01",4,null,15,0,6,8,1,"00","06","08","01"]
["00-06-09-00",4,null,15,0,6,9,0,"00","06","09","00"]
["00-07-00-08",5,null,15,0,7,0,8,"00","07","00","08"]
["00-07-01-07",4,null,15,0,7,1,7,"00","07","01","07"]
["00-07-02-06",4,null,15,0,7,2,6,"00","07","02","06"]
["00-07-03-05",4,null,15,0,7,3,5,"00","07","03","05"]
["00-07-04-04",4,null,15,0,7,4,4,"00","07","04","04"]
["00-07-05-03",4,null,15,0,7,5,3,"00","07","05","03"]
["00-07-06-02",4,null,15,0,7,6,2,"00","07","06","02"]
["00-07-07-01",4,null,15,0,7,7,1,"00","07","07","01"]
["00-07-08-00",4,null,15,0,7,8,0,"00","07","08","00"]
["00-08-00-07",3,null,15,0,8,0,7,"00","08","00","07"]
["00-08-01-06",3,null,15,0,8,1,6,"00","08","01","06"]
["00-08-02-05",3,null,15,0,8,2,5,"00","08","02","05"]
["00-08-03-04",3,null,15,0,8,3,4,"00","08","03","04"]
["00-08-04-03",3,null,15,0,8,4,3,"00","08","04","03"]
["00-08-05-02",3,null,15,0,8,5,2,"00","08","05","02"]
["00-08-06-01",3,null,15,0,8,6,1,"00","08","06","01"]
["00-08-07-00",3,null,15,0,8,7,0,"00","08","07","00"]
["00-09-00-06",3,null,15,0,9,0,6,"00","09","00","06"]
["00-09-01-05",3,null,15,0,9,1,5,"00","09","01","05"]
["00-09-02-04",3,null,15,0,9,2,4,"00","09","02","04"]
["00-09-03-03",3,null,15,0,9,3,3,"00","09","03","03"]
["00-09-04-02",3,null,15,0,9,4,2,"00","09","04","02"]
["00-09-05-01",3,null,15,0,9,5,1,"00","09","05","01"]
["00-09-06-00",3,null,15,0,9,6,0,"00","09","06","00"]
["00-10-00-05",3,null,15,0,10,0,5,"00","10","00","05"]
["00-10-01-04",3,null,15,0,10,1,4,"00","10","01","04"]
["00-10-02-03",3,null,15,0,10,2,3,"00","10","02","03"]
["00-10-03-02",3,null,15,0,10,3,2,"00","10","03","02"]
["00-10-04-01",3,null,15,0,10,4,1,"00","10","04","01"]
["00-10-05-00",3,null,15,0,10,5,0,"00","10","05","00"]
["00-11-00-04",3,null,15,0,11,0,4,"00","11","00","04"]
["00-11-01-03",3,null,15,0,11,1,3,"00","11","01","03"]
["00-11-02-02",3,null,15,0,11,2,2,"00","11","02","02"]
["00-11-03-01",3,null,15,0,11,3,1,"00","11","03","01"]
["00-11-04-00",3,null,15,0,11,4,0,"00","11","04","00"]
["00-12-00-03",3,null,15,0,12,0,3,"00","12","00","03"]
["00-12-01-02",3,null,15,0,12,1,2,"00","12","01","02"]
["00-12-02-01",3,null,15,0,12,2,1,"00","12","02","01"]
["00-12-03-00",3,null,15,0,12,3,0,"00","12","03","00"]
["00-13-00-02",3,null,15,0,13,0,2,"00","13","00","02"]
["00-13-01-01",2,null,15,0,13,1,1,"00","13","01","01"]
["00-13-02-00",2,null,15,0,13,2,0,"00","13","02","00"]
["00-14-00-01",2,null,15,0,14,0,1,"00","14","00","01"]
["00-14-01-00",2,null,15,0,14,1,0,"00","14","01","00"]
["00-15-00-00",2,null,15,0,15,0,0,"00","15","00","00"]
["01-00-00-14",5,null,15,1,0,0,14,"01","00","00","14"]
["01-00-01-13",5,null,15,1,0,1,13,"01","00","01","13"]
["01-00-02-12",5,null,15,1,0,2,12,"01","00","02","12"]
["01-00-03-11",5,null,15,1,0,3,11,"01","00","03","11"]
["01-00-04-10",5,null,15,1,0,4,10,"01","00","04","10"]
["01-00-05-09",5,null,15,1,0,5,9,"01","00","05","09"]
["01-00-06-08",5,null,15,1,0,6,8,"01","00","06","08"]
["01-00-07-07",5,null,15,1,0,7,7,"01","00","07","07"]
["01-00-08-06",5,null,15,1,0,8,6,"01","00","08","06"]
[{"$f":"I3207&\"-\"&J3207&\"-\"&K3207&\"-\"&L3207","v":"01-00-09-05"},5,null,15,1,0,9,5,"01","00","09","05"]
["01-00-10-04",5,null,15,1,0,10,4,{"$f":"IF(LEN(E3208)=1,0&E3208,IF(LEN(E3208)=0,\"00\",RIGHT(E3208,2)))","v":"01"},{"$f":"IF(LEN(F3208)=1,0&F3208,IF(LEN(F3208)=0,\"00\",RIGHT(F3208,2)))","v":"00"},{"$f":"IF(LEN(G3208)=1,0&G3208,IF(LEN(G3208)=0,\"00\",RIGHT(G3208,2)))","v":"10"},{"$f":"IF(LEN(H3208)=1,0&H3208,IF(LEN(H3208)=0,\"00\",RIGHT(H3208,2)))","v":"04"}]
["01-00-11-03",5,null,15,1,0,11,3,"01","00","11","03"]
["01-00-12-02",4,null,15,1,0,12,2,"01","00","12","02"]
["01-00-13-01",4,null,15,1,0,13,1,"01","00","13","01"]
["01-00-14-00",4,null,15,1,0,14,0,"01","00","14","00"]
["01-01-00-13",5,null,15,1,1,0,13,"01","01","00","13"]
["01-01-01-12",5,null,15,1,1,1,12,"01","01","01","12"]
["01-01-02-11",5,null,15,1,1,2,11,"01","01","02","11"]
["01-01-03-10",5,null,15,1,1,3,10,"01","01","03","10"]
["01-01-04-09",5,null,15,1,1,4,9,"01","01","04","09"]
["01-01-05-08",5,null,15,1,1,5,8,"01","01","05","08"]
["01-01-06-07",5,null,15,1,1,6,7,"01","01","06","07"]
["01-01-07-06",5,null,15,1,1,7,6,"01","01","07","06"]
["01-01-08-05",5,null,15,1,1,8,5,"01","01","08","05"]
["01-01-09-04",5,null,15,1,1,9,4,"01","01","09","04"]
["01-01-10-03",5,null,15,1,1,10,3,"01","01","10","03"]
["01-01-11-02",4,null,15,1,1,11,2,"01","01","11","02"]
["01-01-12-01",4,null,15,1,1,12,1,"01","01","12","01"]
["01-01-13-00",4,null,15,1,1,13,0,"01","01","13","00"]
["01-02-00-12",5,null,15,1,2,0,12,"01","02","00","12"]
["01-02-01-11",5,null,15,1,2,1,11,"01","02","01","11"]
["01-02-02-10",5,null,15,1,2,2,10,"01","02","02","10"]
["01-02-03-09",5,null,15,1,2,3,9,"01","02","03","09"]
["01-02-04-08",5,null,15,1,2,4,8,"01","02","04","08"]
["01-02-05-07",5,null,15,1,2,5,7,"01","02","05","07"]
["01-02-06-06",5,null,15,1,2,6,6,"01","02","06","06"]
["01-02-07-05",5,null,15,1,2,7,5,"01","02","07","05"]
["01-02-08-04",5,null,15,1,2,8,4,"01","02","08","04"]
["01-02-09-03",5,null,15,1,2,9,3,"01","02","09","03"]
["01-02-10-02",4,null,15,1,2,10,2,"01","02","10","02"]
["01-02-11-01",4,null,15,1,2,11,1,"01","02","11","01"]
["01-02-12-00",4,null,15,1,2,12,0,"01","02","12","00"]
["01-03-00-11",5,null,15,1,3,0,11,"01","03","00","11"]
["01-03-01-10",5,null,15,1,3,1,10,"01","03","01","10"]
["01-03-02-09",5,null,15,1,3,2,9,"01","03","02","09"]
["01-03-03-08",5,null,15,1,3,3,8,"01","03","03","08"]
["01-03-04-07",5,null,15,1,3,4,7,"01","03","04","07"]
["01-03-05-06",5,null,15,1,3,5,6,"01","03","05","06"]
["01-03-06-05",5,null,15,1,3,6,5,"01","03","06","05"]
["01-03-07-04",4,null,15,1,3,7,4,"01","03","07","04"]
["01-03-08-03",4,null,15,1,3,8,3,"01","03","08","03"]
["01-03-09-02",4,null,15,1,3,9,2,"01","03","09","02"]
["01-03-10-01",4,null,15,1,3,10,1,"01","03","10","01"]
["01-03-11-00",4,null,15,1,3,11,0,"01","03","11","00"]
["01-04-00-10",5,null,15,1,4,0,10,"01","04","00","10"]
["01-04-01-09",5,null,15,1,4,1,9,"01","04","01","09"]
["01-04-02-08",5,null,15,1,4,2,8,"01","04","02","08"]
["01-04-03-07",5,null,15,1,4,3,7,"01","04","03","07"]
["01-04-04-06",5,null,15,1,4,4,6,"01","04","04","06"]
["01-04-05-05",4,null,15,1,4,5,5,"01","04","05","05"]
["01-04-06-04",4,null,15,1,4,6,4,"01","04","06","04"]
["01-04-07-03",4,null,15,1,4,7,3,"01","04","07","03"]
["01-04-08-02",4,null,15,1,4,8,2,"01","04","08","02"]
["01-04-09-01",4,null,15,1,4,9,1,"01","04","09","01"]
["01-04-10-00",4,null,15,1,4,10,0,"01","04","10","00"]
["01-05-00-09",5,null,15,1,5,0,9,"01","05","00","09"]
["01-05-01-08",5,null,15,1,5,1,8,"01","05","01","08"]
["01-05-02-07",4,null,15,1,5,2,7,"01","05","02","07"]
["01-05-03-06",4,null,15,1,5,3,6,"01","05","03","06"]
["01-05-04-05",4,null,15,1,5,4,5,"01","05","04","05"]
["01-05-05-04",4,null,15,1,5,5,4,"01","05","05","04"]
["01-05-06-03",4,null,15,1,5,6,3,"01","05","06","03"]
["01-05-07-02",4,null,15,1,5,7,2,"01","05","07","02"]
[{"$f":"I3271&\"-\"&J3271&\"-\"&K3271&\"-\"&L3271","v":"01-05-08-01"},4,null,15,1,5,8,1,"01","05","08","01"]
["01-05-09-00",4,null,15,1,5,9,0,{"$f":"IF(LEN(E3272)=1,0&E3272,IF(LEN(E3272)=0,\"00\",RIGHT(E3272,2)))","v":"01"},{"$f":"IF(LEN(F3272)=1,0&F3272,IF(LEN(F3272)=0,\"00\",RIGHT(F3272,2)))","v":"05"},{"$f":"IF(LEN(G3272)=1,0&G3272,IF(LEN(G3272)=0,\"00\",RIGHT(G3272,2)))","v":"09"},{"$f":"IF(LEN(H3272)=1,0&H3272,IF(LEN(H3272)=0,\"00\",RIGHT(H3272,2)))","v":"00"}]
["01-06-00-08",4,null,15,1,6,0,8,"01","06","00","08"]
["01-06-01-07",4,null,15,1,6,1,7,"01","06","01","07"]
["01-06-02-06",4,null,15,1,6,2,6,"01","06","02","06"]
["01-06-03-05",4,null,15,1,6,3,5,"01","06","03","05"]
["01-06-04-04",4,null,15,1,6,4,4,"01","06","04","04"]
["01-06-05-03",4,null,15,1,6,5,3,"01","06","05","03"]
["01-06-06-02",4,null,15,1,6,6,2,"01","06","06","02"]
["01-06-07-01",4,null,15,1,6,7,1,"01","06","07","01"]
["01-06-08-00",4,null,15,1,6,8,0,"01","06","08","00"]
["01-07-00-07",3,null,15,1,7,0,7,"01","07","00","07"]
["01-07-01-06",3,null,15,1,7,1,6,"01","07","01","06"]
["01-07-02-05",3,null,15,1,7,2,5,"01","07","02","05"]
["01-07-03-04",3,null,15,1,7,3,4,"01","07","03","04"]
["01-07-04-03",3,null,15,1,7,4,3,"01","07","04","03"]
["01-07-05-02",3,null,15,1,7,5,2,"01","07","05","02"]
["01-07-06-01",3,null,15,1,7,6,1,"01","07","06","01"]
["01-07-07-00",3,null,15,1,7,7,0,"01","07","07","00"]
["01-08-00-06",3,null,15,1,8,0,6,"01","08","00","06"]
["01-08-01-05",3,null,15,1,8,1,5,"01","08","01","05"]
["01-08-02-04",3,null,15,1,8,2,4,"01","08","02","04"]
["01-08-03-03",3,null,15,1,8,3,3,"01","08","03","03"]
["01-08-04-02",3,null,15,1,8,4,2,"01","08","04","02"]
["01-08-05-01",3,null,15,1,8,5,1,"01","08","05","01"]
["01-08-06-00",3,null,15,1,8,6,0,"01","08","06","00"]
["01-09-00-05",3,null,15,1,9,0,5,"01","09","00","05"]
["01-09-01-04",3,null,15,1,9,1,4,"01","09","01","04"]
["01-09-02-03",3,null,15,1,9,2,3,"01","09","02","03"]
["01-09-03-02",3,null,15,1,9,3,2,"01","09","03","02"]
["01-09-04-01",3,null,15,1,9,4,1,"01","09","04","01"]
["01-09-05-00",3,null,15,1,9,5,0,"01","09","05","00"]
["01-10-00-04",3,null,15,1,10,0,4,"01","10","00","04"]
["01-10-01-03",3,null,15,1,10,1,3,"01","10","01","03"]
["01-10-02-02",3,null,15,1,10,2,2,"01","10","02","02"]
["01-10-03-01",3,null,15,1,10,3,1,"01","10","03","01"]
["01-10-04-00",3,null,15,1,10,4,0,"01","10","04","00"]
["01-11-00-03",3,null,15,1,11,0,3,"01","11","00","03"]
["01-11-01-02",3,null,15,1,11,1,2,"01","11","01","02"]
["01-11-02-01",2,null,15,1,11,2,1,"01","11","02","01"]
["01-11-03-00",2,null,15,1,11,3,0,"01","11","03","00"]
["01-12-00-02",2,null,15,1,12,0,2,"01","12","00","02"]
["01-12-01-01",2,null,15,1,12,1,1,"01","12","01","01"]
["01-12-02-00",2,null,15,1,12,2,0,"01","12","02","00"]
["01-13-00-01",2,null,15,1,13,0,1,"01","13","00","01"]
["01-13-01-00",2,null,15,1,13,1,0,"01","13","01","00"]
["01-14-00-00",2,null,15,1,14,0,0,"01","14","00","00"]
["02-00-00-13",5,null,15,2,0,0,13,"02","00","00","13"]
["02-00-01-12",5,null,15,2,0,1,12,"02","00","01","12"]
["02-00-02-11",5,null,15,2,0,2,11,"02","00","02","11"]
["02-00-03-10",5,null,15,2,0,3,10,"02","00","03","10"]
["02-00-04-09",5,null,15,2,0,4,9,"02","00","04","09"]
["02-00-05-08",5,null,15,2,0,5,8,"02","00","05","08"]
["02-00-06-07",5,null,15,2,0,6,7,"02","00","06","07"]
["02-00-07-06",5,null,15,2,0,7,6,"02","00","07","06"]
["02-00-08-05",5,null,15,2,0,8,5,"02","00","08","05"]
["02-00-09-04",5,null,15,2,0,9,4,"02","00","09","04"]
["02-00-10-03",5,null,15,2,0,10,3,"02","00","10","03"]
["02-00-11-02",4,null,15,2,0,11,2,"02","00","11","02"]
["02-00-12-01",4,null,15,2,0,12,1,"02","00","12","01"]
["02-00-13-00",4,null,15,2,0,13,0,"02","00","13","00"]
["02-01-00-12",5,null,15,2,1,0,12,"02","01","00","12"]
["02-01-01-11",5,null,15,2,1,1,11,"02","01","01","11"]
["02-01-02-10",5,null,15,2,1,2,10,"02","01","02","10"]
[{"$f":"I3335&\"-\"&J3335&\"-\"&K3335&\"-\"&L3335","v":"02-01-03-09"},5,null,15,2,1,3,9,"02","01","03","09"]
["02-01-04-08",5,null,15,2,1,4,8,{"$f":"IF(LEN(E3336)=1,0&E3336,IF(LEN(E3336)=0,\"00\",RIGHT(E3336,2)))","v":"02"},{"$f":"IF(LEN(F3336)=1,0&F3336,IF(LEN(F3336)=0,\"00\",RIGHT(F3336,2)))","v":"01"},{"$f":"IF(LEN(G3336)=1,0&G3336,IF(LEN(G3336)=0,\"00\",RIGHT(G3336,2)))","v":"04"},{"$f":"IF(LEN(H3336)=1,0&H3336,IF(LEN(H3336)=0,\"00\",RIGHT(H3336,2)))","v":"08"}]
["02-01-05-07",5,null,15,2,1,5,7,"02","01","05","07"]
["02-01-06-06",5,null,15,2,1,6,6,"02","01","06","06"]
["02-01-07-05",5,null,15,2,1,7,5,"02","01","07","05"]
["02-01-08-04",4,null,15,2,1,8,4,"02","01","08","04"]
["02-01-09-03",4,null,15,2,1,9,3,"02","01","09","03"]
["02-01-10-02",4,null,15,2,1,10,2,"02","01","10","02"]
["02-01-11-01",4,null,15,2,1,11,1,"02","01","11","01"]
["02-01-12-00",4,null,15,2,1,12,0,"02","01","12","00"]
["02-02-00-11",5,null,15,2,2,0,11,"02","02","00","11"]
["02-02-01-10",5,null,15,2,2,1,10,"02","02","01","10"]
["02-02-02-09",5,null,15,2,2,2,9,"02","02","02","09"]
["02-02-03-08",5,null,15,2,2,3,8,"02","02","03","08"]
["02-02-04-07",5,null,15,2,2,4,7,"02","02","04","07"]
["02-02-05-06",5,null,15,2,2,5,6,"02","02","05","06"]
["02-02-06-05",4,null,15,2,2,6,5,"02","02","06","05"]
["02-02-07-04",4,null,15,2,2,7,4,"02","02","07","04"]
["02-02-08-03",4,null,15,2,2,8,3,"02","02","08","03"]
["02-02-09-02",4,null,15,2,2,9,2,"02","02","09","02"]
["02-02-10-01",4,null,15,2,2,10,1,"02","02","10","01"]
["02-02-11-00",4,null,15,2,2,11,0,"02","02","11","00"]
["02-03-00-10",5,null,15,2,3,0,10,"02","03","00","10"]
["02-03-01-09",5,null,15,2,3,1,9,"02","03","01","09"]
["02-03-02-08",5,null,15,2,3,2,8,"02","03","02","08"]
["02-03-03-07",4,null,15,2,3,3,7,"02","03","03","07"]
["02-03-04-06",4,null,15,2,3,4,6,"02","03","04","06"]
["02-03-05-05",4,null,15,2,3,5,5,"02","03","05","05"]
["02-03-06-04",4,null,15,2,3,6,4,"02","03","06","04"]
["02-03-07-03",4,null,15,2,3,7,3,"02","03","07","03"]
["02-03-08-02",4,null,15,2,3,8,2,"02","03","08","02"]
["02-03-09-01",4,null,15,2,3,9,1,"02","03","09","01"]
["02-03-10-00",4,null,15,2,3,10,0,"02","03","10","00"]
["02-04-00-09",5,null,15,2,4,0,9,"02","04","00","09"]
["02-04-01-08",4,null,15,2,4,1,8,"02","04","01","08"]
["02-04-02-07",4,null,15,2,4,2,7,"02","04","02","07"]
["02-04-03-06",4,null,15,2,4,3,6,"02","04","03","06"]
["02-04-04-05",4,null,15,2,4,4,5,"02","04","04","05"]
["02-04-05-04",4,null,15,2,4,5,4,"02","04","05","04"]
["02-04-06-03",4,null,15,2,4,6,3,"02","04","06","03"]
["02-04-07-02",4,null,15,2,4,7,2,"02","04","07","02"]
["02-04-08-01",4,null,15,2,4,8,1,"02","04","08","01"]
["02-04-09-00",4,null,15,2,4,9,0,"02","04","09","00"]
["02-05-00-08",4,null,15,2,5,0,8,"02","05","00","08"]
["02-05-01-07",4,null,15,2,5,1,7,"02","05","01","07"]
["02-05-02-06",4,null,15,2,5,2,6,"02","05","02","06"]
["02-05-03-05",4,null,15,2,5,3,5,"02","05","03","05"]
["02-05-04-04",4,null,15,2,5,4,4,"02","05","04","04"]
["02-05-05-03",4,null,15,2,5,5,3,"02","05","05","03"]
["02-05-06-02",4,null,15,2,5,6,2,"02","05","06","02"]
["02-05-07-01",4,null,15,2,5,7,1,"02","05","07","01"]
["02-05-08-00",4,null,15,2,5,8,0,"02","05","08","00"]
["02-06-00-07",3,null,15,2,6,0,7,"02","06","00","07"]
["02-06-01-06",3,null,15,2,6,1,6,"02","06","01","06"]
["02-06-02-05",3,null,15,2,6,2,5,"02","06","02","05"]
["02-06-03-04",3,null,15,2,6,3,4,"02","06","03","04"]
["02-06-04-03",3,null,15,2,6,4,3,"02","06","04","03"]
["02-06-05-02",3,null,15,2,6,5,2,"02","06","05","02"]
["02-06-06-01",3,null,15,2,6,6,1,"02","06","06","01"]
["02-06-07-00",3,null,15,2,6,7,0,"02","06","07","00"]
["02-07-00-06",3,null,15,2,7,0,6,"02","07","00","06"]
["02-07-01-05",3,null,15,2,7,1,5,"02","07","01","05"]
["02-07-02-04",3,null,15,2,7,2,4,"02","07","02","04"]
["02-07-03-03",3,null,15,2,7,3,3,"02","07","03","03"]
[{"$f":"I3399&\"-\"&J3399&\"-\"&K3399&\"-\"&L3399","v":"02-07-04-02"},3,null,15,2,7,4,2,"02","07","04","02"]
["02-07-05-01",3,null,15,2,7,5,1,{"$f":"IF(LEN(E3400)=1,0&E3400,IF(LEN(E3400)=0,\"00\",RIGHT(E3400,2)))","v":"02"},{"$f":"IF(LEN(F3400)=1,0&F3400,IF(LEN(F3400)=0,\"00\",RIGHT(F3400,2)))","v":"07"},{"$f":"IF(LEN(G3400)=1,0&G3400,IF(LEN(G3400)=0,\"00\",RIGHT(G3400,2)))","v":"05"},{"$f":"IF(LEN(H3400)=1,0&H3400,IF(LEN(H3400)=0,\"00\",RIGHT(H3400,2)))","v":"01"}]
["02-07-06-00",3,null,15,2,7,6,0,"02","07","06","00"]
["02-08-00-05",3,null,15,2,8,0,5,"02","08","00","05"]
["02-08-01-04",3,null,15,2,8,1,4,"02","08","01","04"]
["02-08-02-03",3,null,15,2,8,2,3,"02","08","02","03"]
["02-08-03-02",3,null,15,2,8,3,2,"02","08","03","02"]
["02-08-04-01",3,null,15,2,8,4,1,"02","08","04","01"]
["02-08-05-00",3,null,15,2,8,5,0,"02","08","05","00"]
["02-09-00-04",3,null,15,2,9,0,4,"02","09","00","04"]
["02-09-01-03",3,null,15,2,9,1,3,"02","09","01","03"]
["02-09-02-02",3,null,15,2,9,2,2,"02","09","02","02"]
["02-09-03-01",3,null,15,2,9,3,1,"02","09","03","01"]
["02-09-04-00",3,null,15,2,9,4,0,"02","09","04","00"]
["02-10-00-03",3,null,15,2,10,0,3,"02","10","00","03"]
["02-10-01-02",2,null,15,2,10,1,2,"02","10","01","02"]
["02-10-02-01",2,null,15,2,10,2,1,"02","10","02","01"]
["02-10-03-00",2,null,15,2,10,3,0,"02","10","03","00"]
["02-11-00-02",2,null,15,2,11,0,2,"02","11","00","02"]
["02-11-01-01",2,null,15,2,11,1,1,"02","11","01","01"]
["02-11-02-00",2,null,15,2,11,2,0,"02","11","02","00"]
["02-12-00-01",2,null,15,2,12,0,1,"02","12","00","01"]
["02-12-01-00",2,null,15,2,12,1,0,"02","12","01","00"]
["02-13-00-00",2,null,15,2,13,0,0,"02","13","00","00"]
["03-00-00-12",5,null,15,3,0,0,12,"03","00","00","12"]
["03-00-01-11",5,null,15,3,0,1,11,"03","00","01","11"]
["03-00-02-10",5,null,15,3,0,2,10,"03","00","02","10"]
["03-00-03-09",5,null,15,3,0,3,9,"03","00","03","09"]
["03-00-04-08",5,null,15,3,0,4,8,"03","00","04","08"]
["03-00-05-07",5,null,15,3,0,5,7,"03","00","05","07"]
["03-00-06-06",5,null,15,3,0,6,6,"03","00","06","06"]
["03-00-07-05",4,null,15,3,0,7,5,"03","00","07","05"]
["03-00-08-04",4,null,15,3,0,8,4,"03","00","08","04"]
["03-00-09-03",4,null,15,3,0,9,3,"03","00","09","03"]
["03-00-10-02",4,null,15,3,0,10,2,"03","00","10","02"]
["03-00-11-01",4,null,15,3,0,11,1,"03","00","11","01"]
["03-00-12-00",4,null,15,3,0,12,0,"03","00","12","00"]
["03-01-00-11",5,null,15,3,1,0,11,"03","01","00","11"]
["03-01-01-10",5,null,15,3,1,1,10,"03","01","01","10"]
["03-01-02-09",5,null,15,3,1,2,9,"03","01","02","09"]
["03-01-03-08",5,null,15,3,1,3,8,"03","01","03","08"]
["03-01-04-07",4,null,15,3,1,4,7,"03","01","04","07"]
["03-01-05-06",4,null,15,3,1,5,6,"03","01","05","06"]
["03-01-06-05",4,null,15,3,1,6,5,"03","01","06","05"]
["03-01-07-04",4,null,15,3,1,7,4,"03","01","07","04"]
["03-01-08-03",4,null,15,3,1,8,3,"03","01","08","03"]
["03-01-09-02",4,null,15,3,1,9,2,"03","01","09","02"]
["03-01-10-01",4,null,15,3,1,10,1,"03","01","10","01"]
["03-01-11-00",4,null,15,3,1,11,0,"03","01","11","00"]
["03-02-00-10",5,null,15,3,2,0,10,"03","02","00","10"]
["03-02-01-09",5,null,15,3,2,1,9,"03","02","01","09"]
["03-02-02-08",4,null,15,3,2,2,8,"03","02","02","08"]
["03-02-03-07",4,null,15,3,2,3,7,"03","02","03","07"]
["03-02-04-06",4,null,15,3,2,4,6,"03","02","04","06"]
["03-02-05-05",4,null,15,3,2,5,5,"03","02","05","05"]
["03-02-06-04",4,null,15,3,2,6,4,"03","02","06","04"]
["03-02-07-03",4,null,15,3,2,7,3,"03","02","07","03"]
["03-02-08-02",4,null,15,3,2,8,2,"03","02","08","02"]
["03-02-09-01",4,null,15,3,2,9,1,"03","02","09","01"]
["03-02-10-00",4,null,15,3,2,10,0,"03","02","10","00"]
["03-03-00-09",4,null,15,3,3,0,9,"03","03","00","09"]
["03-03-01-08",4,null,15,3,3,1,8,"03","03","01","08"]
["03-03-02-07",4,null,15,3,3,2,7,"03","03","02","07"]
["03-03-03-06",4,null,15,3,3,3,6,"03","03","03","06"]
[{"$f":"I3463&\"-\"&J3463&\"-\"&K3463&\"-\"&L3463","v":"03-03-04-05"},4,null,15,3,3,4,5,"03","03","04","05"]
["03-03-05-04",4,null,15,3,3,5,4,{"$f":"IF(LEN(E3464)=1,0&E3464,IF(LEN(E3464)=0,\"00\",RIGHT(E3464,2)))","v":"03"},{"$f":"IF(LEN(F3464)=1,0&F3464,IF(LEN(F3464)=0,\"00\",RIGHT(F3464,2)))","v":"03"},{"$f":"IF(LEN(G3464)=1,0&G3464,IF(LEN(G3464)=0,\"00\",RIGHT(G3464,2)))","v":"05"},{"$f":"IF(LEN(H3464)=1,0&H3464,IF(LEN(H3464)=0,\"00\",RIGHT(H3464,2)))","v":"04"}]
["03-03-06-03",4,null,15,3,3,6,3,"03","03","06","03"]
["03-03-07-02",4,null,15,3,3,7,2,"03","03","07","02"]
["03-03-08-01",4,null,15,3,3,8,1,"03","03","08","01"]
["03-03-09-00",4,null,15,3,3,9,0,"03","03","09","00"]
["03-04-00-08",4,null,15,3,4,0,8,"03","04","00","08"]
["03-04-01-07",4,null,15,3,4,1,7,"03","04","01","07"]
["03-04-02-06",4,null,15,3,4,2,6,"03","04","02","06"]
["03-04-03-05",4,null,15,3,4,3,5,"03","04","03","05"]
["03-04-04-04",4,null,15,3,4,4,4,"03","04","04","04"]
["03-04-05-03",4,null,15,3,4,5,3,"03","04","05","03"]
["03-04-06-02",4,null,15,3,4,6,2,"03","04","06","02"]
["03-04-07-01",4,null,15,3,4,7,1,"03","04","07","01"]
["03-04-08-00",4,null,15,3,4,8,0,"03","04","08","00"]
["03-05-00-07",3,null,15,3,5,0,7,"03","05","00","07"]
["03-05-01-06",3,null,15,3,5,1,6,"03","05","01","06"]
["03-05-02-05",3,null,15,3,5,2,5,"03","05","02","05"]
["03-05-03-04",3,null,15,3,5,3,4,"03","05","03","04"]
["03-05-04-03",3,null,15,3,5,4,3,"03","05","04","03"]
["03-05-05-02",3,null,15,3,5,5,2,"03","05","05","02"]
["03-05-06-01",3,null,15,3,5,6,1,"03","05","06","01"]
["03-05-07-00",3,null,15,3,5,7,0,"03","05","07","00"]
["03-06-00-06",3,null,15,3,6,0,6,"03","06","00","06"]
["03-06-01-05",3,null,15,3,6,1,5,"03","06","01","05"]
["03-06-02-04",3,null,15,3,6,2,4,"03","06","02","04"]
["03-06-03-03",3,null,15,3,6,3,3,"03","06","03","03"]
["03-06-04-02",3,null,15,3,6,4,2,"03","06","04","02"]
["03-06-05-01",3,null,15,3,6,5,1,"03","06","05","01"]
["03-06-06-00",3,null,15,3,6,6,0,"03","06","06","00"]
["03-07-00-05",3,null,15,3,7,0,5,"03","07","00","05"]
["03-07-01-04",3,null,15,3,7,1,4,"03","07","01","04"]
["03-07-02-03",3,null,15,3,7,2,3,"03","07","02","03"]
["03-07-03-02",3,null,15,3,7,3,2,"03","07","03","02"]
["03-07-04-01",3,null,15,3,7,4,1,"03","07","04","01"]
["03-07-05-00",3,null,15,3,7,5,0,"03","07","05","00"]
["03-08-00-04",3,null,15,3,8,0,4,"03","08","00","04"]
["03-08-01-03",3,null,15,3,8,1,3,"03","08","01","03"]
["03-08-02-02",3,null,15,3,8,2,2,"03","08","02","02"]
["03-08-03-01",3,null,15,3,8,3,1,"03","08","03","01"]
["03-08-04-00",3,null,15,3,8,4,0,"03","08","04","00"]
["03-09-00-03",3,null,15,3,9,0,3,"03","09","00","03"]
["03-09-01-02",2,null,15,3,9,1,2,"03","09","01","02"]
["03-09-02-01",2,null,15,3,9,2,1,"03","09","02","01"]
["03-09-03-00",2,null,15,3,9,3,0,"03","09","03","00"]
["03-10-00-02",2,null,15,3,10,0,2,"03","10","00","02"]
["03-10-01-01",2,null,15,3,10,1,1,"03","10","01","01"]
["03-10-02-00",2,null,15,3,10,2,0,"03","10","02","00"]
["03-11-00-01",2,null,15,3,11,0,1,"03","11","00","01"]
["03-11-01-00",2,null,15,3,11,1,0,"03","11","01","00"]
["03-12-00-00",2,null,15,3,12,0,0,"03","12","00","00"]
["04-00-00-11",5,null,15,4,0,0,11,"04","00","00","11"]
["04-00-01-10",5,null,15,4,0,1,10,"04","00","01","10"]
["04-00-02-09",5,null,15,4,0,2,9,"04","00","02","09"]
["04-00-03-08",4,null,15,4,0,3,8,"04","00","03","08"]
["04-00-04-07",4,null,15,4,0,4,7,"04","00","04","07"]
["04-00-05-06",4,null,15,4,0,5,6,"04","00","05","06"]
["04-00-06-05",4,null,15,4,0,6,5,"04","00","06","05"]
["04-00-07-04",4,null,15,4,0,7,4,"04","00","07","04"]
["04-00-08-03",4,null,15,4,0,8,3,"04","00","08","03"]
["04-00-09-02",4,null,15,4,0,9,2,"04","00","09","02"]
["04-00-10-01",4,null,15,4,0,10,1,"04","00","10","01"]
["04-00-11-00",4,null,15,4,0,11,0,"04","00","11","00"]
["04-01-00-10",4,null,15,4,1,0,10,"04","01","00","10"]
[{"$f":"I3527&\"-\"&J3527&\"-\"&K3527&\"-\"&L3527","v":"04-01-01-09"},4,null,15,4,1,1,9,"04","01","01","09"]
["04-01-02-08",4,null,15,4,1,2,8,{"$f":"IF(LEN(E3528)=1,0&E3528,IF(LEN(E3528)=0,\"00\",RIGHT(E3528,2)))","v":"04"},{"$f":"IF(LEN(F3528)=1,0&F3528,IF(LEN(F3528)=0,\"00\",RIGHT(F3528,2)))","v":"01"},{"$f":"IF(LEN(G3528)=1,0&G3528,IF(LEN(G3528)=0,\"00\",RIGHT(G3528,2)))","v":"02"},{"$f":"IF(LEN(H3528)=1,0&H3528,IF(LEN(H3528)=0,\"00\",RIGHT(H3528,2)))","v":"08"}]
["04-01-03-07",4,null,15,4,1,3,7,"04","01","03","07"]
["04-01-04-06",4,null,15,4,1,4,6,"04","01","04","06"]
["04-01-05-05",4,null,15,4,1,5,5,"04","01","05","05"]
["04-01-06-04",4,null,15,4,1,6,4,"04","01","06","04"]
["04-01-07-03",4,null,15,4,1,7,3,"04","01","07","03"]
["04-01-08-02",4,null,15,4,1,8,2,"04","01","08","02"]
["04-01-09-01",4,null,15,4,1,9,1,"04","01","09","01"]
["04-01-10-00",4,null,15,4,1,10,0,"04","01","10","00"]
["04-02-00-09",4,null,15,4,2,0,9,"04","02","00","09"]
["04-02-01-08",4,null,15,4,2,1,8,"04","02","01","08"]
["04-02-02-07",4,null,15,4,2,2,7,"04","02","02","07"]
["04-02-03-06",4,null,15,4,2,3,6,"04","02","03","06"]
["04-02-04-05",4,null,15,4,2,4,5,"04","02","04","05"]
["04-02-05-04",4,null,15,4,2,5,4,"04","02","05","04"]
["04-02-06-03",4,null,15,4,2,6,3,"04","02","06","03"]
["04-02-07-02",4,null,15,4,2,7,2,"04","02","07","02"]
["04-02-08-01",4,null,15,4,2,8,1,"04","02","08","01"]
["04-02-09-00",4,null,15,4,2,9,0,"04","02","09","00"]
["04-03-00-08",4,null,15,4,3,0,8,"04","03","00","08"]
["04-03-01-07",4,null,15,4,3,1,7,"04","03","01","07"]
["04-03-02-06",4,null,15,4,3,2,6,"04","03","02","06"]
["04-03-03-05",4,null,15,4,3,3,5,"04","03","03","05"]
["04-03-04-04",4,null,15,4,3,4,4,"04","03","04","04"]
["04-03-05-03",4,null,15,4,3,5,3,"04","03","05","03"]
["04-03-06-02",4,null,15,4,3,6,2,"04","03","06","02"]
["04-03-07-01",4,null,15,4,3,7,1,"04","03","07","01"]
["04-03-08-00",4,null,15,4,3,8,0,"04","03","08","00"]
["04-04-00-07",3,null,15,4,4,0,7,"04","04","00","07"]
["04-04-01-06",3,null,15,4,4,1,6,"04","04","01","06"]
["04-04-02-05",3,null,15,4,4,2,5,"04","04","02","05"]
["04-04-03-04",3,null,15,4,4,3,4,"04","04","03","04"]
["04-04-04-03",3,null,15,4,4,4,3,"04","04","04","03"]
["04-04-05-02",3,null,15,4,4,5,2,"04","04","05","02"]
["04-04-06-01",3,null,15,4,4,6,1,"04","04","06","01"]
["04-04-07-00",3,null,15,4,4,7,0,"04","04","07","00"]
["04-05-00-06",3,null,15,4,5,0,6,"04","05","00","06"]
["04-05-01-05",3,null,15,4,5,1,5,"04","05","01","05"]
["04-05-02-04",3,null,15,4,5,2,4,"04","05","02","04"]
["04-05-03-03",3,null,15,4,5,3,3,"04","05","03","03"]
["04-05-04-02",3,null,15,4,5,4,2,"04","05","04","02"]
["04-05-05-01",3,null,15,4,5,5,1,"04","05","05","01"]
["04-05-06-00",3,null,15,4,5,6,0,"04","05","06","00"]
["04-06-00-05",3,null,15,4,6,0,5,"04","06","00","05"]
["04-06-01-04",3,null,15,4,6,1,4,"04","06","01","04"]
["04-06-02-03",3,null,15,4,6,2,3,"04","06","02","03"]
["04-06-03-02",3,null,15,4,6,3,2,"04","06","03","02"]
["04-06-04-01",3,null,15,4,6,4,1,"04","06","04","01"]
["04-06-05-00",3,null,15,4,6,5,0,"04","06","05","00"]
["04-07-00-04",3,null,15,4,7,0,4,"04","07","00","04"]
["04-07-01-03",3,null,15,4,7,1,3,"04","07","01","03"]
["04-07-02-02",3,null,15,4,7,2,2,"04","07","02","02"]
["04-07-03-01",3,null,15,4,7,3,1,"04","07","03","01"]
["04-07-04-00",3,null,15,4,7,4,0,"04","07","04","00"]
["04-08-00-03",3,null,15,4,8,0,3,"04","08","00","03"]
["04-08-01-02",2,null,15,4,8,1,2,"04","08","01","02"]
["04-08-02-01",2,null,15,4,8,2,1,"04","08","02","01"]
["04-08-03-00",2,null,15,4,8,3,0,"04","08","03","00"]
["04-09-00-02",2,null,15,4,9,0,2,"04","09","00","02"]
["04-09-01-01",2,null,15,4,9,1,1,"04","09","01","01"]
["04-09-02-00",2,null,15,4,9,2,0,"04","09","02","00"]
["04-10-00-01",2,null,15,4,10,0,1,"04","10","00","01"]
["04-10-01-00",2,null,15,4,10,1,0,"04","10","01","00"]
[{"$f":"I3591&\"-\"&J3591&\"-\"&K3591&\"-\"&L3591","v":"04-11-00-00"},2,null,15,4,11,0,0,"04","11","00","00"]
["05-00-00-10",4,null,15,5,0,0,10,{"$f":"IF(LEN(E3592)=1,0&E3592,IF(LEN(E3592)=0,\"00\",RIGHT(E3592,2)))","v":"05"},{"$f":"IF(LEN(F3592)=1,0&F3592,IF(LEN(F3592)=0,\"00\",RIGHT(F3592,2)))","v":"00"},{"$f":"IF(LEN(G3592)=1,0&G3592,IF(LEN(G3592)=0,\"00\",RIGHT(G3592,2)))","v":"00"},{"$f":"IF(LEN(H3592)=1,0&H3592,IF(LEN(H3592)=0,\"00\",RIGHT(H3592,2)))","v":"10"}]
["05-00-01-09",4,null,15,5,0,1,9,"05","00","01","09"]
["05-00-02-08",4,null,15,5,0,2,8,"05","00","02","08"]
["05-00-03-07",4,null,15,5,0,3,7,"05","00","03","07"]
["05-00-04-06",4,null,15,5,0,4,6,"05","00","04","06"]
["05-00-05-05",4,null,15,5,0,5,5,"05","00","05","05"]
["05-00-06-04",4,null,15,5,0,6,4,"05","00","06","04"]
["05-00-07-03",4,null,15,5,0,7,3,"05","00","07","03"]
["05-00-08-02",4,null,15,5,0,8,2,"05","00","08","02"]
["05-00-09-01",4,null,15,5,0,9,1,"05","00","09","01"]
["05-00-10-00",4,null,15,5,0,10,0,"05","00","10","00"]
["05-01-00-09",4,null,15,5,1,0,9,"05","01","00","09"]
["05-01-01-08",4,null,15,5,1,1,8,"05","01","01","08"]
["05-01-02-07",4,null,15,5,1,2,7,"05","01","02","07"]
["05-01-03-06",4,null,15,5,1,3,6,"05","01","03","06"]
["05-01-04-05",4,null,15,5,1,4,5,"05","01","04","05"]
["05-01-05-04",4,null,15,5,1,5,4,"05","01","05","04"]
["05-01-06-03",4,null,15,5,1,6,3,"05","01","06","03"]
["05-01-07-02",4,null,15,5,1,7,2,"05","01","07","02"]
["05-01-08-01",4,null,15,5,1,8,1,"05","01","08","01"]
["05-01-09-00",4,null,15,5,1,9,0,"05","01","09","00"]
["05-02-00-08",4,null,15,5,2,0,8,"05","02","00","08"]
["05-02-01-07",4,null,15,5,2,1,7,"05","02","01","07"]
["05-02-02-06",4,null,15,5,2,2,6,"05","02","02","06"]
["05-02-03-05",4,null,15,5,2,3,5,"05","02","03","05"]
["05-02-04-04",4,null,15,5,2,4,4,"05","02","04","04"]
["05-02-05-03",4,null,15,5,2,5,3,"05","02","05","03"]
["05-02-06-02",4,null,15,5,2,6,2,"05","02","06","02"]
["05-02-07-01",4,null,15,5,2,7,1,"05","02","07","01"]
["05-02-08-00",4,null,15,5,2,8,0,"05","02","08","00"]
["05-03-00-07",3,null,15,5,3,0,7,"05","03","00","07"]
["05-03-01-06",3,null,15,5,3,1,6,"05","03","01","06"]
["05-03-02-05",3,null,15,5,3,2,5,"05","03","02","05"]
["05-03-03-04",3,null,15,5,3,3,4,"05","03","03","04"]
["05-03-04-03",3,null,15,5,3,4,3,"05","03","04","03"]
["05-03-05-02",3,null,15,5,3,5,2,"05","03","05","02"]
["05-03-06-01",3,null,15,5,3,6,1,"05","03","06","01"]
["05-03-07-00",3,null,15,5,3,7,0,"05","03","07","00"]
["05-04-00-06",3,null,15,5,4,0,6,"05","04","00","06"]
["05-04-01-05",3,null,15,5,4,1,5,"05","04","01","05"]
["05-04-02-04",3,null,15,5,4,2,4,"05","04","02","04"]
["05-04-03-03",3,null,15,5,4,3,3,"05","04","03","03"]
["05-04-04-02",3,null,15,5,4,4,2,"05","04","04","02"]
["05-04-05-01",3,null,15,5,4,5,1,"05","04","05","01"]
["05-04-06-00",3,null,15,5,4,6,0,"05","04","06","00"]
["05-05-00-05",3,null,15,5,5,0,5,"05","05","00","05"]
["05-05-01-04",3,null,15,5,5,1,4,"05","05","01","04"]
["05-05-02-03",3,null,15,5,5,2,3,"05","05","02","03"]
["05-05-03-02",3,null,15,5,5,3,2,"05","05","03","02"]
["05-05-04-01",3,null,15,5,5,4,1,"05","05","04","01"]
["05-05-05-00",3,null,15,5,5,5,0,"05","05","05","00"]
["05-06-00-04",3,null,15,5,6,0,4,"05","06","00","04"]
["05-06-01-03",3,null,15,5,6,1,3,"05","06","01","03"]
["05-06-02-02",3,null,15,5,6,2,2,"05","06","02","02"]
["05-06-03-01",3,null,15,5,6,3,1,"05","06","03","01"]
["05-06-04-00",3,null,15,5,6,4,0,"05","06","04","00"]
["05-07-00-03",3,null,15,5,7,0,3,"05","07","00","03"]
["05-07-01-02",2,null,15,5,7,1,2,"05","07","01","02"]
["05-07-02-01",2,null,15,5,7,2,1,"05","07","02","01"]
["05-07-03-00",2,null,15,5,7,3,0,"05","07","03","00"]
["05-08-00-02",2,null,15,5,8,0,2,"05","08","00","02"]
["05-08-01-01",2,null,15,5,8,1,1,"05","08","01","01"]
["05-08-02-00",2,null,15,5,8,2,0,"05","08","02","00"]
[{"$f":"I3655&\"-\"&J3655&\"-\"&K3655&\"-\"&L3655","v":"05-09-00-01"},2,null,15,5,9,0,1,"05","09","00","01"]
["05-09-01-00",2,null,15,5,9,1,0,{"$f":"IF(LEN(E3656)=1,0&E3656,IF(LEN(E3656)=0,\"00\",RIGHT(E3656,2)))","v":"05"},{"$f":"IF(LEN(F3656)=1,0&F3656,IF(LEN(F3656)=0,\"00\",RIGHT(F3656,2)))","v":"09"},{"$f":"IF(LEN(G3656)=1,0&G3656,IF(LEN(G3656)=0,\"00\",RIGHT(G3656,2)))","v":"01"},{"$f":"IF(LEN(H3656)=1,0&H3656,IF(LEN(H3656)=0,\"00\",RIGHT(H3656,2)))","v":"00"}]
["05-10-00-00",2,null,15,5,10,0,0,"05","10","00","00"]
["06-00-00-09",4,null,15,6,0,0,9,"06","00","00","09"]
["06-00-01-08",4,null,15,6,0,1,8,"06","00","01","08"]
["06-00-02-07",4,null,15,6,0,2,7,"06","00","02","07"]
["06-00-03-06",4,null,15,6,0,3,6,"06","00","03","06"]
["06-00-04-05",4,null,15,6,0,4,5,"06","00","04","05"]
["06-00-05-04",4,null,15,6,0,5,4,"06","00","05","04"]
["06-00-06-03",4,null,15,6,0,6,3,"06","00","06","03"]
["06-00-07-02",4,null,15,6,0,7,2,"06","00","07","02"]
["06-00-08-01",4,null,15,6,0,8,1,"06","00","08","01"]
["06-00-09-00",4,null,15,6,0,9,0,"06","00","09","00"]
["06-01-00-08",4,null,15,6,1,0,8,"06","01","00","08"]
["06-01-01-07",4,null,15,6,1,1,7,"06","01","01","07"]
["06-01-02-06",4,null,15,6,1,2,6,"06","01","02","06"]
["06-01-03-05",4,null,15,6,1,3,5,"06","01","03","05"]
["06-01-04-04",4,null,15,6,1,4,4,"06","01","04","04"]
["06-01-05-03",4,null,15,6,1,5,3,"06","01","05","03"]
["06-01-06-02",4,null,15,6,1,6,2,"06","01","06","02"]
["06-01-07-01",3,null,15,6,1,7,1,"06","01","07","01"]
["06-01-08-00",3,null,15,6,1,8,0,"06","01","08","00"]
["06-02-00-07",3,null,15,6,2,0,7,"06","02","00","07"]
["06-02-01-06",3,null,15,6,2,1,6,"06","02","01","06"]
["06-02-02-05",3,null,15,6,2,2,5,"06","02","02","05"]
["06-02-03-04",3,null,15,6,2,3,4,"06","02","03","04"]
["06-02-04-03",3,null,15,6,2,4,3,"06","02","04","03"]
["06-02-05-02",3,null,15,6,2,5,2,"06","02","05","02"]
["06-02-06-01",3,null,15,6,2,6,1,"06","02","06","01"]
["06-02-07-00",3,null,15,6,2,7,0,"06","02","07","00"]
["06-03-00-06",3,null,15,6,3,0,6,"06","03","00","06"]
["06-03-01-05",3,null,15,6,3,1,5,"06","03","01","05"]
["06-03-02-04",3,null,15,6,3,2,4,"06","03","02","04"]
["06-03-03-03",3,null,15,6,3,3,3,"06","03","03","03"]
["06-03-04-02",3,null,15,6,3,4,2,"06","03","04","02"]
["06-03-05-01",3,null,15,6,3,5,1,"06","03","05","01"]
["06-03-06-00",3,null,15,6,3,6,0,"06","03","06","00"]
["06-04-00-05",3,null,15,6,4,0,5,"06","04","00","05"]
["06-04-01-04",3,null,15,6,4,1,4,"06","04","01","04"]
["06-04-02-03",3,null,15,6,4,2,3,"06","04","02","03"]
["06-04-03-02",3,null,15,6,4,3,2,"06","04","03","02"]
["06-04-04-01",3,null,15,6,4,4,1,"06","04","04","01"]
["06-04-05-00",3,null,15,6,4,5,0,"06","04","05","00"]
["06-05-00-04",3,null,15,6,5,0,4,"06","05","00","04"]
["06-05-01-03",3,null,15,6,5,1,3,"06","05","01","03"]
["06-05-02-02",3,null,15,6,5,2,2,"06","05","02","02"]
["06-05-03-01",3,null,15,6,5,3,1,"06","05","03","01"]
["06-05-04-00",3,null,15,6,5,4,0,"06","05","04","00"]
["06-06-00-03",3,null,15,6,6,0,3,"06","06","00","03"]
["06-06-01-02",2,null,15,6,6,1,2,"06","06","01","02"]
["06-06-02-01",2,null,15,6,6,2,1,"06","06","02","01"]
["06-06-03-00",2,null,15,6,6,3,0,"06","06","03","00"]
["06-07-00-02",2,null,15,6,7,0,2,"06","07","00","02"]
["06-07-01-01",2,null,15,6,7,1,1,"06","07","01","01"]
["06-07-02-00",2,null,15,6,7,2,0,"06","07","02","00"]
["06-08-00-01",2,null,15,6,8,0,1,"06","08","00","01"]
["06-08-01-00",2,null,15,6,8,1,0,"06","08","01","00"]
["06-09-00-00",2,null,15,6,9,0,0,"06","09","00","00"]
["07-00-00-08",4,null,15,7,0,0,8,"07","00","00","08"]
["07-00-01-07",4,null,15,7,0,1,7,"07","00","01","07"]
["07-00-02-06",4,null,15,7,0,2,6,"07","00","02","06"]
["07-00-03-05",4,null,15,7,0,3,5,"07","00","03","05"]
["07-00-04-04",4,null,15,7,0,4,4,"07","00","04","04"]
["07-00-05-03",4,null,15,7,0,5,3,"07","00","05","03"]
[{"$f":"I3719&\"-\"&J3719&\"-\"&K3719&\"-\"&L3719","v":"07-00-06-02"},3,null,15,7,0,6,2,"07","00","06","02"]
["07-00-07-01",3,null,15,7,0,7,1,{"$f":"IF(LEN(E3720)=1,0&E3720,IF(LEN(E3720)=0,\"00\",RIGHT(E3720,2)))","v":"07"},{"$f":"IF(LEN(F3720)=1,0&F3720,IF(LEN(F3720)=0,\"00\",RIGHT(F3720,2)))","v":"00"},{"$f":"IF(LEN(G3720)=1,0&G3720,IF(LEN(G3720)=0,\"00\",RIGHT(G3720,2)))","v":"07"},{"$f":"IF(LEN(H3720)=1,0&H3720,IF(LEN(H3720)=0,\"00\",RIGHT(H3720,2)))","v":"01"}]
["07-00-08-00",3,null,15,7,0,8,0,"07","00","08","00"]
["07-01-00-07",3,null,15,7,1,0,7,"07","01","00","07"]
["07-01-01-06",3,null,15,7,1,1,6,"07","01","01","06"]
["07-01-02-05",3,null,15,7,1,2,5,"07","01","02","05"]
["07-01-03-04",3,null,15,7,1,3,4,"07","01","03","04"]
["07-01-04-03",3,null,15,7,1,4,3,"07","01","04","03"]
["07-01-05-02",3,null,15,7,1,5,2,"07","01","05","02"]
["07-01-06-01",3,null,15,7,1,6,1,"07","01","06","01"]
["07-01-07-00",3,null,15,7,1,7,0,"07","01","07","00"]
["07-02-00-06",3,null,15,7,2,0,6,"07","02","00","06"]
["07-02-01-05",3,null,15,7,2,1,5,"07","02","01","05"]
["07-02-02-04",3,null,15,7,2,2,4,"07","02","02","04"]
["07-02-03-03",3,null,15,7,2,3,3,"07","02","03","03"]
["07-02-04-02",3,null,15,7,2,4,2,"07","02","04","02"]
["07-02-05-01",3,null,15,7,2,5,1,"07","02","05","01"]
["07-02-06-00",3,null,15,7,2,6,0,"07","02","06","00"]
["07-03-00-05",3,null,15,7,3,0,5,"07","03","00","05"]
["07-03-01-04",3,null,15,7,3,1,4,"07","03","01","04"]
["07-03-02-03",3,null,15,7,3,2,3,"07","03","02","03"]
["07-03-03-02",3,null,15,7,3,3,2,"07","03","03","02"]
["07-03-04-01",3,null,15,7,3,4,1,"07","03","04","01"]
["07-03-05-00",3,null,15,7,3,5,0,"07","03","05","00"]
["07-04-00-04",3,null,15,7,4,0,4,"07","04","00","04"]
["07-04-01-03",3,null,15,7,4,1,3,"07","04","01","03"]
["07-04-02-02",3,null,15,7,4,2,2,"07","04","02","02"]
["07-04-03-01",3,null,15,7,4,3,1,"07","04","03","01"]
["07-04-04-00",3,null,15,7,4,4,0,"07","04","04","00"]
["07-05-00-03",3,null,15,7,5,0,3,"07","05","00","03"]
["07-05-01-02",2,null,15,7,5,1,2,"07","05","01","02"]
["07-05-02-01",2,null,15,7,5,2,1,"07","05","02","01"]
["07-05-03-00",2,null,15,7,5,3,0,"07","05","03","00"]
["07-06-00-02",2,null,15,7,6,0,2,"07","06","00","02"]
["07-06-01-01",2,null,15,7,6,1,1,"07","06","01","01"]
["07-06-02-00",2,null,15,7,6,2,0,"07","06","02","00"]
["07-07-00-01",2,null,15,7,7,0,1,"07","07","00","01"]
["07-07-01-00",2,null,15,7,7,1,0,"07","07","01","00"]
["07-08-00-00",2,null,15,7,8,0,0,"07","08","00","00"]
["08-00-00-07",3,null,15,8,0,0,7,"08","00","00","07"]
["08-00-01-06",3,null,15,8,0,1,6,"08","00","01","06"]
["08-00-02-05",3,null,15,8,0,2,5,"08","00","02","05"]
["08-00-03-04",3,null,15,8,0,3,4,"08","00","03","04"]
["08-00-04-03",3,null,15,8,0,4,3,"08","00","04","03"]
["08-00-05-02",3,null,15,8,0,5,2,"08","00","05","02"]
["08-00-06-01",3,null,15,8,0,6,1,"08","00","06","01"]
["08-00-07-00",3,null,15,8,0,7,0,"08","00","07","00"]
["08-01-00-06",3,null,15,8,1,0,6,"08","01","00","06"]
["08-01-01-05",3,null,15,8,1,1,5,"08","01","01","05"]
["08-01-02-04",3,null,15,8,1,2,4,"08","01","02","04"]
["08-01-03-03",3,null,15,8,1,3,3,"08","01","03","03"]
["08-01-04-02",3,null,15,8,1,4,2,"08","01","04","02"]
["08-01-05-01",3,null,15,8,1,5,1,"08","01","05","01"]
["08-01-06-00",3,null,15,8,1,6,0,"08","01","06","00"]
["08-02-00-05",3,null,15,8,2,0,5,"08","02","00","05"]
["08-02-01-04",3,null,15,8,2,1,4,"08","02","01","04"]
["08-02-02-03",3,null,15,8,2,2,3,"08","02","02","03"]
["08-02-03-02",3,null,15,8,2,3,2,"08","02","03","02"]
["08-02-04-01",3,null,15,8,2,4,1,"08","02","04","01"]
["08-02-05-00",3,null,15,8,2,5,0,"08","02","05","00"]
["08-03-00-04",3,null,15,8,3,0,4,"08","03","00","04"]
["08-03-01-03",3,null,15,8,3,1,3,"08","03","01","03"]
["08-03-02-02",3,null,15,8,3,2,2,"08","03","02","02"]
["08-03-03-01",3,null,15,8,3,3,1,"08","03","03","01"]
[{"$f":"I3783&\"-\"&J3783&\"-\"&K3783&\"-\"&L3783","v":"08-03-04-00"},3,null,15,8,3,4,0,"08","03","04","00"]
["08-04-00-03",3,null,15,8,4,0,3,{"$f":"IF(LEN(E3784)=1,0&E3784,IF(LEN(E3784)=0,\"00\",RIGHT(E3784,2)))","v":"08"},{"$f":"IF(LEN(F3784)=1,0&F3784,IF(LEN(F3784)=0,\"00\",RIGHT(F3784,2)))","v":"04"},{"$f":"IF(LEN(G3784)=1,0&G3784,IF(LEN(G3784)=0,\"00\",RIGHT(G3784,2)))","v":"00"},{"$f":"IF(LEN(H3784)=1,0&H3784,IF(LEN(H3784)=0,\"00\",RIGHT(H3784,2)))","v":"03"}]
["08-04-01-02",2,null,15,8,4,1,2,"08","04","01","02"]
["08-04-02-01",2,null,15,8,4,2,1,"08","04","02","01"]
["08-04-03-00",2,null,15,8,4,3,0,"08","04","03","00"]
["08-05-00-02",2,null,15,8,5,0,2,"08","05","00","02"]
["08-05-01-01",2,null,15,8,5,1,1,"08","05","01","01"]
["08-05-02-00",2,null,15,8,5,2,0,"08","05","02","00"]
["08-06-00-01",2,null,15,8,6,0,1,"08","06","00","01"]
["08-06-01-00",2,null,15,8,6,1,0,"08","06","01","00"]
["08-07-00-00",2,null,15,8,7,0,0,"08","07","00","00"]
["09-00-00-06",3,null,15,9,0,0,6,"09","00","00","06"]
["09-00-01-05",3,null,15,9,0,1,5,"09","00","01","05"]
["09-00-02-04",3,null,15,9,0,2,4,"09","00","02","04"]
["09-00-03-03",3,null,15,9,0,3,3,"09","00","03","03"]
["09-00-04-02",3,null,15,9,0,4,2,"09","00","04","02"]
["09-00-05-01",3,null,15,9,0,5,1,"09","00","05","01"]
["09-00-06-00",3,null,15,9,0,6,0,"09","00","06","00"]
["09-01-00-05",3,null,15,9,1,0,5,"09","01","00","05"]
["09-01-01-04",3,null,15,9,1,1,4,"09","01","01","04"]
["09-01-02-03",3,null,15,9,1,2,3,"09","01","02","03"]
["09-01-03-02",3,null,15,9,1,3,2,"09","01","03","02"]
["09-01-04-01",3,null,15,9,1,4,1,"09","01","04","01"]
["09-01-05-00",3,null,15,9,1,5,0,"09","01","05","00"]
["09-02-00-04",3,null,15,9,2,0,4,"09","02","00","04"]
["09-02-01-03",3,null,15,9,2,1,3,"09","02","01","03"]
["09-02-02-02",3,null,15,9,2,2,2,"09","02","02","02"]
["09-02-03-01",3,null,15,9,2,3,1,"09","02","03","01"]
["09-02-04-00",3,null,15,9,2,4,0,"09","02","04","00"]
["09-03-00-03",3,null,15,9,3,0,3,"09","03","00","03"]
["09-03-01-02",2,null,15,9,3,1,2,"09","03","01","02"]
["09-03-02-01",2,null,15,9,3,2,1,"09","03","02","01"]
["09-03-03-00",2,null,15,9,3,3,0,"09","03","03","00"]
["09-04-00-02",2,null,15,9,4,0,2,"09","04","00","02"]
["09-04-01-01",2,null,15,9,4,1,1,"09","04","01","01"]
["09-04-02-00",2,null,15,9,4,2,0,"09","04","02","00"]
["09-05-00-01",2,null,15,9,5,0,1,"09","05","00","01"]
["09-05-01-00",2,null,15,9,5,1,0,"09","05","01","00"]
["09-06-00-00",2,null,15,9,6,0,0,"09","06","00","00"]
["10-00-00-05",3,null,15,10,0,0,5,"10","00","00","05"]
["10-00-01-04",3,null,15,10,0,1,4,"10","00","01","04"]
["10-00-02-03",3,null,15,10,0,2,3,"10","00","02","03"]
["10-00-03-02",3,null,15,10,0,3,2,"10","00","03","02"]
["10-00-04-01",3,null,15,10,0,4,1,"10","00","04","01"]
["10-00-05-00",3,null,15,10,0,5,0,"10","00","05","00"]
["10-01-00-04",3,null,15,10,1,0,4,"10","01","00","04"]
["10-01-01-03",3,null,15,10,1,1,3,"10","01","01","03"]
["10-01-02-02",3,null,15,10,1,2,2,"10","01","02","02"]
["10-01-03-01",3,null,15,10,1,3,1,"10","01","03","01"]
["10-01-04-00",3,null,15,10,1,4,0,"10","01","04","00"]
["10-02-00-03",3,null,15,10,2,0,3,"10","02","00","03"]
["10-02-01-02",2,null,15,10,2,1,2,"10","02","01","02"]
["10-02-02-01",2,null,15,10,2,2,1,"10","02","02","01"]
["10-02-03-00",2,null,15,10,2,3,0,"10","02","03","00"]
["10-03-00-02",2,null,15,10,3,0,2,"10","03","00","02"]
["10-03-01-01",2,null,15,10,3,1,1,"10","03","01","01"]
["10-03-02-00",2,null,15,10,3,2,0,"10","03","02","00"]
["10-04-00-01",2,null,15,10,4,0,1,"10","04","00","01"]
["10-04-01-00",2,null,15,10,4,1,0,"10","04","01","00"]
["10-05-00-00",2,null,15,10,5,0,0,"10","05","00","00"]
["11-00-00-04",3,null,15,11,0,0,4,"11","00","00","04"]
["11-00-01-03",3,null,15,11,0,1,3,"11","00","01","03"]
["11-00-02-02",3,null,15,11,0,2,2,"11","00","02","02"]
["11-00-03-01",3,null,15,11,0,3,1,"11","00","03","01"]
[{"$f":"I3847&\"-\"&J3847&\"-\"&K3847&\"-\"&L3847","v":"11-00-04-00"},3,null,15,11,0,4,0,"11","00","04","00"]
["11-01-00-03",3,null,15,11,1,0,3,{"$f":"IF(LEN(E3848)=1,0&E3848,IF(LEN(E3848)=0,\"00\",RIGHT(E3848,2)))","v":"11"},{"$f":"IF(LEN(F3848)=1,0&F3848,IF(LEN(F3848)=0,\"00\",RIGHT(F3848,2)))","v":"01"},{"$f":"IF(LEN(G3848)=1,0&G3848,IF(LEN(G3848)=0,\"00\",RIGHT(G3848,2)))","v":"00"},{"$f":"IF(LEN(H3848)=1,0&H3848,IF(LEN(H3848)=0,\"00\",RIGHT(H3848,2)))","v":"03"}]
["11-01-01-02",2,null,15,11,1,1,2,"11","01","01","02"]
["11-01-02-01",2,null,15,11,1,2,1,"11","01","02","01"]
["11-01-03-00",2,null,15,11,1,3,0,"11","01","03","00"]
["11-02-00-02",2,null,15,11,2,0,2,"11","02","00","02"]
["11-02-01-01",2,null,15,11,2,1,1,"11","02","01","01"]
["11-02-02-00",2,null,15,11,2,2,0,"11","02","02","00"]
["11-03-00-01",2,null,15,11,3,0,1,"11","03","00","01"]
["11-03-01-00",2,null,15,11,3,1,0,"11","03","01","00"]
["11-04-00-00",2,null,15,11,4,0,0,"11","04","00","00"]
["12-00-00-03",3,null,15,12,0,0,3,"12","00","00","03"]
["12-00-01-02",2,null,15,12,0,1,2,"12","00","01","02"]
["12-00-02-01",2,null,15,12,0,2,1,"12","00","02","01"]
["12-00-03-00",2,null,15,12,0,3,0,"12","00","03","00"]
["12-01-00-02",2,null,15,12,1,0,2,"12","01","00","02"]
["12-01-01-01",2,null,15,12,1,1,1,"12","01","01","01"]
["12-01-02-00",2,null,15,12,1,2,0,"12","01","02","00"]
["12-02-00-01",2,null,15,12,2,0,1,"12","02","00","01"]
["12-02-01-00",2,null,15,12,2,1,0,"12","02","01","00"]
["12-03-00-00",2,null,15,12,3,0,0,"12","03","00","00"]
["13-00-00-02",2,null,15,13,0,0,2,"13","00","00","02"]
["13-00-01-01",2,null,15,13,0,1,1,"13","00","01","01"]
["13-00-02-00",2,null,15,13,0,2,0,"13","00","02","00"]
["13-01-00-01",2,null,15,13,1,0,1,"13","01","00","01"]
["13-01-01-00",2,null,15,13,1,1,0,"13","01","01","00"]
["13-02-00-00",2,null,15,13,2,0,0,"13","02","00","00"]
["14-00-00-01",2,null,15,14,0,0,1,"14","00","00","01"]
["14-00-01-00",2,null,15,14,0,1,0,"14","00","01","00"]
["14-01-00-00",2,null,15,14,1,0,0,"14","01","00","00"]
["15-00-00-00",1,null,15,15,0,0,0,"15","00","00","00"]
["00-00-00-16",7,null,16,0,0,0,16,"00","00","00","16"]
["00-00-01-15",6,null,16,0,0,1,15,"00","00","01","15"]
["00-00-02-14",6,null,16,0,0,2,14,"00","00","02","14"]
["00-00-03-13",6,null,16,0,0,3,13,"00","00","03","13"]
["00-00-04-12",6,null,16,0,0,4,12,"00","00","04","12"]
["00-00-05-11",6,null,16,0,0,5,11,"00","00","05","11"]
["00-00-06-10",6,null,16,0,0,6,10,"00","00","06","10"]
["00-00-07-09",6,null,16,0,0,7,9,"00","00","07","09"]
["00-00-08-08",6,null,16,0,0,8,8,"00","00","08","08"]
["00-00-09-07",5,null,16,0,0,9,7,"00","00","09","07"]
["00-00-10-06",5,null,16,0,0,10,6,"00","00","10","06"]
["00-00-11-05",5,null,16,0,0,11,5,"00","00","11","05"]
["00-00-12-04",5,null,16,0,0,12,4,"00","00","12","04"]
["00-00-13-03",4,null,16,0,0,13,3,"00","00","13","03"]
["00-00-14-02",4,null,16,0,0,14,2,"00","00","14","02"]
["00-00-15-01",4,null,16,0,0,15,1,"00","00","15","01"]
["00-00-16-00",4,null,16,0,0,16,0,"00","00","16","00"]
["00-01-00-15",5,null,16,0,1,0,15,"00","01","00","15"]
["00-01-01-14",5,null,16,0,1,1,14,"00","01","01","14"]
["00-01-02-13",5,null,16,0,1,2,13,"00","01","02","13"]
["00-01-03-12",5,null,16,0,1,3,12,"00","01","03","12"]
["00-01-04-11",5,null,16,0,1,4,11,"00","01","04","11"]
["00-01-05-10",5,null,16,0,1,5,10,"00","01","05","10"]
["00-01-06-09",5,null,16,0,1,6,9,"00","01","06","09"]
["00-01-07-08",5,null,16,0,1,7,8,"00","01","07","08"]
["00-01-08-07",5,null,16,0,1,8,7,"00","01","08","07"]
["00-01-09-06",5,null,16,0,1,9,6,"00","01","09","06"]
["00-01-10-05",5,null,16,0,1,10,5,"00","01","10","05"]
["00-01-11-04",5,null,16,0,1,11,4,"00","01","11","04"]
["00-01-12-03",4,null,16,0,1,12,3,"00","01","12","03"]
["00-01-13-02",4,null,16,0,1,13,2,"00","01","13","02"]
["00-01-14-01",4,null,16,0,1,14,1,"00","01","14","01"]
["00-01-15-00",4,null,16,0,1,15,0,"00","01","15","00"]
[{"$f":"I3911&\"-\"&J3911&\"-\"&K3911&\"-\"&L3911","v":"00-02-00-14"},5,null,16,0,2,0,14,"00","02","00","14"]
["00-02-01-13",5,null,16,0,2,1,13,{"$f":"IF(LEN(E3912)=1,0&E3912,IF(LEN(E3912)=0,\"00\",RIGHT(E3912,2)))","v":"00"},{"$f":"IF(LEN(F3912)=1,0&F3912,IF(LEN(F3912)=0,\"00\",RIGHT(F3912,2)))","v":"02"},{"$f":"IF(LEN(G3912)=1,0&G3912,IF(LEN(G3912)=0,\"00\",RIGHT(G3912,2)))","v":"01"},{"$f":"IF(LEN(H3912)=1,0&H3912,IF(LEN(H3912)=0,\"00\",RIGHT(H3912,2)))","v":"13"}]
["00-02-02-12",5,null,16,0,2,2,12,"00","02","02","12"]
["00-02-03-11",5,null,16,0,2,3,11,"00","02","03","11"]
["00-02-04-10",5,null,16,0,2,4,10,"00","02","04","10"]
["00-02-05-09",5,null,16,0,2,5,9,"00","02","05","09"]
["00-02-06-08",5,null,16,0,2,6,8,"00","02","06","08"]
["00-02-07-07",5,null,16,0,2,7,7,"00","02","07","07"]
["00-02-08-06",5,null,16,0,2,8,6,"00","02","08","06"]
["00-02-09-05",5,null,16,0,2,9,5,"00","02","09","05"]
["00-02-10-04",5,null,16,0,2,10,4,"00","02","10","04"]
["00-02-11-03",4,null,16,0,2,11,3,"00","02","11","03"]
["00-02-12-02",4,null,16,0,2,12,2,"00","02","12","02"]
["00-02-13-01",4,null,16,0,2,13,1,"00","02","13","01"]
["00-02-14-00",4,null,16,0,2,14,0,"00","02","14","00"]
["00-03-00-13",5,null,16,0,3,0,13,"00","03","00","13"]
["00-03-01-12",5,null,16,0,3,1,12,"00","03","01","12"]
["00-03-02-11",5,null,16,0,3,2,11,"00","03","02","11"]
["00-03-03-10",5,null,16,0,3,3,10,"00","03","03","10"]
["00-03-04-09",5,null,16,0,3,4,9,"00","03","04","09"]
["00-03-05-08",5,null,16,0,3,5,8,"00","03","05","08"]
["00-03-06-07",5,null,16,0,3,6,7,"00","03","06","07"]
["00-03-07-06",5,null,16,0,3,7,6,"00","03","07","06"]
["00-03-08-05",5,null,16,0,3,8,5,"00","03","08","05"]
["00-03-09-04",5,null,16,0,3,9,4,"00","03","09","04"]
["00-03-10-03",4,null,16,0,3,10,3,"00","03","10","03"]
["00-03-11-02",4,null,16,0,3,11,2,"00","03","11","02"]
["00-03-12-01",4,null,16,0,3,12,1,"00","03","12","01"]
["00-03-13-00",4,null,16,0,3,13,0,"00","03","13","00"]
["00-04-00-12",5,null,16,0,4,0,12,"00","04","00","12"]
["00-04-01-11",5,null,16,0,4,1,11,"00","04","01","11"]
["00-04-02-10",5,null,16,0,4,2,10,"00","04","02","10"]
["00-04-03-09",5,null,16,0,4,3,9,"00","04","03","09"]
["00-04-04-08",5,null,16,0,4,4,8,"00","04","04","08"]
["00-04-05-07",5,null,16,0,4,5,7,"00","04","05","07"]
["00-04-06-06",5,null,16,0,4,6,6,"00","04","06","06"]
["00-04-07-05",5,null,16,0,4,7,5,"00","04","07","05"]
["00-04-08-04",5,null,16,0,4,8,4,"00","04","08","04"]
["00-04-09-03",4,null,16,0,4,9,3,"00","04","09","03"]
["00-04-10-02",4,null,16,0,4,10,2,"00","04","10","02"]
["00-04-11-01",4,null,16,0,4,11,1,"00","04","11","01"]
["00-04-12-00",4,null,16,0,4,12,0,"00","04","12","00"]
["00-05-00-11",5,null,16,0,5,0,11,"00","05","00","11"]
["00-05-01-10",5,null,16,0,5,1,10,"00","05","01","10"]
["00-05-02-09",5,null,16,0,5,2,9,"00","05","02","09"]
["00-05-03-08",5,null,16,0,5,3,8,"00","05","03","08"]
["00-05-04-07",5,null,16,0,5,4,7,"00","05","04","07"]
["00-05-05-06",5,null,16,0,5,5,6,"00","05","05","06"]
["00-05-06-05",5,null,16,0,5,6,5,"00","05","06","05"]
["00-05-07-04",5,null,16,0,5,7,4,"00","05","07","04"]
["00-05-08-03",4,null,16,0,5,8,3,"00","05","08","03"]
["00-05-09-02",4,null,16,0,5,9,2,"00","05","09","02"]
["00-05-10-01",4,null,16,0,5,10,1,"00","05","10","01"]
["00-05-11-00",4,null,16,0,5,11,0,"00","05","11","00"]
["00-06-00-10",5,null,16,0,6,0,10,"00","06","00","10"]
["00-06-01-09",5,null,16,0,6,1,9,"00","06","01","09"]
["00-06-02-08",5,null,16,0,6,2,8,"00","06","02","08"]
["00-06-03-07",5,null,16,0,6,3,7,"00","06","03","07"]
["00-06-04-06",5,null,16,0,6,4,6,"00","06","04","06"]
["00-06-05-05",4,null,16,0,6,5,5,"00","06","05","05"]
["00-06-06-04",4,null,16,0,6,6,4,"00","06","06","04"]
["00-06-07-03",4,null,16,0,6,7,3,"00","06","07","03"]
["00-06-08-02",4,null,16,0,6,8,2,"00","06","08","02"]
["00-06-09-01",4,null,16,0,6,9,1,"00","06","09","01"]
[{"$f":"I3975&\"-\"&J3975&\"-\"&K3975&\"-\"&L3975","v":"00-06-10-00"},4,null,16,0,6,10,0,"00","06","10","00"]
["00-07-00-09",5,null,16,0,7,0,9,{"$f":"IF(LEN(E3976)=1,0&E3976,IF(LEN(E3976)=0,\"00\",RIGHT(E3976,2)))","v":"00"},{"$f":"IF(LEN(F3976)=1,0&F3976,IF(LEN(F3976)=0,\"00\",RIGHT(F3976,2)))","v":"07"},{"$f":"IF(LEN(G3976)=1,0&G3976,IF(LEN(G3976)=0,\"00\",RIGHT(G3976,2)))","v":"00"},{"$f":"IF(LEN(H3976)=1,0&H3976,IF(LEN(H3976)=0,\"00\",RIGHT(H3976,2)))","v":"09"}]
["00-07-01-08",5,null,16,0,7,1,8,"00","07","01","08"]
["00-07-02-07",5,null,16,0,7,2,7,"00","07","02","07"]
["00-07-03-06",4,null,16,0,7,3,6,"00","07","03","06"]
["00-07-04-05",4,null,16,0,7,4,5,"00","07","04","05"]
["00-07-05-04",4,null,16,0,7,5,4,"00","07","05","04"]
["00-07-06-03",4,null,16,0,7,6,3,"00","07","06","03"]
["00-07-07-02",4,null,16,0,7,7,2,"00","07","07","02"]
["00-07-08-01",4,null,16,0,7,8,1,"00","07","08","01"]
["00-07-09-00",4,null,16,0,7,9,0,"00","07","09","00"]
["00-08-00-08",4,null,16,0,8,0,8,"00","08","00","08"]
["00-08-01-07",4,null,16,0,8,1,7,"00","08","01","07"]
["00-08-02-06",4,null,16,0,8,2,6,"00","08","02","06"]
["00-08-03-05",4,null,16,0,8,3,5,"00","08","03","05"]
["00-08-04-04",4,null,16,0,8,4,4,"00","08","04","04"]
["00-08-05-03",4,null,16,0,8,5,3,"00","08","05","03"]
["00-08-06-02",4,null,16,0,8,6,2,"00","08","06","02"]
["00-08-07-01",4,null,16,0,8,7,1,"00","08","07","01"]
["00-08-08-00",4,null,16,0,8,8,0,"00","08","08","00"]
["00-09-00-07",3,null,16,0,9,0,7,"00","09","00","07"]
["00-09-01-06",3,null,16,0,9,1,6,"00","09","01","06"]
["00-09-02-05",3,null,16,0,9,2,5,"00","09","02","05"]
["00-09-03-04",3,null,16,0,9,3,4,"00","09","03","04"]
["00-09-04-03",3,null,16,0,9,4,3,"00","09","04","03"]
["00-09-05-02",3,null,16,0,9,5,2,"00","09","05","02"]
["00-09-06-01",3,null,16,0,9,6,1,"00","09","06","01"]
["00-09-07-00",3,null,16,0,9,7,0,"00","09","07","00"]
["00-10-00-06",3,null,16,0,10,0,6,"00","10","00","06"]
["00-10-01-05",3,null,16,0,10,1,5,"00","10","01","05"]
["00-10-02-04",3,null,16,0,10,2,4,"00","10","02","04"]
["00-10-03-03",3,null,16,0,10,3,3,"00","10","03","03"]
["00-10-04-02",3,null,16,0,10,4,2,"00","10","04","02"]
["00-10-05-01",3,null,16,0,10,5,1,"00","10","05","01"]
["00-10-06-00",3,null,16,0,10,6,0,"00","10","06","00"]
["00-11-00-05",3,null,16,0,11,0,5,"00","11","00","05"]
["00-11-01-04",3,null,16,0,11,1,4,"00","11","01","04"]
["00-11-02-03",3,null,16,0,11,2,3,"00","11","02","03"]
["00-11-03-02",3,null,16,0,11,3,2,"00","11","03","02"]
["00-11-04-01",3,null,16,0,11,4,1,"00","11","04","01"]
["00-11-05-00",3,null,16,0,11,5,0,"00","11","05","00"]
["00-12-00-04",3,null,16,0,12,0,4,"00","12","00","04"]
["00-12-01-03",3,null,16,0,12,1,3,"00","12","01","03"]
["00-12-02-02",3,null,16,0,12,2,2,"00","12","02","02"]
["00-12-03-01",3,null,16,0,12,3,1,"00","12","03","01"]
["00-12-04-00",3,null,16,0,12,4,0,"00","12","04","00"]
["00-13-00-03",3,null,16,0,13,0,3,"00","13","00","03"]
["00-13-01-02",3,null,16,0,13,1,2,"00","13","01","02"]
["00-13-02-01",3,null,16,0,13,2,1,"00","13","02","01"]
["00-13-03-00",3,null,16,0,13,3,0,"00","13","03","00"]
["00-14-00-02",3,null,16,0,14,0,2,"00","14","00","02"]
["00-14-01-01",2,null,16,0,14,1,1,"00","14","01","01"]
["00-14-02-00",2,null,16,0,14,2,0,"00","14","02","00"]
["00-15-00-01",2,null,16,0,15,0,1,"00","15","00","01"]
["00-15-01-00",2,null,16,0,15,1,0,"00","15","01","00"]
["00-16-00-00",2,null,16,0,16,0,0,"00","16","00","00"]
["01-00-00-15",5,null,16,1,0,0,15,"01","00","00","15"]
["01-00-01-14",5,null,16,1,0,1,14,"01","00","01","14"]
["01-00-02-13",5,null,16,1,0,2,13,"01","00","02","13"]
["01-00-03-12",5,null,16,1,0,3,12,"01","00","03","12"]
["01-00-04-11",5,null,16,1,0,4,11,"01","00","04","11"]
["01-00-05-10",5,null,16,1,0,5,10,"01","00","05","10"]
["01-00-06-09",5,null,16,1,0,6,9,"01","00","06","09"]
["01-00-07-08",5,null,16,1,0,7,8,"01","00","07","08"]
[{"$f":"I4039&\"-\"&J4039&\"-\"&K4039&\"-\"&L4039","v":"01-00-08-07"},5,null,16,1,0,8,7,"01","00","08","07"]
["01-00-09-06",5,null,16,1,0,9,6,{"$f":"IF(LEN(E4040)=1,0&E4040,IF(LEN(E4040)=0,\"00\",RIGHT(E4040,2)))","v":"01"},{"$f":"IF(LEN(F4040)=1,0&F4040,IF(LEN(F4040)=0,\"00\",RIGHT(F4040,2)))","v":"00"},{"$f":"IF(LEN(G4040)=1,0&G4040,IF(LEN(G4040)=0,\"00\",RIGHT(G4040,2)))","v":"09"},{"$f":"IF(LEN(H4040)=1,0&H4040,IF(LEN(H4040)=0,\"00\",RIGHT(H4040,2)))","v":"06"}]
["01-00-10-05",5,null,16,1,0,10,5,"01","00","10","05"]
["01-00-11-04",5,null,16,1,0,11,4,"01","00","11","04"]
["01-00-12-03",4,null,16,1,0,12,3,"01","00","12","03"]
["01-00-13-02",4,null,16,1,0,13,2,"01","00","13","02"]
["01-00-14-01",4,null,16,1,0,14,1,"01","00","14","01"]
["01-00-15-00",4,null,16,1,0,15,0,"01","00","15","00"]
["01-01-00-14",5,null,16,1,1,0,14,"01","01","00","14"]
["01-01-01-13",5,null,16,1,1,1,13,"01","01","01","13"]
["01-01-02-12",5,null,16,1,1,2,12,"01","01","02","12"]
["01-01-03-11",5,null,16,1,1,3,11,"01","01","03","11"]
["01-01-04-10",5,null,16,1,1,4,10,"01","01","04","10"]
["01-01-05-09",5,null,16,1,1,5,9,"01","01","05","09"]
["01-01-06-08",5,null,16,1,1,6,8,"01","01","06","08"]
["01-01-07-07",5,null,16,1,1,7,7,"01","01","07","07"]
["01-01-08-06",5,null,16,1,1,8,6,"01","01","08","06"]
["01-01-09-05",5,null,16,1,1,9,5,"01","01","09","05"]
["01-01-10-04",5,null,16,1,1,10,4,"01","01","10","04"]
["01-01-11-03",4,null,16,1,1,11,3,"01","01","11","03"]
["01-01-12-02",4,null,16,1,1,12,2,"01","01","12","02"]
["01-01-13-01",4,null,16,1,1,13,1,"01","01","13","01"]
["01-01-14-00",4,null,16,1,1,14,0,"01","01","14","00"]
["01-02-00-13",5,null,16,1,2,0,13,"01","02","00","13"]
["01-02-01-12",5,null,16,1,2,1,12,"01","02","01","12"]
["01-02-02-11",5,null,16,1,2,2,11,"01","02","02","11"]
["01-02-03-10",5,null,16,1,2,3,10,"01","02","03","10"]
["01-02-04-09",5,null,16,1,2,4,9,"01","02","04","09"]
["01-02-05-08",5,null,16,1,2,5,8,"01","02","05","08"]
["01-02-06-07",5,null,16,1,2,6,7,"01","02","06","07"]
["01-02-07-06",5,null,16,1,2,7,6,"01","02","07","06"]
["01-02-08-05",5,null,16,1,2,8,5,"01","02","08","05"]
["01-02-09-04",5,null,16,1,2,9,4,"01","02","09","04"]
["01-02-10-03",4,null,16,1,2,10,3,"01","02","10","03"]
["01-02-11-02",4,null,16,1,2,11,2,"01","02","11","02"]
["01-02-12-01",4,null,16,1,2,12,1,"01","02","12","01"]
["01-02-13-00",4,null,16,1,2,13,0,"01","02","13","00"]
["01-03-00-12",5,null,16,1,3,0,12,"01","03","00","12"]
["01-03-01-11",5,null,16,1,3,1,11,"01","03","01","11"]
["01-03-02-10",5,null,16,1,3,2,10,"01","03","02","10"]
["01-03-03-09",5,null,16,1,3,3,9,"01","03","03","09"]
["01-03-04-08",5,null,16,1,3,4,8,"01","03","04","08"]
["01-03-05-07",5,null,16,1,3,5,7,"01","03","05","07"]
["01-03-06-06",5,null,16,1,3,6,6,"01","03","06","06"]
["01-03-07-05",5,null,16,1,3,7,5,"01","03","07","05"]
["01-03-08-04",5,null,16,1,3,8,4,"01","03","08","04"]
["01-03-09-03",4,null,16,1,3,9,3,"01","03","09","03"]
["01-03-10-02",4,null,16,1,3,10,2,"01","03","10","02"]
["01-03-11-01",4,null,16,1,3,11,1,"01","03","11","01"]
["01-03-12-00",4,null,16,1,3,12,0,"01","03","12","00"]
["01-04-00-11",5,null,16,1,4,0,11,"01","04","00","11"]
["01-04-01-10",5,null,16,1,4,1,10,"01","04","01","10"]
["01-04-02-09",5,null,16,1,4,2,9,"01","04","02","09"]
["01-04-03-08",5,null,16,1,4,3,8,"01","04","03","08"]
["01-04-04-07",5,null,16,1,4,4,7,"01","04","04","07"]
["01-04-05-06",5,null,16,1,4,5,6,"01","04","05","06"]
["01-04-06-05",4,null,16,1,4,6,5,"01","04","06","05"]
["01-04-07-04",4,null,16,1,4,7,4,"01","04","07","04"]
["01-04-08-03",4,null,16,1,4,8,3,"01","04","08","03"]
["01-04-09-02",4,null,16,1,4,9,2,"01","04","09","02"]
["01-04-10-01",4,null,16,1,4,10,1,"01","04","10","01"]
["01-04-11-00",4,null,16,1,4,11,0,"01","04","11","00"]
["01-05-00-10",5,null,16,1,5,0,10,"01","05","00","10"]
["01-05-01-09",5,null,16,1,5,1,9,"01","05","01","09"]
[{"$f":"I4103&\"-\"&J4103&\"-\"&K4103&\"-\"&L4103","v":"01-05-02-08"},5,null,16,1,5,2,8,"01","05","02","08"]
["01-05-03-07",5,null,16,1,5,3,7,{"$f":"IF(LEN(E4104)=1,0&E4104,IF(LEN(E4104)=0,\"00\",RIGHT(E4104,2)))","v":"01"},{"$f":"IF(LEN(F4104)=1,0&F4104,IF(LEN(F4104)=0,\"00\",RIGHT(F4104,2)))","v":"05"},{"$f":"IF(LEN(G4104)=1,0&G4104,IF(LEN(G4104)=0,\"00\",RIGHT(G4104,2)))","v":"03"},{"$f":"IF(LEN(H4104)=1,0&H4104,IF(LEN(H4104)=0,\"00\",RIGHT(H4104,2)))","v":"07"}]
["01-05-04-06",4,null,16,1,5,4,6,"01","05","04","06"]
["01-05-05-05",4,null,16,1,5,5,5,"01","05","05","05"]
["01-05-06-04",4,null,16,1,5,6,4,"01","05","06","04"]
["01-05-07-03",4,null,16,1,5,7,3,"01","05","07","03"]
["01-05-08-02",4,null,16,1,5,8,2,"01","05","08","02"]
["01-05-09-01",4,null,16,1,5,9,1,"01","05","09","01"]
["01-05-10-00",4,null,16,1,5,10,0,"01","05","10","00"]
["01-06-00-09",5,null,16,1,6,0,9,"01","06","00","09"]
["01-06-01-08",4,null,16,1,6,1,8,"01","06","01","08"]
["01-06-02-07",4,null,16,1,6,2,7,"01","06","02","07"]
["01-06-03-06",4,null,16,1,6,3,6,"01","06","03","06"]
["01-06-04-05",4,null,16,1,6,4,5,"01","06","04","05"]
["01-06-05-04",4,null,16,1,6,5,4,"01","06","05","04"]
["01-06-06-03",4,null,16,1,6,6,3,"01","06","06","03"]
["01-06-07-02",4,null,16,1,6,7,2,"01","06","07","02"]
["01-06-08-01",4,null,16,1,6,8,1,"01","06","08","01"]
["01-06-09-00",4,null,16,1,6,9,0,"01","06","09","00"]
["01-07-00-08",4,null,16,1,7,0,8,"01","07","00","08"]
["01-07-01-07",4,null,16,1,7,1,7,"01","07","01","07"]
["01-07-02-06",4,null,16,1,7,2,6,"01","07","02","06"]
["01-07-03-05",4,null,16,1,7,3,5,"01","07","03","05"]
["01-07-04-04",4,null,16,1,7,4,4,"01","07","04","04"]
["01-07-05-03",4,null,16,1,7,5,3,"01","07","05","03"]
["01-07-06-02",4,null,16,1,7,6,2,"01","07","06","02"]
["01-07-07-01",4,null,16,1,7,7,1,"01","07","07","01"]
["01-07-08-00",4,null,16,1,7,8,0,"01","07","08","00"]
["01-08-00-07",3,null,16,1,8,0,7,"01","08","00","07"]
["01-08-01-06",3,null,16,1,8,1,6,"01","08","01","06"]
["01-08-02-05",3,null,16,1,8,2,5,"01","08","02","05"]
["01-08-03-04",3,null,16,1,8,3,4,"01","08","03","04"]
["01-08-04-03",3,null,16,1,8,4,3,"01","08","04","03"]
["01-08-05-02",3,null,16,1,8,5,2,"01","08","05","02"]
["01-08-06-01",3,null,16,1,8,6,1,"01","08","06","01"]
["01-08-07-00",3,null,16,1,8,7,0,"01","08","07","00"]
["01-09-00-06",3,null,16,1,9,0,6,"01","09","00","06"]
["01-09-01-05",3,null,16,1,9,1,5,"01","09","01","05"]
["01-09-02-04",3,null,16,1,9,2,4,"01","09","02","04"]
["01-09-03-03",3,null,16,1,9,3,3,"01","09","03","03"]
["01-09-04-02",3,null,16,1,9,4,2,"01","09","04","02"]
["01-09-05-01",3,null,16,1,9,5,1,"01","09","05","01"]
["01-09-06-00",3,null,16,1,9,6,0,"01","09","06","00"]
["01-10-00-05",3,null,16,1,10,0,5,"01","10","00","05"]
["01-10-01-04",3,null,16,1,10,1,4,"01","10","01","04"]
["01-10-02-03",3,null,16,1,10,2,3,"01","10","02","03"]
["01-10-03-02",3,null,16,1,10,3,2,"01","10","03","02"]
["01-10-04-01",3,null,16,1,10,4,1,"01","10","04","01"]
["01-10-05-00",3,null,16,1,10,5,0,"01","10","05","00"]
["01-11-00-04",3,null,16,1,11,0,4,"01","11","00","04"]
["01-11-01-03",3,null,16,1,11,1,3,"01","11","01","03"]
["01-11-02-02",3,null,16,1,11,2,2,"01","11","02","02"]
["01-11-03-01",3,null,16,1,11,3,1,"01","11","03","01"]
["01-11-04-00",3,null,16,1,11,4,0,"01","11","04","00"]
["01-12-00-03",3,null,16,1,12,0,3,"01","12","00","03"]
["01-12-01-02",3,null,16,1,12,1,2,"01","12","01","02"]
["01-12-02-01",2,null,16,1,12,2,1,"01","12","02","01"]
["01-12-03-00",2,null,16,1,12,3,0,"01","12","03","00"]
["01-13-00-02",2,null,16,1,13,0,2,"01","13","00","02"]
["01-13-01-01",2,null,16,1,13,1,1,"01","13","01","01"]
["01-13-02-00",2,null,16,1,13,2,0,"01","13","02","00"]
["01-14-00-01",2,null,16,1,14,0,1,"01","14","00","01"]
["01-14-01-00",2,null,16,1,14,1,0,"01","14","01","00"]
["01-15-00-00",2,null,16,1,15,0,0,"01","15","00","00"]
[{"$f":"I4167&\"-\"&J4167&\"-\"&K4167&\"-\"&L4167","v":"02-00-00-14"},5,null,16,2,0,0,14,"02","00","00","14"]
["02-00-01-13",5,null,16,2,0,1,13,{"$f":"IF(LEN(E4168)=1,0&E4168,IF(LEN(E4168)=0,\"00\",RIGHT(E4168,2)))","v":"02"},{"$f":"IF(LEN(F4168)=1,0&F4168,IF(LEN(F4168)=0,\"00\",RIGHT(F4168,2)))","v":"00"},{"$f":"IF(LEN(G4168)=1,0&G4168,IF(LEN(G4168)=0,\"00\",RIGHT(G4168,2)))","v":"01"},{"$f":"IF(LEN(H4168)=1,0&H4168,IF(LEN(H4168)=0,\"00\",RIGHT(H4168,2)))","v":"13"}]
["02-00-02-12",5,null,16,2,0,2,12,"02","00","02","12"]
["02-00-03-11",5,null,16,2,0,3,11,"02","00","03","11"]
["02-00-04-10",5,null,16,2,0,4,10,"02","00","04","10"]
["02-00-05-09",5,null,16,2,0,5,9,"02","00","05","09"]
["02-00-06-08",5,null,16,2,0,6,8,"02","00","06","08"]
["02-00-07-07",5,null,16,2,0,7,7,"02","00","07","07"]
["02-00-08-06",5,null,16,2,0,8,6,"02","00","08","06"]
["02-00-09-05",5,null,16,2,0,9,5,"02","00","09","05"]
["02-00-10-04",5,null,16,2,0,10,4,"02","00","10","04"]
["02-00-11-03",4,null,16,2,0,11,3,"02","00","11","03"]
["02-00-12-02",4,null,16,2,0,12,2,"02","00","12","02"]
["02-00-13-01",4,null,16,2,0,13,1,"02","00","13","01"]
["02-00-14-00",4,null,16,2,0,14,0,"02","00","14","00"]
["02-01-00-13",5,null,16,2,1,0,13,"02","01","00","13"]
["02-01-01-12",5,null,16,2,1,1,12,"02","01","01","12"]
["02-01-02-11",5,null,16,2,1,2,11,"02","01","02","11"]
["02-01-03-10",5,null,16,2,1,3,10,"02","01","03","10"]
["02-01-04-09",5,null,16,2,1,4,9,"02","01","04","09"]
["02-01-05-08",5,null,16,2,1,5,8,"02","01","05","08"]
["02-01-06-07",5,null,16,2,1,6,7,"02","01","06","07"]
["02-01-07-06",5,null,16,2,1,7,6,"02","01","07","06"]
["02-01-08-05",5,null,16,2,1,8,5,"02","01","08","05"]
["02-01-09-04",5,null,16,2,1,9,4,"02","01","09","04"]
["02-01-10-03",4,null,16,2,1,10,3,"02","01","10","03"]
["02-01-11-02",4,null,16,2,1,11,2,"02","01","11","02"]
["02-01-12-01",4,null,16,2,1,12,1,"02","01","12","01"]
["02-01-13-00",4,null,16,2,1,13,0,"02","01","13","00"]
["02-02-00-12",5,null,16,2,2,0,12,"02","02","00","12"]
["02-02-01-11",5,null,16,2,2,1,11,"02","02","01","11"]
["02-02-02-10",5,null,16,2,2,2,10,"02","02","02","10"]
["02-02-03-09",5,null,16,2,2,3,9,"02","02","03","09"]
["02-02-04-08",5,null,16,2,2,4,8,"02","02","04","08"]
["02-02-05-07",5,null,16,2,2,5,7,"02","02","05","07"]
["02-02-06-06",5,null,16,2,2,6,6,"02","02","06","06"]
["02-02-07-05",4,null,16,2,2,7,5,"02","02","07","05"]
["02-02-08-04",4,null,16,2,2,8,4,"02","02","08","04"]
["02-02-09-03",4,null,16,2,2,9,3,"02","02","09","03"]
["02-02-10-02",4,null,16,2,2,10,2,"02","02","10","02"]
["02-02-11-01",4,null,16,2,2,11,1,"02","02","11","01"]
["02-02-12-00",4,null,16,2,2,12,0,"02","02","12","00"]
["02-03-00-11",5,null,16,2,3,0,11,"02","03","00","11"]
["02-03-01-10",5,null,16,2,3,1,10,"02","03","01","10"]
["02-03-02-09",5,null,16,2,3,2,9,"02","03","02","09"]
["02-03-03-08",5,null,16,2,3,3,8,"02","03","03","08"]
["02-03-04-07",5,null,16,2,3,4,7,"02","03","04","07"]
["02-03-05-06",4,null,16,2,3,5,6,"02","03","05","06"]
["02-03-06-05",4,null,16,2,3,6,5,"02","03","06","05"]
["02-03-07-04",4,null,16,2,3,7,4,"02","03","07","04"]
["02-03-08-03",4,null,16,2,3,8,3,"02","03","08","03"]
["02-03-09-02",4,null,16,2,3,9,2,"02","03","09","02"]
["02-03-10-01",4,null,16,2,3,10,1,"02","03","10","01"]
["02-03-11-00",4,null,16,2,3,11,0,"02","03","11","00"]
["02-04-00-10",5,null,16,2,4,0,10,"02","04","00","10"]
["02-04-01-09",5,null,16,2,4,1,9,"02","04","01","09"]
["02-04-02-08",4,null,16,2,4,2,8,"02","04","02","08"]
["02-04-03-07",4,null,16,2,4,3,7,"02","04","03","07"]
["02-04-04-06",4,null,16,2,4,4,6,"02","04","04","06"]
["02-04-05-05",4,null,16,2,4,5,5,"02","04","05","05"]
["02-04-06-04",4,null,16,2,4,6,4,"02","04","06","04"]
["02-04-07-03",4,null,16,2,4,7,3,"02","04","07","03"]
["02-04-08-02",4,null,16,2,4,8,2,"02","04","08","02"]
["02-04-09-01",4,null,16,2,4,9,1,"02","04","09","01"]
[{"$f":"I4231&\"-\"&J4231&\"-\"&K4231&\"-\"&L4231","v":"02-04-10-00"},4,null,16,2,4,10,0,"02","04","10","00"]
["02-05-00-09",4,null,16,2,5,0,9,{"$f":"IF(LEN(E4232)=1,0&E4232,IF(LEN(E4232)=0,\"00\",RIGHT(E4232,2)))","v":"02"},{"$f":"IF(LEN(F4232)=1,0&F4232,IF(LEN(F4232)=0,\"00\",RIGHT(F4232,2)))","v":"05"},{"$f":"IF(LEN(G4232)=1,0&G4232,IF(LEN(G4232)=0,\"00\",RIGHT(G4232,2)))","v":"00"},{"$f":"IF(LEN(H4232)=1,0&H4232,IF(LEN(H4232)=0,\"00\",RIGHT(H4232,2)))","v":"09"}]
["02-05-01-08",4,null,16,2,5,1,8,"02","05","01","08"]
["02-05-02-07",4,null,16,2,5,2,7,"02","05","02","07"]
["02-05-03-06",4,null,16,2,5,3,6,"02","05","03","06"]
["02-05-04-05",4,null,16,2,5,4,5,"02","05","04","05"]
["02-05-05-04",4,null,16,2,5,5,4,"02","05","05","04"]
["02-05-06-03",4,null,16,2,5,6,3,"02","05","06","03"]
["02-05-07-02",4,null,16,2,5,7,2,"02","05","07","02"]
["02-05-08-01",4,null,16,2,5,8,1,"02","05","08","01"]
["02-05-09-00",4,null,16,2,5,9,0,"02","05","09","00"]
["02-06-00-08",4,null,16,2,6,0,8,"02","06","00","08"]
["02-06-01-07",4,null,16,2,6,1,7,"02","06","01","07"]
["02-06-02-06",4,null,16,2,6,2,6,"02","06","02","06"]
["02-06-03-05",4,null,16,2,6,3,5,"02","06","03","05"]
["02-06-04-04",4,null,16,2,6,4,4,"02","06","04","04"]
["02-06-05-03",4,null,16,2,6,5,3,"02","06","05","03"]
["02-06-06-02",4,null,16,2,6,6,2,"02","06","06","02"]
["02-06-07-01",4,null,16,2,6,7,1,"02","06","07","01"]
["02-06-08-00",4,null,16,2,6,8,0,"02","06","08","00"]
["02-07-00-07",3,null,16,2,7,0,7,"02","07","00","07"]
["02-07-01-06",3,null,16,2,7,1,6,"02","07","01","06"]
["02-07-02-05",3,null,16,2,7,2,5,"02","07","02","05"]
["02-07-03-04",3,null,16,2,7,3,4,"02","07","03","04"]
["02-07-04-03",3,null,16,2,7,4,3,"02","07","04","03"]
["02-07-05-02",3,null,16,2,7,5,2,"02","07","05","02"]
["02-07-06-01",3,null,16,2,7,6,1,"02","07","06","01"]
["02-07-07-00",3,null,16,2,7,7,0,"02","07","07","00"]
["02-08-00-06",3,null,16,2,8,0,6,"02","08","00","06"]
["02-08-01-05",3,null,16,2,8,1,5,"02","08","01","05"]
["02-08-02-04",3,null,16,2,8,2,4,"02","08","02","04"]
["02-08-03-03",3,null,16,2,8,3,3,"02","08","03","03"]
["02-08-04-02",3,null,16,2,8,4,2,"02","08","04","02"]
["02-08-05-01",3,null,16,2,8,5,1,"02","08","05","01"]
["02-08-06-00",3,null,16,2,8,6,0,"02","08","06","00"]
["02-09-00-05",3,null,16,2,9,0,5,"02","09","00","05"]
["02-09-01-04",3,null,16,2,9,1,4,"02","09","01","04"]
["02-09-02-03",3,null,16,2,9,2,3,"02","09","02","03"]
["02-09-03-02",3,null,16,2,9,3,2,"02","09","03","02"]
["02-09-04-01",3,null,16,2,9,4,1,"02","09","04","01"]
["02-09-05-00",3,null,16,2,9,5,0,"02","09","05","00"]
["02-10-00-04",3,null,16,2,10,0,4,"02","10","00","04"]
["02-10-01-03",3,null,16,2,10,1,3,"02","10","01","03"]
["02-10-02-02",3,null,16,2,10,2,2,"02","10","02","02"]
["02-10-03-01",2,null,16,2,10,3,1,"02","10","03","01"]
["02-10-04-00",2,null,16,2,10,4,0,"02","10","04","00"]
["02-11-00-03",3,null,16,2,11,0,3,"02","11","00","03"]
["02-11-01-02",2,null,16,2,11,1,2,"02","11","01","02"]
["02-11-02-01",2,null,16,2,11,2,1,"02","11","02","01"]
["02-11-03-00",2,null,16,2,11,3,0,"02","11","03","00"]
["02-12-00-02",2,null,16,2,12,0,2,"02","12","00","02"]
["02-12-01-01",2,null,16,2,12,1,1,"02","12","01","01"]
["02-12-02-00",2,null,16,2,12,2,0,"02","12","02","00"]
["02-13-00-01",2,null,16,2,13,0,1,"02","13","00","01"]
["02-13-01-00",2,null,16,2,13,1,0,"02","13","01","00"]
["02-14-00-00",2,null,16,2,14,0,0,"02","14","00","00"]
["03-00-00-13",5,null,16,3,0,0,13,"03","00","00","13"]
["03-00-01-12",5,null,16,3,0,1,12,"03","00","01","12"]
["03-00-02-11",5,null,16,3,0,2,11,"03","00","02","11"]
["03-00-03-10",5,null,16,3,0,3,10,"03","00","03","10"]
["03-00-04-09",5,null,16,3,0,4,9,"03","00","04","09"]
["03-00-05-08",5,null,16,3,0,5,8,"03","00","05","08"]
["03-00-06-07",5,null,16,3,0,6,7,"03","00","06","07"]
["03-00-07-06",5,null,16,3,0,7,6,"03","00","07","06"]
[{"$f":"I4295&\"-\"&J4295&\"-\"&K4295&\"-\"&L4295","v":"03-00-08-05"},4,null,16,3,0,8,5,"03","00","08","05"]
["03-00-09-04",4,null,16,3,0,9,4,{"$f":"IF(LEN(E4296)=1,0&E4296,IF(LEN(E4296)=0,\"00\",RIGHT(E4296,2)))","v":"03"},{"$f":"IF(LEN(F4296)=1,0&F4296,IF(LEN(F4296)=0,\"00\",RIGHT(F4296,2)))","v":"00"},{"$f":"IF(LEN(G4296)=1,0&G4296,IF(LEN(G4296)=0,\"00\",RIGHT(G4296,2)))","v":"09"},{"$f":"IF(LEN(H4296)=1,0&H4296,IF(LEN(H4296)=0,\"00\",RIGHT(H4296,2)))","v":"04"}]
["03-00-10-03",4,null,16,3,0,10,3,"03","00","10","03"]
["03-00-11-02",4,null,16,3,0,11,2,"03","00","11","02"]
["03-00-12-01",4,null,16,3,0,12,1,"03","00","12","01"]
["03-00-13-00",4,null,16,3,0,13,0,"03","00","13","00"]
["03-01-00-12",5,null,16,3,1,0,12,"03","01","00","12"]
["03-01-01-11",5,null,16,3,1,1,11,"03","01","01","11"]
["03-01-02-10",5,null,16,3,1,2,10,"03","01","02","10"]
["03-01-03-09",5,null,16,3,1,3,9,"03","01","03","09"]
["03-01-04-08",5,null,16,3,1,4,8,"03","01","04","08"]
["03-01-05-07",5,null,16,3,1,5,7,"03","01","05","07"]
["03-01-06-06",4,null,16,3,1,6,6,"03","01","06","06"]
["03-01-07-05",4,null,16,3,1,7,5,"03","01","07","05"]
["03-01-08-04",4,null,16,3,1,8,4,"03","01","08","04"]
["03-01-09-03",4,null,16,3,1,9,3,"03","01","09","03"]
["03-01-10-02",4,null,16,3,1,10,2,"03","01","10","02"]
["03-01-11-01",4,null,16,3,1,11,1,"03","01","11","01"]
["03-01-12-00",4,null,16,3,1,12,0,"03","01","12","00"]
["03-02-00-11",5,null,16,3,2,0,11,"03","02","00","11"]
["03-02-01-10",5,null,16,3,2,1,10,"03","02","01","10"]
["03-02-02-09",5,null,16,3,2,2,9,"03","02","02","09"]
["03-02-03-08",4,null,16,3,2,3,8,"03","02","03","08"]
["03-02-04-07",4,null,16,3,2,4,7,"03","02","04","07"]
["03-02-05-06",4,null,16,3,2,5,6,"03","02","05","06"]
["03-02-06-05",4,null,16,3,2,6,5,"03","02","06","05"]
["03-02-07-04",4,null,16,3,2,7,4,"03","02","07","04"]
["03-02-08-03",4,null,16,3,2,8,3,"03","02","08","03"]
["03-02-09-02",4,null,16,3,2,9,2,"03","02","09","02"]
["03-02-10-01",4,null,16,3,2,10,1,"03","02","10","01"]
["03-02-11-00",4,null,16,3,2,11,0,"03","02","11","00"]
["03-03-00-10",5,null,16,3,3,0,10,"03","03","00","10"]
["03-03-01-09",4,null,16,3,3,1,9,"03","03","01","09"]
["03-03-02-08",4,null,16,3,3,2,8,"03","03","02","08"]
["03-03-03-07",4,null,16,3,3,3,7,"03","03","03","07"]
["03-03-04-06",4,null,16,3,3,4,6,"03","03","04","06"]
["03-03-05-05",4,null,16,3,3,5,5,"03","03","05","05"]
["03-03-06-04",4,null,16,3,3,6,4,"03","03","06","04"]
["03-03-07-03",4,null,16,3,3,7,3,"03","03","07","03"]
["03-03-08-02",4,null,16,3,3,8,2,"03","03","08","02"]
["03-03-09-01",4,null,16,3,3,9,1,"03","03","09","01"]
["03-03-10-00",4,null,16,3,3,10,0,"03","03","10","00"]
["03-04-00-09",4,null,16,3,4,0,9,"03","04","00","09"]
["03-04-01-08",4,null,16,3,4,1,8,"03","04","01","08"]
["03-04-02-07",4,null,16,3,4,2,7,"03","04","02","07"]
["03-04-03-06",4,null,16,3,4,3,6,"03","04","03","06"]
["03-04-04-05",4,null,16,3,4,4,5,"03","04","04","05"]
["03-04-05-04",4,null,16,3,4,5,4,"03","04","05","04"]
["03-04-06-03",4,null,16,3,4,6,3,"03","04","06","03"]
["03-04-07-02",4,null,16,3,4,7,2,"03","04","07","02"]
["03-04-08-01",4,null,16,3,4,8,1,"03","04","08","01"]
["03-04-09-00",4,null,16,3,4,9,0,"03","04","09","00"]
["03-05-00-08",4,null,16,3,5,0,8,"03","05","00","08"]
["03-05-01-07",4,null,16,3,5,1,7,"03","05","01","07"]
["03-05-02-06",4,null,16,3,5,2,6,"03","05","02","06"]
["03-05-03-05",4,null,16,3,5,3,5,"03","05","03","05"]
["03-05-04-04",4,null,16,3,5,4,4,"03","05","04","04"]
["03-05-05-03",4,null,16,3,5,5,3,"03","05","05","03"]
["03-05-06-02",4,null,16,3,5,6,2,"03","05","06","02"]
["03-05-07-01",4,null,16,3,5,7,1,"03","05","07","01"]
["03-05-08-00",4,null,16,3,5,8,0,"03","05","08","00"]
["03-06-00-07",3,null,16,3,6,0,7,"03","06","00","07"]
["03-06-01-06",3,null,16,3,6,1,6,"03","06","01","06"]
["03-06-02-05",3,null,16,3,6,2,5,"03","06","02","05"]
[{"$f":"I4359&\"-\"&J4359&\"-\"&K4359&\"-\"&L4359","v":"03-06-03-04"},3,null,16,3,6,3,4,"03","06","03","04"]
["03-06-04-03",3,null,16,3,6,4,3,{"$f":"IF(LEN(E4360)=1,0&E4360,IF(LEN(E4360)=0,\"00\",RIGHT(E4360,2)))","v":"03"},{"$f":"IF(LEN(F4360)=1,0&F4360,IF(LEN(F4360)=0,\"00\",RIGHT(F4360,2)))","v":"06"},{"$f":"IF(LEN(G4360)=1,0&G4360,IF(LEN(G4360)=0,\"00\",RIGHT(G4360,2)))","v":"04"},{"$f":"IF(LEN(H4360)=1,0&H4360,IF(LEN(H4360)=0,\"00\",RIGHT(H4360,2)))","v":"03"}]
["03-06-05-02",3,null,16,3,6,5,2,"03","06","05","02"]
["03-06-06-01",3,null,16,3,6,6,1,"03","06","06","01"]
["03-06-07-00",3,null,16,3,6,7,0,"03","06","07","00"]
["03-07-00-06",3,null,16,3,7,0,6,"03","07","00","06"]
["03-07-01-05",3,null,16,3,7,1,5,"03","07","01","05"]
["03-07-02-04",3,null,16,3,7,2,4,"03","07","02","04"]
["03-07-03-03",3,null,16,3,7,3,3,"03","07","03","03"]
["03-07-04-02",3,null,16,3,7,4,2,"03","07","04","02"]
["03-07-05-01",3,null,16,3,7,5,1,"03","07","05","01"]
["03-07-06-00",3,null,16,3,7,6,0,"03","07","06","00"]
["03-08-00-05",3,null,16,3,8,0,5,"03","08","00","05"]
["03-08-01-04",3,null,16,3,8,1,4,"03","08","01","04"]
["03-08-02-03",3,null,16,3,8,2,3,"03","08","02","03"]
["03-08-03-02",3,null,16,3,8,3,2,"03","08","03","02"]
["03-08-04-01",3,null,16,3,8,4,1,"03","08","04","01"]
["03-08-05-00",3,null,16,3,8,5,0,"03","08","05","00"]
["03-09-00-04",3,null,16,3,9,0,4,"03","09","00","04"]
["03-09-01-03",3,null,16,3,9,1,3,"03","09","01","03"]
["03-09-02-02",2,null,16,3,9,2,2,"03","09","02","02"]
["03-09-03-01",2,null,16,3,9,3,1,"03","09","03","01"]
["03-09-04-00",2,null,16,3,9,4,0,"03","09","04","00"]
["03-10-00-03",2,null,16,3,10,0,3,"03","10","00","03"]
["03-10-01-02",2,null,16,3,10,1,2,"03","10","01","02"]
["03-10-02-01",2,null,16,3,10,2,1,"03","10","02","01"]
["03-10-03-00",2,null,16,3,10,3,0,"03","10","03","00"]
["03-11-00-02",2,null,16,3,11,0,2,"03","11","00","02"]
["03-11-01-01",2,null,16,3,11,1,1,"03","11","01","01"]
["03-11-02-00",2,null,16,3,11,2,0,"03","11","02","00"]
["03-12-00-01",2,null,16,3,12,0,1,"03","12","00","01"]
["03-12-01-00",2,null,16,3,12,1,0,"03","12","01","00"]
["03-13-00-00",2,null,16,3,13,0,0,"03","13","00","00"]
["04-00-00-12",5,null,16,4,0,0,12,"04","00","00","12"]
["04-00-01-11",5,null,16,4,0,1,11,"04","00","01","11"]
["04-00-02-10",5,null,16,4,0,2,10,"04","00","02","10"]
["04-00-03-09",5,null,16,4,0,3,9,"04","00","03","09"]
["04-00-04-08",4,null,16,4,0,4,8,"04","00","04","08"]
["04-00-05-07",4,null,16,4,0,5,7,"04","00","05","07"]
["04-00-06-06",4,null,16,4,0,6,6,"04","00","06","06"]
["04-00-07-05",4,null,16,4,0,7,5,"04","00","07","05"]
["04-00-08-04",4,null,16,4,0,8,4,"04","00","08","04"]
["04-00-09-03",4,null,16,4,0,9,3,"04","00","09","03"]
["04-00-10-02",4,null,16,4,0,10,2,"04","00","10","02"]
["04-00-11-01",4,null,16,4,0,11,1,"04","00","11","01"]
["04-00-12-00",4,null,16,4,0,12,0,"04","00","12","00"]
["04-01-00-11",5,null,16,4,1,0,11,"04","01","00","11"]
["04-01-01-10",5,null,16,4,1,1,10,"04","01","01","10"]
["04-01-02-09",4,null,16,4,1,2,9,"04","01","02","09"]
["04-01-03-08",4,null,16,4,1,3,8,"04","01","03","08"]
["04-01-04-07",4,null,16,4,1,4,7,"04","01","04","07"]
["04-01-05-06",4,null,16,4,1,5,6,"04","01","05","06"]
["04-01-06-05",4,null,16,4,1,6,5,"04","01","06","05"]
["04-01-07-04",4,null,16,4,1,7,4,"04","01","07","04"]
["04-01-08-03",4,null,16,4,1,8,3,"04","01","08","03"]
["04-01-09-02",4,null,16,4,1,9,2,"04","01","09","02"]
["04-01-10-01",4,null,16,4,1,10,1,"04","01","10","01"]
["04-01-11-00",4,null,16,4,1,11,0,"04","01","11","00"]
["04-02-00-10",4,null,16,4,2,0,10,"04","02","00","10"]
["04-02-01-09",4,null,16,4,2,1,9,"04","02","01","09"]
["04-02-02-08",4,null,16,4,2,2,8,"04","02","02","08"]
["04-02-03-07",4,null,16,4,2,3,7,"04","02","03","07"]
["04-02-04-06",4,null,16,4,2,4,6,"04","02","04","06"]
["04-02-05-05",4,null,16,4,2,5,5,"04","02","05","05"]
[{"$f":"I4423&\"-\"&J4423&\"-\"&K4423&\"-\"&L4423","v":"04-02-06-04"},4,null,16,4,2,6,4,"04","02","06","04"]
["04-02-07-03",4,null,16,4,2,7,3,{"$f":"IF(LEN(E4424)=1,0&E4424,IF(LEN(E4424)=0,\"00\",RIGHT(E4424,2)))","v":"04"},{"$f":"IF(LEN(F4424)=1,0&F4424,IF(LEN(F4424)=0,\"00\",RIGHT(F4424,2)))","v":"02"},{"$f":"IF(LEN(G4424)=1,0&G4424,IF(LEN(G4424)=0,\"00\",RIGHT(G4424,2)))","v":"07"},{"$f":"IF(LEN(H4424)=1,0&H4424,IF(LEN(H4424)=0,\"00\",RIGHT(H4424,2)))","v":"03"}]
["04-02-08-02",4,null,16,4,2,8,2,"04","02","08","02"]
["04-02-09-01",4,null,16,4,2,9,1,"04","02","09","01"]
["04-02-10-00",4,null,16,4,2,10,0,"04","02","10","00"]
["04-03-00-09",4,null,16,4,3,0,9,"04","03","00","09"]
["04-03-01-08",4,null,16,4,3,1,8,"04","03","01","08"]
["04-03-02-07",4,null,16,4,3,2,7,"04","03","02","07"]
["04-03-03-06",4,null,16,4,3,3,6,"04","03","03","06"]
["04-03-04-05",4,null,16,4,3,4,5,"04","03","04","05"]
["04-03-05-04",4,null,16,4,3,5,4,"04","03","05","04"]
["04-03-06-03",4,null,16,4,3,6,3,"04","03","06","03"]
["04-03-07-02",4,null,16,4,3,7,2,"04","03","07","02"]
["04-03-08-01",4,null,16,4,3,8,1,"04","03","08","01"]
["04-03-09-00",4,null,16,4,3,9,0,"04","03","09","00"]
["04-04-00-08",4,null,16,4,4,0,8,"04","04","00","08"]
["04-04-01-07",4,null,16,4,4,1,7,"04","04","01","07"]
["04-04-02-06",4,null,16,4,4,2,6,"04","04","02","06"]
["04-04-03-05",4,null,16,4,4,3,5,"04","04","03","05"]
["04-04-04-04",4,null,16,4,4,4,4,"04","04","04","04"]
["04-04-05-03",4,null,16,4,4,5,3,"04","04","05","03"]
["04-04-06-02",4,null,16,4,4,6,2,"04","04","06","02"]
["04-04-07-01",4,null,16,4,4,7,1,"04","04","07","01"]
["04-04-08-00",4,null,16,4,4,8,0,"04","04","08","00"]
["04-05-00-07",3,null,16,4,5,0,7,"04","05","00","07"]
["04-05-01-06",3,null,16,4,5,1,6,"04","05","01","06"]
["04-05-02-05",3,null,16,4,5,2,5,"04","05","02","05"]
["04-05-03-04",3,null,16,4,5,3,4,"04","05","03","04"]
["04-05-04-03",3,null,16,4,5,4,3,"04","05","04","03"]
["04-05-05-02",3,null,16,4,5,5,2,"04","05","05","02"]
["04-05-06-01",3,null,16,4,5,6,1,"04","05","06","01"]
["04-05-07-00",3,null,16,4,5,7,0,"04","05","07","00"]
["04-06-00-06",3,null,16,4,6,0,6,"04","06","00","06"]
["04-06-01-05",3,null,16,4,6,1,5,"04","06","01","05"]
["04-06-02-04",3,null,16,4,6,2,4,"04","06","02","04"]
["04-06-03-03",3,null,16,4,6,3,3,"04","06","03","03"]
["04-06-04-02",3,null,16,4,6,4,2,"04","06","04","02"]
["04-06-05-01",3,null,16,4,6,5,1,"04","06","05","01"]
["04-06-06-00",3,null,16,4,6,6,0,"04","06","06","00"]
["04-07-00-05",3,null,16,4,7,0,5,"04","07","00","05"]
["04-07-01-04",3,null,16,4,7,1,4,"04","07","01","04"]
["04-07-02-03",3,null,16,4,7,2,3,"04","07","02","03"]
["04-07-03-02",3,null,16,4,7,3,2,"04","07","03","02"]
["04-07-04-01",3,null,16,4,7,4,1,"04","07","04","01"]
["04-07-05-00",3,null,16,4,7,5,0,"04","07","05","00"]
["04-08-00-04",3,null,16,4,8,0,4,"04","08","00","04"]
["04-08-01-03",2,null,16,4,8,1,3,"04","08","01","03"]
["04-08-02-02",2,null,16,4,8,2,2,"04","08","02","02"]
["04-08-03-01",2,null,16,4,8,3,1,"04","08","03","01"]
["04-08-04-00",2,null,16,4,8,4,0,"04","08","04","00"]
["04-09-00-03",2,null,16,4,9,0,3,"04","09","00","03"]
["04-09-01-02",2,null,16,4,9,1,2,"04","09","01","02"]
["04-09-02-01",2,null,16,4,9,2,1,"04","09","02","01"]
["04-09-03-00",2,null,16,4,9,3,0,"04","09","03","00"]
["04-10-00-02",2,null,16,4,10,0,2,"04","10","00","02"]
["04-10-01-01",2,null,16,4,10,1,1,"04","10","01","01"]
["04-10-02-00",2,null,16,4,10,2,0,"04","10","02","00"]
["04-11-00-01",2,null,16,4,11,0,1,"04","11","00","01"]
["04-11-01-00",2,null,16,4,11,1,0,"04","11","01","00"]
["04-12-00-00",2,null,16,4,12,0,0,"04","12","00","00"]
["05-00-00-11",4,null,16,5,0,0,11,"05","00","00","11"]
["05-00-01-10",4,null,16,5,0,1,10,"05","00","01","10"]
["05-00-02-09",4,null,16,5,0,2,9,"05","00","02","09"]
["05-00-03-08",4,null,16,5,0,3,8,"05","00","03","08"]
[{"$f":"I4487&\"-\"&J4487&\"-\"&K4487&\"-\"&L4487","v":"05-00-04-07"},4,null,16,5,0,4,7,"05","00","04","07"]
["05-00-05-06",4,null,16,5,0,5,6,{"$f":"IF(LEN(E4488)=1,0&E4488,IF(LEN(E4488)=0,\"00\",RIGHT(E4488,2)))","v":"05"},{"$f":"IF(LEN(F4488)=1,0&F4488,IF(LEN(F4488)=0,\"00\",RIGHT(F4488,2)))","v":"00"},{"$f":"IF(LEN(G4488)=1,0&G4488,IF(LEN(G4488)=0,\"00\",RIGHT(G4488,2)))","v":"05"},{"$f":"IF(LEN(H4488)=1,0&H4488,IF(LEN(H4488)=0,\"00\",RIGHT(H4488,2)))","v":"06"}]
["05-00-06-05",4,null,16,5,0,6,5,"05","00","06","05"]
["05-00-07-04",4,null,16,5,0,7,4,"05","00","07","04"]
["05-00-08-03",4,null,16,5,0,8,3,"05","00","08","03"]
["05-00-09-02",4,null,16,5,0,9,2,"05","00","09","02"]
["05-00-10-01",4,null,16,5,0,10,1,"05","00","10","01"]
["05-00-11-00",4,null,16,5,0,11,0,"05","00","11","00"]
["05-01-00-10",4,null,16,5,1,0,10,"05","01","00","10"]
["05-01-01-09",4,null,16,5,1,1,9,"05","01","01","09"]
["05-01-02-08",4,null,16,5,1,2,8,"05","01","02","08"]
["05-01-03-07",4,null,16,5,1,3,7,"05","01","03","07"]
["05-01-04-06",4,null,16,5,1,4,6,"05","01","04","06"]
["05-01-05-05",4,null,16,5,1,5,5,"05","01","05","05"]
["05-01-06-04",4,null,16,5,1,6,4,"05","01","06","04"]
["05-01-07-03",4,null,16,5,1,7,3,"05","01","07","03"]
["05-01-08-02",4,null,16,5,1,8,2,"05","01","08","02"]
["05-01-09-01",4,null,16,5,1,9,1,"05","01","09","01"]
["05-01-10-00",4,null,16,5,1,10,0,"05","01","10","00"]
["05-02-00-09",4,null,16,5,2,0,9,"05","02","00","09"]
["05-02-01-08",4,null,16,5,2,1,8,"05","02","01","08"]
["05-02-02-07",4,null,16,5,2,2,7,"05","02","02","07"]
["05-02-03-06",4,null,16,5,2,3,6,"05","02","03","06"]
["05-02-04-05",4,null,16,5,2,4,5,"05","02","04","05"]
["05-02-05-04",4,null,16,5,2,5,4,"05","02","05","04"]
["05-02-06-03",4,null,16,5,2,6,3,"05","02","06","03"]
["05-02-07-02",4,null,16,5,2,7,2,"05","02","07","02"]
["05-02-08-01",4,null,16,5,2,8,1,"05","02","08","01"]
["05-02-09-00",4,null,16,5,2,9,0,"05","02","09","00"]
["05-03-00-08",4,null,16,5,3,0,8,"05","03","00","08"]
["05-03-01-07",4,null,16,5,3,1,7,"05","03","01","07"]
["05-03-02-06",4,null,16,5,3,2,6,"05","03","02","06"]
["05-03-03-05",4,null,16,5,3,3,5,"05","03","03","05"]
["05-03-04-04",4,null,16,5,3,4,4,"05","03","04","04"]
["05-03-05-03",4,null,16,5,3,5,3,"05","03","05","03"]
["05-03-06-02",4,null,16,5,3,6,2,"05","03","06","02"]
["05-03-07-01",4,null,16,5,3,7,1,"05","03","07","01"]
["05-03-08-00",4,null,16,5,3,8,0,"05","03","08","00"]
["05-04-00-07",3,null,16,5,4,0,7,"05","04","00","07"]
["05-04-01-06",3,null,16,5,4,1,6,"05","04","01","06"]
["05-04-02-05",3,null,16,5,4,2,5,"05","04","02","05"]
["05-04-03-04",3,null,16,5,4,3,4,"05","04","03","04"]
["05-04-04-03",3,null,16,5,4,4,3,"05","04","04","03"]
["05-04-05-02",3,null,16,5,4,5,2,"05","04","05","02"]
["05-04-06-01",3,null,16,5,4,6,1,"05","04","06","01"]
["05-04-07-00",3,null,16,5,4,7,0,"05","04","07","00"]
["05-05-00-06",3,null,16,5,5,0,6,"05","05","00","06"]
["05-05-01-05",3,null,16,5,5,1,5,"05","05","01","05"]
["05-05-02-04",3,null,16,5,5,2,4,"05","05","02","04"]
["05-05-03-03",3,null,16,5,5,3,3,"05","05","03","03"]
["05-05-04-02",3,null,16,5,5,4,2,"05","05","04","02"]
["05-05-05-01",3,null,16,5,5,5,1,"05","05","05","01"]
["05-05-06-00",3,null,16,5,5,6,0,"05","05","06","00"]
["05-06-00-05",3,null,16,5,6,0,5,"05","06","00","05"]
["05-06-01-04",3,null,16,5,6,1,4,"05","06","01","04"]
["05-06-02-03",3,null,16,5,6,2,3,"05","06","02","03"]
["05-06-03-02",3,null,16,5,6,3,2,"05","06","03","02"]
["05-06-04-01",3,null,16,5,6,4,1,"05","06","04","01"]
["05-06-05-00",3,null,16,5,6,5,0,"05","06","05","00"]
["05-07-00-04",3,null,16,5,7,0,4,"05","07","00","04"]
["05-07-01-03",2,null,16,5,7,1,3,"05","07","01","03"]
["05-07-02-02",2,null,16,5,7,2,2,"05","07","02","02"]
["05-07-03-01",2,null,16,5,7,3,1,"05","07","03","01"]
["05-07-04-00",2,null,16,5,7,4,0,"05","07","04","00"]
[{"$f":"I4551&\"-\"&J4551&\"-\"&K4551&\"-\"&L4551","v":"05-08-00-03"},2,null,16,5,8,0,3,"05","08","00","03"]
["05-08-01-02",2,null,16,5,8,1,2,{"$f":"IF(LEN(E4552)=1,0&E4552,IF(LEN(E4552)=0,\"00\",RIGHT(E4552,2)))","v":"05"},{"$f":"IF(LEN(F4552)=1,0&F4552,IF(LEN(F4552)=0,\"00\",RIGHT(F4552,2)))","v":"08"},{"$f":"IF(LEN(G4552)=1,0&G4552,IF(LEN(G4552)=0,\"00\",RIGHT(G4552,2)))","v":"01"},{"$f":"IF(LEN(H4552)=1,0&H4552,IF(LEN(H4552)=0,\"00\",RIGHT(H4552,2)))","v":"02"}]
["05-08-02-01",2,null,16,5,8,2,1,"05","08","02","01"]
["05-08-03-00",2,null,16,5,8,3,0,"05","08","03","00"]
["05-09-00-02",2,null,16,5,9,0,2,"05","09","00","02"]
["05-09-01-01",2,null,16,5,9,1,1,"05","09","01","01"]
["05-09-02-00",2,null,16,5,9,2,0,"05","09","02","00"]
["05-10-00-01",2,null,16,5,10,0,1,"05","10","00","01"]
["05-10-01-00",2,null,16,5,10,1,0,"05","10","01","00"]
["05-11-00-00",2,null,16,5,11,0,0,"05","11","00","00"]
["06-00-00-10",4,null,16,6,0,0,10,"06","00","00","10"]
["06-00-01-09",4,null,16,6,0,1,9,"06","00","01","09"]
["06-00-02-08",4,null,16,6,0,2,8,"06","00","02","08"]
["06-00-03-07",4,null,16,6,0,3,7,"06","00","03","07"]
["06-00-04-06",4,null,16,6,0,4,6,"06","00","04","06"]
["06-00-05-05",4,null,16,6,0,5,5,"06","00","05","05"]
["06-00-06-04",4,null,16,6,0,6,4,"06","00","06","04"]
["06-00-07-03",4,null,16,6,0,7,3,"06","00","07","03"]
["06-00-08-02",4,null,16,6,0,8,2,"06","00","08","02"]
["06-00-09-01",4,null,16,6,0,9,1,"06","00","09","01"]
["06-00-10-00",4,null,16,6,0,10,0,"06","00","10","00"]
["06-01-00-09",4,null,16,6,1,0,9,"06","01","00","09"]
["06-01-01-08",4,null,16,6,1,1,8,"06","01","01","08"]
["06-01-02-07",4,null,16,6,1,2,7,"06","01","02","07"]
["06-01-03-06",4,null,16,6,1,3,6,"06","01","03","06"]
["06-01-04-05",4,null,16,6,1,4,5,"06","01","04","05"]
["06-01-05-04",4,null,16,6,1,5,4,"06","01","05","04"]
["06-01-06-03",4,null,16,6,1,6,3,"06","01","06","03"]
["06-01-07-02",4,null,16,6,1,7,2,"06","01","07","02"]
["06-01-08-01",4,null,16,6,1,8,1,"06","01","08","01"]
["06-01-09-00",4,null,16,6,1,9,0,"06","01","09","00"]
["06-02-00-08",4,null,16,6,2,0,8,"06","02","00","08"]
["06-02-01-07",4,null,16,6,2,1,7,"06","02","01","07"]
["06-02-02-06",4,null,16,6,2,2,6,"06","02","02","06"]
["06-02-03-05",4,null,16,6,2,3,5,"06","02","03","05"]
["06-02-04-04",4,null,16,6,2,4,4,"06","02","04","04"]
["06-02-05-03",4,null,16,6,2,5,3,"06","02","05","03"]
["06-02-06-02",4,null,16,6,2,6,2,"06","02","06","02"]
["06-02-07-01",3,null,16,6,2,7,1,"06","02","07","01"]
["06-02-08-00",3,null,16,6,2,8,0,"06","02","08","00"]
["06-03-00-07",3,null,16,6,3,0,7,"06","03","00","07"]
["06-03-01-06",3,null,16,6,3,1,6,"06","03","01","06"]
["06-03-02-05",3,null,16,6,3,2,5,"06","03","02","05"]
["06-03-03-04",3,null,16,6,3,3,4,"06","03","03","04"]
["06-03-04-03",3,null,16,6,3,4,3,"06","03","04","03"]
["06-03-05-02",3,null,16,6,3,5,2,"06","03","05","02"]
["06-03-06-01",3,null,16,6,3,6,1,"06","03","06","01"]
["06-03-07-00",3,null,16,6,3,7,0,"06","03","07","00"]
["06-04-00-06",3,null,16,6,4,0,6,"06","04","00","06"]
["06-04-01-05",3,null,16,6,4,1,5,"06","04","01","05"]
["06-04-02-04",3,null,16,6,4,2,4,"06","04","02","04"]
["06-04-03-03",3,null,16,6,4,3,3,"06","04","03","03"]
["06-04-04-02",3,null,16,6,4,4,2,"06","04","04","02"]
["06-04-05-01",3,null,16,6,4,5,1,"06","04","05","01"]
["06-04-06-00",3,null,16,6,4,6,0,"06","04","06","00"]
["06-05-00-05",3,null,16,6,5,0,5,"06","05","00","05"]
["06-05-01-04",3,null,16,6,5,1,4,"06","05","01","04"]
["06-05-02-03",3,null,16,6,5,2,3,"06","05","02","03"]
["06-05-03-02",3,null,16,6,5,3,2,"06","05","03","02"]
["06-05-04-01",3,null,16,6,5,4,1,"06","05","04","01"]
["06-05-05-00",3,null,16,6,5,5,0,"06","05","05","00"]
["06-06-00-04",3,null,16,6,6,0,4,"06","06","00","04"]
["06-06-01-03",2,null,16,6,6,1,3,"06","06","01","03"]
["06-06-02-02",2,null,16,6,6,2,2,"06","06","02","02"]
[{"$f":"I4615&\"-\"&J4615&\"-\"&K4615&\"-\"&L4615","v":"06-06-03-01"},2,null,16,6,6,3,1,"06","06","03","01"]
["06-06-04-00",2,null,16,6,6,4,0,{"$f":"IF(LEN(E4616)=1,0&E4616,IF(LEN(E4616)=0,\"00\",RIGHT(E4616,2)))","v":"06"},{"$f":"IF(LEN(F4616)=1,0&F4616,IF(LEN(F4616)=0,\"00\",RIGHT(F4616,2)))","v":"06"},{"$f":"IF(LEN(G4616)=1,0&G4616,IF(LEN(G4616)=0,\"00\",RIGHT(G4616,2)))","v":"04"},{"$f":"IF(LEN(H4616)=1,0&H4616,IF(LEN(H4616)=0,\"00\",RIGHT(H4616,2)))","v":"00"}]
["06-07-00-03",2,null,16,6,7,0,3,"06","07","00","03"]
["06-07-01-02",2,null,16,6,7,1,2,"06","07","01","02"]
["06-07-02-01",2,null,16,6,7,2,1,"06","07","02","01"]
["06-07-03-00",2,null,16,6,7,3,0,"06","07","03","00"]
["06-08-00-02",2,null,16,6,8,0,2,"06","08","00","02"]
["06-08-01-01",2,null,16,6,8,1,1,"06","08","01","01"]
["06-08-02-00",2,null,16,6,8,2,0,"06","08","02","00"]
["06-09-00-01",2,null,16,6,9,0,1,"06","09","00","01"]
["06-09-01-00",2,null,16,6,9,1,0,"06","09","01","00"]
["06-10-00-00",2,null,16,6,10,0,0,"06","10","00","00"]
["07-00-00-09",4,null,16,7,0,0,9,"07","00","00","09"]
["07-00-01-08",4,null,16,7,0,1,8,"07","00","01","08"]
["07-00-02-07",4,null,16,7,0,2,7,"07","00","02","07"]
["07-00-03-06",4,null,16,7,0,3,6,"07","00","03","06"]
["07-00-04-05",4,null,16,7,0,4,5,"07","00","04","05"]
["07-00-05-04",4,null,16,7,0,5,4,"07","00","05","04"]
["07-00-06-03",4,null,16,7,0,6,3,"07","00","06","03"]
["07-00-07-02",4,null,16,7,0,7,2,"07","00","07","02"]
["07-00-08-01",3,null,16,7,0,8,1,"07","00","08","01"]
["07-00-09-00",3,null,16,7,0,9,0,"07","00","09","00"]
["07-01-00-08",4,null,16,7,1,0,8,"07","01","00","08"]
["07-01-01-07",4,null,16,7,1,1,7,"07","01","01","07"]
["07-01-02-06",4,null,16,7,1,2,6,"07","01","02","06"]
["07-01-03-05",4,null,16,7,1,3,5,"07","01","03","05"]
["07-01-04-04",4,null,16,7,1,4,4,"07","01","04","04"]
["07-01-05-03",4,null,16,7,1,5,3,"07","01","05","03"]
["07-01-06-02",3,null,16,7,1,6,2,"07","01","06","02"]
["07-01-07-01",3,null,16,7,1,7,1,"07","01","07","01"]
["07-01-08-00",3,null,16,7,1,8,0,"07","01","08","00"]
["07-02-00-07",3,null,16,7,2,0,7,"07","02","00","07"]
["07-02-01-06",3,null,16,7,2,1,6,"07","02","01","06"]
["07-02-02-05",3,null,16,7,2,2,5,"07","02","02","05"]
["07-02-03-04",3,null,16,7,2,3,4,"07","02","03","04"]
["07-02-04-03",3,null,16,7,2,4,3,"07","02","04","03"]
["07-02-05-02",3,null,16,7,2,5,2,"07","02","05","02"]
["07-02-06-01",3,null,16,7,2,6,1,"07","02","06","01"]
["07-02-07-00",3,null,16,7,2,7,0,"07","02","07","00"]
["07-03-00-06",3,null,16,7,3,0,6,"07","03","00","06"]
["07-03-01-05",3,null,16,7,3,1,5,"07","03","01","05"]
["07-03-02-04",3,null,16,7,3,2,4,"07","03","02","04"]
["07-03-03-03",3,null,16,7,3,3,3,"07","03","03","03"]
["07-03-04-02",3,null,16,7,3,4,2,"07","03","04","02"]
["07-03-05-01",3,null,16,7,3,5,1,"07","03","05","01"]
["07-03-06-00",3,null,16,7,3,6,0,"07","03","06","00"]
["07-04-00-05",3,null,16,7,4,0,5,"07","04","00","05"]
["07-04-01-04",3,null,16,7,4,1,4,"07","04","01","04"]
["07-04-02-03",3,null,16,7,4,2,3,"07","04","02","03"]
["07-04-03-02",3,null,16,7,4,3,2,"07","04","03","02"]
["07-04-04-01",3,null,16,7,4,4,1,"07","04","04","01"]
["07-04-05-00",3,null,16,7,4,5,0,"07","04","05","00"]
["07-05-00-04",3,null,16,7,5,0,4,"07","05","00","04"]
["07-05-01-03",2,null,16,7,5,1,3,"07","05","01","03"]
["07-05-02-02",2,null,16,7,5,2,2,"07","05","02","02"]
["07-05-03-01",2,null,16,7,5,3,1,"07","05","03","01"]
["07-05-04-00",2,null,16,7,5,4,0,"07","05","04","00"]
["07-06-00-03",2,null,16,7,6,0,3,"07","06","00","03"]
["07-06-01-02",2,null,16,7,6,1,2,"07","06","01","02"]
["07-06-02-01",2,null,16,7,6,2,1,"07","06","02","01"]
["07-06-03-00",2,null,16,7,6,3,0,"07","06","03","00"]
["07-07-00-02",2,null,16,7,7,0,2,"07","07","00","02"]
["07-07-01-01",2,null,16,7,7,1,1,"07","07","01","01"]
["07-07-02-00",2,null,16,7,7,2,0,"07","07","02","00"]
[{"$f":"I4679&\"-\"&J4679&\"-\"&K4679&\"-\"&L4679","v":"07-08-00-01"},2,null,16,7,8,0,1,"07","08","00","01"]
["07-08-01-00",2,null,16,7,8,1,0,{"$f":"IF(LEN(E4680)=1,0&E4680,IF(LEN(E4680)=0,\"00\",RIGHT(E4680,2)))","v":"07"},{"$f":"IF(LEN(F4680)=1,0&F4680,IF(LEN(F4680)=0,\"00\",RIGHT(F4680,2)))","v":"08"},{"$f":"IF(LEN(G4680)=1,0&G4680,IF(LEN(G4680)=0,\"00\",RIGHT(G4680,2)))","v":"01"},{"$f":"IF(LEN(H4680)=1,0&H4680,IF(LEN(H4680)=0,\"00\",RIGHT(H4680,2)))","v":"00"}]
["07-09-00-00",2,null,16,7,9,0,0,"07","09","00","00"]
["08-00-00-08",4,null,16,8,0,0,8,"08","00","00","08"]
["08-00-01-07",4,null,16,8,0,1,7,"08","00","01","07"]
["08-00-02-06",4,null,16,8,0,2,6,"08","00","02","06"]
["08-00-03-05",4,null,16,8,0,3,5,"08","00","03","05"]
["08-00-04-04",3,null,16,8,0,4,4,"08","00","04","04"]
["08-00-05-03",3,null,16,8,0,5,3,"08","00","05","03"]
["08-00-06-02",3,null,16,8,0,6,2,"08","00","06","02"]
["08-00-07-01",3,null,16,8,0,7,1,"08","00","07","01"]
["08-00-08-00",3,null,16,8,0,8,0,"08","00","08","00"]
["08-01-00-07",3,null,16,8,1,0,7,"08","01","00","07"]
["08-01-01-06",3,null,16,8,1,1,6,"08","01","01","06"]
["08-01-02-05",3,null,16,8,1,2,5,"08","01","02","05"]
["08-01-03-04",3,null,16,8,1,3,4,"08","01","03","04"]
["08-01-04-03",3,null,16,8,1,4,3,"08","01","04","03"]
["08-01-05-02",3,null,16,8,1,5,2,"08","01","05","02"]
["08-01-06-01",3,null,16,8,1,6,1,"08","01","06","01"]
["08-01-07-00",3,null,16,8,1,7,0,"08","01","07","00"]
["08-02-00-06",3,null,16,8,2,0,6,"08","02","00","06"]
["08-02-01-05",3,null,16,8,2,1,5,"08","02","01","05"]
["08-02-02-04",3,null,16,8,2,2,4,"08","02","02","04"]
["08-02-03-03",3,null,16,8,2,3,3,"08","02","03","03"]
["08-02-04-02",3,null,16,8,2,4,2,"08","02","04","02"]
["08-02-05-01",3,null,16,8,2,5,1,"08","02","05","01"]
["08-02-06-00",3,null,16,8,2,6,0,"08","02","06","00"]
["08-03-00-05",3,null,16,8,3,0,5,"08","03","00","05"]
["08-03-01-04",3,null,16,8,3,1,4,"08","03","01","04"]
["08-03-02-03",3,null,16,8,3,2,3,"08","03","02","03"]
["08-03-03-02",3,null,16,8,3,3,2,"08","03","03","02"]
["08-03-04-01",3,null,16,8,3,4,1,"08","03","04","01"]
["08-03-05-00",3,null,16,8,3,5,0,"08","03","05","00"]
["08-04-00-04",3,null,16,8,4,0,4,"08","04","00","04"]
["08-04-01-03",2,null,16,8,4,1,3,"08","04","01","03"]
["08-04-02-02",2,null,16,8,4,2,2,"08","04","02","02"]
["08-04-03-01",2,null,16,8,4,3,1,"08","04","03","01"]
["08-04-04-00",2,null,16,8,4,4,0,"08","04","04","00"]
["08-05-00-03",2,null,16,8,5,0,3,"08","05","00","03"]
["08-05-01-02",2,null,16,8,5,1,2,"08","05","01","02"]
["08-05-02-01",2,null,16,8,5,2,1,"08","05","02","01"]
["08-05-03-00",2,null,16,8,5,3,0,"08","05","03","00"]
["08-06-00-02",2,null,16,8,6,0,2,"08","06","00","02"]
["08-06-01-01",2,null,16,8,6,1,1,"08","06","01","01"]
["08-06-02-00",2,null,16,8,6,2,0,"08","06","02","00"]
["08-07-00-01",2,null,16,8,7,0,1,"08","07","00","01"]
["08-07-01-00",2,null,16,8,7,1,0,"08","07","01","00"]
["08-08-00-00",2,null,16,8,8,0,0,"08","08","00","00"]
["09-00-00-07",3,null,16,9,0,0,7,"09","00","00","07"]
["09-00-01-06",3,null,16,9,0,1,6,"09","00","01","06"]
["09-00-02-05",3,null,16,9,0,2,5,"09","00","02","05"]
["09-00-03-04",3,null,16,9,0,3,4,"09","00","03","04"]
["09-00-04-03",3,null,16,9,0,4,3,"09","00","04","03"]
["09-00-05-02",3,null,16,9,0,5,2,"09","00","05","02"]
["09-00-06-01",3,null,16,9,0,6,1,"09","00","06","01"]
["09-00-07-00",3,null,16,9,0,7,0,"09","00","07","00"]
["09-01-00-06",3,null,16,9,1,0,6,"09","01","00","06"]
["09-01-01-05",3,null,16,9,1,1,5,"09","01","01","05"]
["09-01-02-04",3,null,16,9,1,2,4,"09","01","02","04"]
["09-01-03-03",3,null,16,9,1,3,3,"09","01","03","03"]
["09-01-04-02",3,null,16,9,1,4,2,"09","01","04","02"]
["09-01-05-01",3,null,16,9,1,5,1,"09","01","05","01"]
["09-01-06-00",3,null,16,9,1,6,0,"09","01","06","00"]
["09-02-00-05",3,null,16,9,2,0,5,"09","02","00","05"]
[{"$f":"I4743&\"-\"&J4743&\"-\"&K4743&\"-\"&L4743","v":"09-02-01-04"},3,null,16,9,2,1,4,"09","02","01","04"]
["09-02-02-03",3,null,16,9,2,2,3,{"$f":"IF(LEN(E4744)=1,0&E4744,IF(LEN(E4744)=0,\"00\",RIGHT(E4744,2)))","v":"09"},{"$f":"IF(LEN(F4744)=1,0&F4744,IF(LEN(F4744)=0,\"00\",RIGHT(F4744,2)))","v":"02"},{"$f":"IF(LEN(G4744)=1,0&G4744,IF(LEN(G4744)=0,\"00\",RIGHT(G4744,2)))","v":"02"},{"$f":"IF(LEN(H4744)=1,0&H4744,IF(LEN(H4744)=0,\"00\",RIGHT(H4744,2)))","v":"03"}]
["09-02-03-02",3,null,16,9,2,3,2,"09","02","03","02"]
["09-02-04-01",3,null,16,9,2,4,1,"09","02","04","01"]
["09-02-05-00",3,null,16,9,2,5,0,"09","02","05","00"]
["09-03-00-04",3,null,16,9,3,0,4,"09","03","00","04"]
["09-03-01-03",2,null,16,9,3,1,3,"09","03","01","03"]
["09-03-02-02",2,null,16,9,3,2,2,"09","03","02","02"]
["09-03-03-01",2,null,16,9,3,3,1,"09","03","03","01"]
["09-03-04-00",2,null,16,9,3,4,0,"09","03","04","00"]
["09-04-00-03",2,null,16,9,4,0,3,"09","04","00","03"]
["09-04-01-02",2,null,16,9,4,1,2,"09","04","01","02"]
["09-04-02-01",2,null,16,9,4,2,1,"09","04","02","01"]
["09-04-03-00",2,null,16,9,4,3,0,"09","04","03","00"]
["09-05-00-02",2,null,16,9,5,0,2,"09","05","00","02"]
["09-05-01-01",2,null,16,9,5,1,1,"09","05","01","01"]
["09-05-02-00",2,null,16,9,5,2,0,"09","05","02","00"]
["09-06-00-01",2,null,16,9,6,0,1,"09","06","00","01"]
["09-06-01-00",2,null,16,9,6,1,0,"09","06","01","00"]
["09-07-00-00",2,null,16,9,7,0,0,"09","07","00","00"]
["10-00-00-06",3,null,16,10,0,0,6,"10","00","00","06"]
["10-00-01-05",3,null,16,10,0,1,5,"10","00","01","05"]
["10-00-02-04",3,null,16,10,0,2,4,"10","00","02","04"]
["10-00-03-03",3,null,16,10,0,3,3,"10","00","03","03"]
["10-00-04-02",3,null,16,10,0,4,2,"10","00","04","02"]
["10-00-05-01",3,null,16,10,0,5,1,"10","00","05","01"]
["10-00-06-00",3,null,16,10,0,6,0,"10","00","06","00"]
["10-01-00-05",3,null,16,10,1,0,5,"10","01","00","05"]
["10-01-01-04",3,null,16,10,1,1,4,"10","01","01","04"]
["10-01-02-03",3,null,16,10,1,2,3,"10","01","02","03"]
["10-01-03-02",3,null,16,10,1,3,2,"10","01","03","02"]
["10-01-04-01",3,null,16,10,1,4,1,"10","01","04","01"]
["10-01-05-00",3,null,16,10,1,5,0,"10","01","05","00"]
["10-02-00-04",3,null,16,10,2,0,4,"10","02","00","04"]
["10-02-01-03",2,null,16,10,2,1,3,"10","02","01","03"]
["10-02-02-02",2,null,16,10,2,2,2,"10","02","02","02"]
["10-02-03-01",2,null,16,10,2,3,1,"10","02","03","01"]
["10-02-04-00",2,null,16,10,2,4,0,"10","02","04","00"]
["10-03-00-03",2,null,16,10,3,0,3,"10","03","00","03"]
["10-03-01-02",2,null,16,10,3,1,2,"10","03","01","02"]
["10-03-02-01",2,null,16,10,3,2,1,"10","03","02","01"]
["10-03-03-00",2,null,16,10,3,3,0,"10","03","03","00"]
["10-04-00-02",2,null,16,10,4,0,2,"10","04","00","02"]
["10-04-01-01",2,null,16,10,4,1,1,"10","04","01","01"]
["10-04-02-00",2,null,16,10,4,2,0,"10","04","02","00"]
["10-05-00-01",2,null,16,10,5,0,1,"10","05","00","01"]
["10-05-01-00",2,null,16,10,5,1,0,"10","05","01","00"]
["10-06-00-00",2,null,16,10,6,0,0,"10","06","00","00"]
["11-00-00-05",3,null,16,11,0,0,5,"11","00","00","05"]
["11-00-01-04",3,null,16,11,0,1,4,"11","00","01","04"]
["11-00-02-03",3,null,16,11,0,2,3,"11","00","02","03"]
["11-00-03-02",3,null,16,11,0,3,2,"11","00","03","02"]
["11-00-04-01",3,null,16,11,0,4,1,"11","00","04","01"]
["11-00-05-00",3,null,16,11,0,5,0,"11","00","05","00"]
["11-01-00-04",3,null,16,11,1,0,4,"11","01","00","04"]
["11-01-01-03",2,null,16,11,1,1,3,"11","01","01","03"]
["11-01-02-02",2,null,16,11,1,2,2,"11","01","02","02"]
["11-01-03-01",2,null,16,11,1,3,1,"11","01","03","01"]
["11-01-04-00",2,null,16,11,1,4,0,"11","01","04","00"]
["11-02-00-03",2,null,16,11,2,0,3,"11","02","00","03"]
["11-02-01-02",2,null,16,11,2,1,2,"11","02","01","02"]
["11-02-02-01",2,null,16,11,2,2,1,"11","02","02","01"]
["11-02-03-00",2,null,16,11,2,3,0,"11","02","03","00"]
["11-03-00-02",2,null,16,11,3,0,2,"11","03","00","02"]
[{"$f":"I4807&\"-\"&J4807&\"-\"&K4807&\"-\"&L4807","v":"11-03-01-01"},2,null,16,11,3,1,1,"11","03","01","01"]
["11-03-02-00",2,null,16,11,3,2,0,{"$f":"IF(LEN(E4808)=1,0&E4808,IF(LEN(E4808)=0,\"00\",RIGHT(E4808,2)))","v":"11"},{"$f":"IF(LEN(F4808)=1,0&F4808,IF(LEN(F4808)=0,\"00\",RIGHT(F4808,2)))","v":"03"},{"$f":"IF(LEN(G4808)=1,0&G4808,IF(LEN(G4808)=0,\"00\",RIGHT(G4808,2)))","v":"02"},{"$f":"IF(LEN(H4808)=1,0&H4808,IF(LEN(H4808)=0,\"00\",RIGHT(H4808,2)))","v":"00"}]
["11-04-00-01",2,null,16,11,4,0,1,"11","04","00","01"]
["11-04-01-00",2,null,16,11,4,1,0,"11","04","01","00"]
["11-05-00-00",2,null,16,11,5,0,0,"11","05","00","00"]
["12-00-00-04",3,null,16,12,0,0,4,"12","00","00","04"]
["12-00-01-03",2,null,16,12,0,1,3,"12","00","01","03"]
["12-00-02-02",2,null,16,12,0,2,2,"12","00","02","02"]
["12-00-03-01",2,null,16,12,0,3,1,"12","00","03","01"]
["12-00-04-00",2,null,16,12,0,4,0,"12","00","04","00"]
["12-01-00-03",2,null,16,12,1,0,3,"12","01","00","03"]
["12-01-01-02",2,null,16,12,1,1,2,"12","01","01","02"]
["12-01-02-01",2,null,16,12,1,2,1,"12","01","02","01"]
["12-01-03-00",2,null,16,12,1,3,0,"12","01","03","00"]
["12-02-00-02",2,null,16,12,2,0,2,"12","02","00","02"]
["12-02-01-01",2,null,16,12,2,1,1,"12","02","01","01"]
["12-02-02-00",2,null,16,12,2,2,0,"12","02","02","00"]
["12-03-00-01",2,null,16,12,3,0,1,"12","03","00","01"]
["12-03-01-00",2,null,16,12,3,1,0,"12","03","01","00"]
["12-04-00-00",2,null,16,12,4,0,0,"12","04","00","00"]
["13-00-00-03",2,null,16,13,0,0,3,"13","00","00","03"]
["13-00-01-02",2,null,16,13,0,1,2,"13","00","01","02"]
["13-00-02-01",2,null,16,13,0,2,1,"13","00","02","01"]
["13-00-03-00",2,null,16,13,0,3,0,"13","00","03","00"]
["13-01-00-02",2,null,16,13,1,0,2,"13","01","00","02"]
["13-01-01-01",2,null,16,13,1,1,1,"13","01","01","01"]
["13-01-02-00",2,null,16,13,1,2,0,"13","01","02","00"]
["13-02-00-01",2,null,16,13,2,0,1,"13","02","00","01"]
["13-02-01-00",2,null,16,13,2,1,0,"13","02","01","00"]
["13-03-00-00",2,null,16,13,3,0,0,"13","03","00","00"]
["14-00-00-02",2,null,16,14,0,0,2,"14","00","00","02"]
["14-00-01-01",2,null,16,14,0,1,1,"14","00","01","01"]
["14-00-02-00",2,null,16,14,0,2,0,"14","00","02","00"]
["14-01-00-01",2,null,16,14,1,0,1,"14","01","00","01"]
["14-01-01-00",2,null,16,14,1,1,0,"14","01","01","00"]
["14-02-00-00",2,null,16,14,2,0,0,"14","02","00","00"]
["15-00-00-01",2,null,16,15,0,0,1,"15","00","00","01"]
["15-00-01-00",2,null,16,15,0,1,0,"15","00","01","00"]
["15-01-00-00",2,null,16,15,1,0,0,"15","01","00","00"]
["16-00-00-00",1,null,16,16,0,0,0,"16","00","00","00"]

{"sheet":"ElementRatingScale","index":11,"n_rows":12,"n_cols":5,"rows_kept":12,"cut":false,"hidden":true,"merged":[]}
["Element Rating","Description",null,"Brief Element Description","Element Rating"]
[1,"No - element not in place and not planning to work on it at this time",null,1,1]
[2,"No - element not in place but planning to work on it or getting started",null,2,2]
[3,"Yes - element partially implemented",null,3,3]
[4,"Yes - element fully implemented",null,4,4]
[]
[null,null,null,"Brief Element Description Plus","Element Rating"]
["Priority Rating",null,null,1,1]
["L","Low",null,2,2]
["M","Medium",null,3,3]
["H","High",null,4,4]
[null,null,null,"Not applicable",{"$f":"\"\"","v":""}]

{"sheet":"IndicatorRating","index":12,"n_rows":31,"n_cols":6,"rows_kept":31,"cut":false,"hidden":true,"merged":[[28,5,28,6],[29,5,29,6],[30,5,30,6],[23,4,23,6],[24,5,24,6],[25,5,25,6],[26,5,26,6],[27,5,27,6],[19,0,20,0],[1,0,2,0],[3,0,4,0],[5,0,9,0],[10,0,13,0],[14,0,16,0],[17,0,18,0]]}
["Quality Indicator Rating","Description"]
[1,"None of the elements are yet planned or in place.  "]
[null,"None of the elements are yet a 2 or higher."]
[2,"Most of the elements are not yet planned or in place. "]
[null,"Less than one half are 3’s; no 4’s. The rest are 1’s or 2’s."]
[3,"Some elements are in place, a few may be fully implemented."]
[null,"Half or less are 3s and 4s; or at least one is a 4."]
[null,"Does not have to have a 4."]
[null,"This is the lowest score with one 4."]
[null,"This is the highest score if no 4."]
[4,"At least half of the elements are in place, a few may be fully implemented."]
[null,"More than ½ are 3 or 4 combined. "]
[null,"Need at least one 4 to get “4” or higher on the scale."]
[null,"If fewer than 7 elements, one or more 1s; if 7 or more elements, 2 or more 1s"]
[5,"At least half of the elements are in place, some are fully implemented."]
[null,"More than half of the elements are 3 and/or 4s, at least 20% are 4s, no elements are rated 1 (if fewer than 7 elements) or one element could be rated 1 if there are 7 or more elements"]
[null,"This is the highest score with a 2."]
[6,"At least half of the elements are fully implemented, the rest are partially implemented."]
[null,"At least half the elements are 4 and the rest are 3."]
[7,"All elements are fully implemented."]
[null,"All element ratings are 4."]
[]
[]
[null,null,null,null,"Best Practice Theme Rating (Calculated)"]
[null,null,null,null,1,"None of the practices are yet planned or in place.  "]
[null,null,null,null,2,"Most of the practices are not yet planned or in place. "]
[null,null,null,null,3,"Some practices are in place; a few may be fully implemented."]
[null,null,null,null,4,"At least half of the practices are in place; a few may be fully implemented."]
[null,null,null,null,5,"At least half of the practices are in place; some are fully implemented."]
[null,null,null,null,6,"At least half of the practices are fully implemented; the rest are partially implemented."]
[null,null,null,null,7,"All practices are fully implemented."]