{"text_format":"1","workbook":"xlsx","n_sheets":16,"sheets":["Instructions","Participants","Table_Contents","Purpose","DataCollection","Analysis","Reporting","UsingData","Evaluation","CrossSystem","QISummary","Data","ALLdata","QIRatingLookup","ElementRatingScale","IndicatorRating"],"not_rendered":{"charts":0,"images":3,"macros":1,"external_links":2,"defined_names":48,"comments":0,"pivot_tables":0},"unopened":[],"bounds":{"document_bytes":16777216,"sheet_cells":100000,"rows_first":2000,"rows_last":500,"rows_between":2000,"halvings":0,"cell_chars":16384,"cell_head_chars":4096},"cells_cut":0,"cells_raw":0,"read":"whole","date_system":"1900"}

{"sheet":"Instructions","index":0,"n_rows":145,"n_cols":9,"rows_kept":145,"cut":false,"hidden":false,"merged":[[143,1,143,3],[55,1,55,4],[58,1,58,4],[82,1,82,4],[90,1,92,4],[70,1,72,4],[73,1,74,4],[75,1,75,4],[77,1,77,4],[78,1,80,4],[83,1,87,4],[89,1,89,4],[59,1,60,4],[5,1,5,5],[25,1,25,3],[26,1,26,3],[27,1,27,3],[28,1,28,3],[7,1,7,4],[6,1,6,4],[23,1,23,4],[8,1,8,4],[21,1,21,4],[10,1,11,4],[12,2,12,4],[13,2,13,4],[14,2,15,4],[17,1,19,4],[48,1,48,4],[52,1,52,4],[53,1,53,4],[29,1,29,3],[37,1,37,3],[38,1,38,3],[39,1,39,3],[40,1,40,4],[30,2,30,3],[31,2,31,3],[32,2,32,3],[33,2,33,3],[34,2,34,3],[35,2,35,3],[94,1,94,4],[36,2,36,3],[54,1,54,4],[41,1,42,4],[44,1,44,4],[45,1,46,4],[47,1,47,4],[49,1,50,4],[51,1,51,4],[61,1,61,4],[62,1,67,4],[69,1,69,4],[56,1,56,4],[57,1,57,4]]}
[]
[]
[]
[]
[]
[null,"State Family Outcomes Measurement (S-FOMS) Self-Assessment"]
[null,null,null,null,null,null,null,null,"Instructions"]
[null,"Overview of Instructions",null,null,null,null,null,null,"Overview"]
[null,"The S-FOMS Self-Assessment Tool has 12 worksheets. Seven are for rating the elements of quality for  each of the seven components . The purpose of each worksheet is described below along with the instructions on how to use it.",null,null,null,null,null,null,"There are 15 worksheets within the Self-Assessment workbooks, 11 of which are for rating the elements of quality: for each of the 5 ECTA components and the 6 Data subcomponents. The purpose of each worksheet is described below, as well as the instructions on how to use each."]
[null,null,null,null,null,null,null,null,0]
[null,"Upon opening the workbook, be sure to enable the macros. There are several ways to accomplish this, depending upon which version of Microsoft you are using:  "]
[]
[null,null,"•  Microsoft 2013: Click on the Enable Content button in the yellow Message Bar."]
[null,null,"•  Microsoft Excel 2007 and 2010: Go to File > Info > Enable Content > Enable All Content."]
[null,null,"•  Microsoft 2003: Download and install the Compatibility Pack from Microsoft:   https://www.microsoft.com/en-us/download/details.aspx?id=3  "]
[]
[]
[null,"If you cannot enable the macros through one of these methods, you may need to change a setting in your security or trust center settings. Additional information is provided at http://www.exceltrick.com/how_to/enable-macros-in-excel/."]
[]
[]
[]
[null,"Throughout the workbook, cells that are shaded light yellow require data entry; data cannot be entered in cells shaded light blue; those cells are automatically calculated and cannot be edited.",null,null,null,null,null,null,"Throughout the workbook, cells that are shaded a light orange require data entry; data cannot be entered in cells shaded light blue, those cells are automatically calculated and cannot be edited."]
[]
[null,"Worksheets",null,null,null,null,null,null,0]
[]
[null,"The 12 Worksheets",null,null,null,null,null,null,"15 Worksheets"]
[null,"Instructions"]
[null,"Participants",null,null,null,null,null,null,"Participants"]
[null,"Table of Contents",null,null,null,null,null,null,"Table of Contents"]
[null,"Element Rating Sheets (7)",null,null,null,null,null,null,"Element Rating Sheets (11)"]
[null,null,"Purpose",null,null,null,null,null,0]
[null,null,"Data Collection and Transmission",null,null,null,null,null,0]
[null,null,"Analysis",null,null,null,null,null,0]
[null,null,"Reporting",null,null,null,null,null,0]
[null,null,"Using Data",null,null,null,null,null,0]
[null,null,"Evaluation",null,null,null,null,null,0]
[null,null,"Cross-system Coordination",null,null,null,null,null,0]
[null,"QI Summary",null,null,null,null,null,null,"CompData"]
[null,"Data"]
[null,null,null,null,null,null,null,null,"QI Summary"]
[null,"Instructions"]
[null,"The Instructions sheet provides detailed instructions for working in the S-FOMS Self-Assessment Tool. They are provided here and in the S-FOMS Self-Assessment Guide."]
[]
[]
[null,"Participants",null,null,null,null,null,null,"Participants"]
[null,"This sheet is for documenting the participants (by name and/or role) who are involved in the self-assessment. Enter the name and/or role of each participant, and place an “X” in the cell in the component. Enter the date on which the self-assessment was completed in row 12. ",null,null,null,null,null,null,"Enter the name and/or role of each participant, and place an “X” in the cell in the component.  The date on which the self-assessment was completed may also be entered in row 12."]
[]
[null,null,null,null,null,null,null,null,0]
[null,"Table of Contents",null,null,null,null,null,null,"Table of Contents"]
[null,"The Table of Contents sheet lists all the components of the S-FOMS. There are links to each of the component worksheets. An alternative to using the links is to click on the worksheet tab at the bottom of the document.",null,null,null,null,null,null,"This sheet lists all of the components and subcomponents in the ECTA/DaSy Framework."]
[null,null,null,null,null,null,null,null,"An alternative to using the links is simply to click on the worksheet tab at the bottom of the document."]
[null,null,null,null,null,null,null,null,0]
[null,"Element Rating Worksheets",null,null,null,null,null,null,"Element Rating Worksheets"]
[null,"Element ratings:  Each of the seven worksheets is used to rate the elements of quality (EQs) for one component.  Within a worksheet the elements are organized by Quality Indicator (QI).",null,null,null,null,null,null,"Element ratings:  Each of these 11 worksheets are used to rate the elements of quality (EQs) for each component/subcomponent.  The elements are organized by Quality Indicator (QI)."]
[null,"In the Rating column, enter the rating for each element by entering the number (1 to 4) or by selecting the value from the dropdown list. The Element of Quality Rating scale, 1 to 4, is presented at the top directly above the rating column and is further explained in the S-FOMS Self-Assessment Guide.",null,null,null,null,null,null,"In the Rating column, enter the rating for each element by entering the number (1 to 4) or by selecting the value from the dropdown list.  The Elements of Quality Rating scale, 1 to 4, is presented at the top left and further explained in the self-assessment guidance document."]
[null,"     Once all element ratings for a QI are entered, the QI rating is automatically calculated and displayed in the row for the respective QI (in the light blue cell).",null,null,null,null,null,null,"Once all elements for a QI are entered, the QI rating is automatically calculated and displayed in the row for the respective QI (in the light blue cell)."]
[null,"     Several QIs – AN2, AN4, RP2, and UD2 – begin with a yes/no question about whether the state has a process for systematically collecting information from local programs. If the answer is yes (the default), proceed to rate the elements that follow. A response of no will automatically result in a QI rating of 1, and the elements will be inaccessible for rating."]
[null,"     Two elements in QI DC1 (L, O) allow “not applicable” as a response option; the QI rating is adjusted as necessary if this is selected."]
[null,"Evidence:  Immediately below each element is a text box (shaded light yellow) for documenting the evidence for the element.  The text box will expand to the needed length and clicking on the Show Evidence button will resize the rows and display all the evidence; clicking on the Hide Evidence button will hide all the evidence rows. Thus, the Element Rating worksheets may be viewed and/or printed with or without the evidence displayed.",null,null,null,null,null,null,"Evidence:  Immediately below each element is a text box (shaded light orange) that can be used to document the evidence for the element.  The text box will expand to the needed length."]
[null,"     At the top of each sheet is a link back to the Table of Contents and buttons that make it easy to navigate to each QI."]
[null,null,null,null,null,null,null,null,"Also notice that there is a link back to the Table of Contents."]
[null,"Priority:  To the right of each cell for the element rating and QI rating is a cell to indicate the Priority of each element and QI. The Priority rating is an optional feature and may be used for planning which elements or QIs to work on. The Priority options are high, medium, or low, or this cell may be left blank.  ",null,null,null,null,null,null,"Priority:  To the right of each cell for the element and QI rating is a cell to indicate the Priority of each element and QI.  The Priority rating is an optional feature and may be used for planning which elements or QIs to work on.  The Priority options are high, medium or low, or may be left blank.   "]
[null,"     The priority designation may be entered by typing L, M, or H (lower or upper case) or by using the drop-down list. We recommend states rate the elements of quality for all components that will be completed and then go back and assign the priority. This allows the stakeholders to get an overall view of strengths and areas of need across multiple QIs and elements. "]
[]
[]
[]
[]
[null,null,null,null,null,null,null,null,0]
[]
[null,"QI Summary",null,null,null,null,null,null,"QI Summary"]
[null,"The QI Summary sheet displays a summary of the QI ratings for each of the QIs for which all the elements were rated. Data cannot be entered or edited on this sheet; it simply displays the summary data from the Element Rating worksheets. The QI ratings are displayed in column J, and the QI priority, if entered, is displayed in column K. The red, yellow, or green horizontal bars graphically depict the QI ratings. ",null,null,null,null,null,null,"The QI Summary tab displays a summary of the QI ratings for each of those completed.  "]
[null,null,null,null,null,null,null,null,"The QI ratings are displayed in column M, and the QI priority, if selected, is displayed in column N.  The red, yellow or green horizontal bars graphically depict the QI rating.  "]
[null,null,null,null,null,null,null,null,"The number of elements in each QI with ratings of 1, 2, 3 and 4 are summarized to the right of the graph, followed by the total number of elements in that QI."]
[null,"     The total number of elements in the QI is presented to the right of the graph. To the right of the total is the number of elements in each QI with ratings of 1, 2, 3, and 4. A summary of the number of elements with each priority is provided to the far right. The number of elements for each priority reflects only those elements for which a priority was selected.",null,null,null,null,null,null,"A summary of the number of elements with each priority is provided to the far right.  The number of elements for each priority reflects only those elements for which a priority was selected."]
[null,null,null,null,null,null,null,null,"The links at the top left of the sheet, to the right of Jump To, allow easy navigation to the Qis in that component/subcomponent."]
[null,"     The links at the top left of the sheet, to the right of Jump To, allow easy navigation to each of the components in the QI Summary sheet.",null,null,null,null,null,null,"Also at the top of this sheet are two buttons called Wrap Text and Narrow Rows.  Click on the Wrap text button to display the full text of the QI; click on the Narrow Rows button to view the first part of the QI, with only one row per QI."]
[]
[null,"Data"]
[null,"The Get Data button (to the right) will generate a sheet with data for current Quality Indicator and Element ratings. If additional QIs are completed after getting the initial data, click on the Get Data button again to refresh the sheet with all current data.\nNote: There is a 10-15 second delay to generate the data sheet."]
[]
[]
[]
[null,"Saving the Results of the Self-Assessment"]
[null,"Because the S-COMS Self-Assessment Tool is an Excel workbook, it needs to be saved just like any other workbook. We recommend saving the file with the date it was completed in the file name (e.g., S-COMS SA_102217) and then saving it with a new file name if you complete more components later. Save the file often while you are working in it. "]
[]
[]
[]
[]
[]
[null,"Printing the Results of the Self-Assessment"]
[null,"Each worksheet in the workbook has an existing default print area set up. The print areas may be redefined or resized by using the Print Area option in Excel’s Page Layout tab."]
[]
[]
[]
[null,"Please cite as: \nThe Early Childhood Technical Assistance Center and the Center for IDEA Early Childhood Data Systems. (2017). S-FOMS self-assessment. Retrieved from http://ectacenter.org/eco/pages/familyoutcomes.asp#frameworks\n\nThe contents of this tool and guidance were developed under grants from the U.S. Department of Education, #H326P120002 and #H373Z120002. However, those contents do not necessarily represent the policy of the U.S. Department of Education, and you should not assume endorsement by the Federal Government. \nProject Officers:  Meredith Miceli, Richelle Davis, and Julia Martin Eile."]
[]
[]
[]
[]
[]
[]
[]
[]
[]
[]
[]
[]
[]
[]
[]
[]
[]
[]
[]
[]
[]
[]
[]
[]
[]
[]
[]
[]
[]
[]
[]
[]
[]
[]
[]
[]
[]
[]
[]
[]
[]
[]
[]
[]
[]
[]
[]
[]
[null,"Release version 1: November 2017"]
[null,"Development version 11"]

{"sheet":"Participants","index":1,"n_rows":13,"n_cols":10,"rows_kept":13,"cut":false,"hidden":false,"merged":[[8,3,8,7],[8,8,8,9],[6,2,6,5]]}
[null,"Self-Assessment Participants"]
[]
[null,"1. Identify the participants by name and/or title who participated in the self-assessment of one or more components."]
[null,"2. Place an X in the column representing the component in which each participated."]
[null,"3. Use the date field to note the date on which the self-assessment was conducted."]
[]
[null,"State:","Enter State"]
[]
[]
[]
[null,null,null,"Purpose","Data Collection\nand Transmission","Analysis","Reporting","UsingData","Evaluation","Cross-system Coordination"]
[null,null,"Date: "]
[null,"Participant Name","Participant Role/Title"]

{"sheet":"Table_Contents","index":2,"n_rows":31,"n_cols":3,"rows_kept":31,"cut":false,"hidden":false,"merged":[[1,1,1,2]]}
[]
[null,"ECTA-DaSy S-FOMS Self-Assessment"]
[]
[null,null,"Purpose"]
[null,null,"PR1. State has articulated the purposes(s) of the family experiences and outcomes measurement system."]
[]
[null,null,"Data Collection and Transmission"]
[null,null,"DC1. Data collection procedures are carried out efficiently and effectively."]
[null,null,"DC2. State’s method for entering, transmitting, and storing data is effective and efficient."]
[]
[null,null,"Analysis"]
[null,null,"AN1. State identifies accountability and program improvement questions related to family experiences and outcomes."]
[null,null,"AN2. Local programs identify accountability and program improvement questions related to family experiences and outcomes."]
[null,null,"AN3. State agency analyzes data in a timely manner."]
[null,null,"AN4. Local programs analyze data in a timely manner."]
[null,null,"AN5. State agency ensures completeness and accuracy of data."]
[]
[null,null,"Reporting"]
[null,null,"RP1. State agency interprets, reports, and communicates information related to family experiences and outcomes."]
[null,null,"RP2. Local programs interpret, report, and communicate information related to family experiences and outcomes."]
[]
[null,null,"Using Data"]
[null,null,"UD1. State agency makes regular use of information on family experiences and outcomes to improve programs."]
[null,null,"UD2. Local programs make regular use of information on family experiences and outcomes to improve programs."]
[]
[null,null,"Evaluation"]
[null,null,"EV1. State evaluates its family experiences and outcomes measurement system regularly."]
[]
[null,null,"Cross-system Coordination"]
[null,null,"CC1. Part C and Part B 619 coordinate family experiences and outcomes measurement."]
[null,null,"CC2. Family experiences and outcomes measurement is integrated across early childhood (EC) programs statewide."]

{"sheet":"Purpose","index":3,"n_rows":24,"n_cols":27,"rows_kept":24,"cut":false,"hidden":false,"merged":[[10,23,11,23],[10,22,11,22],[13,22,14,23],[21,5,21,8],[14,10,15,10],[14,11,15,11],[16,10,17,10],[16,11,17,11],[18,10,19,10],[18,11,19,11],[20,10,21,10],[20,11,21,11],[18,4,18,8],[11,4,11,8],[20,4,20,8],[14,4,14,8],[16,4,16,8],[13,5,13,8],[15,5,15,8],[0,3,1,5],[17,5,17,8],[2,3,2,5],[12,4,12,8],[19,5,19,8],[20,13,21,13],[10,18,10,21],[12,17,13,17],[14,17,15,17],[16,17,17,17],[18,17,19,17],[20,17,21,17],[14,18,14,21],[15,18,15,21],[12,10,13,10],[12,13,13,13],[14,13,15,13],[16,13,17,13],[18,13,19,13],[12,11,13,11],[10,10,10,11],[4,7,4,13],[8,4,8,5],[3,4,3,5],[4,4,4,5],[5,4,5,5],[6,4,6,5],[7,4,7,5],[9,4,9,5],[5,8,5,13],[6,8,6,13],[7,8,7,13],[8,8,8,13],[22,4,22,8],[22,10,23,10],[22,11,23,11],[22,13,23,13],[22,17,23,17],[23,5,23,8]]}
[null,null,null,"Purpose",null,null,null,null,null,null,null,null,null,null,null,null,null,null,null,null,null,null,null,null,null,{"$f":"E1&F1","v":""}]
[null,null,null,null,null,null,null,null,null,null,null,null,null,null,null,null,null,null,null,null,null,null,null,null,null,""]
[null,null,null,"Quality Indicator Rating (Calculated)",null,null,null,null,null,null,null,null,null,null,null,null,null,null,null,null,null,null,null,null,null,""]
[null,null,null,1,"None of the elements is yet planned or in place.  ",null,null,null,null,null,null,null,null,null,null,null,null,null,null,null,null,null,null,null,null,"None of the elements is yet planned or in place.  "]
[null,null,null,2,"Most of the elements are not yet planned or in place. ",null,null,"Element of Quality Rating (EQR)",null,null,null,null,null,null,null,null,null,null,null,null,null,null,null,null,null,"Most of the elements are not yet planned or in place. "]
[null,null,null,3,"Some elements are in place; a few may be fully implemented.",null,null,1,"No - element not in place and not planning to work on it at this time",null,null,null,null,null,null,null,null,null,null,null,null,null,null,null,null,"Some elements are in place; a few may be fully implemented."]
[null,null,null,4,"At least half of the elements are in place; a few may be fully implemented.",null,null,2,"No - element not in place but planning to work on it or getting started",null,null,null,null,null,null,null,null,null,null,null,null,null,null,null,null,"At least half of the elements are in place; a few may be fully implemented."]
[null,null,null,5,"At least half of the elements are in place; some are fully implemented.",null,null,3,"Yes - element partially implemented",null,null,null,null,null,null,null,null,null,null,null,null,null,null,null,null,"At least half of the elements are in place; some are fully implemented."]
[null,null,null,6,"At least half of the elements are fully implemented; the rest are partially implemented.",null,null,4,"Yes - element fully implemented",null,null,null,null,null,null,null,null,null,null,null,null,null,null,null,null,"At least half of the elements are fully implemented; the rest are partially implemented."]
[null,null,null,7,"All elements are fully implemented.",null,null,null,null,null,null,null,null,null,null,null,null,null,null,null,null,null,null,null,null,"All elements are fully implemented."]
["Index",null,null,null,null,null,null,null,null,null,"Rating",null,null,"PRIORITY",null,null,null,null,null,null,null,null,null,null,null,""]
[null,"Q-PR1-0",null,"PR 1",{"$f":"VLOOKUP(B12,ALLdata!A:F,6,FALSE)","v":"State has articulated the purposes(s) of the family experiences and outcomes measurement system."},null,null,null,null,null,"QI Rating: ",{"$f":"VLOOKUP(B12,ALLdata!A:H,8,FALSE)","v":0},null,null,null,null,{"$f":"IF(E12=\"Evidence:\",1,0)","v":0},null,null,null,null,null,null,null,null,{"$f":"E12&F12","v":"State has articulated the purposes(s) of the family experiences and outcomes measurement system."},{"$f":"K12","v":"QI Rating: "}]
[null,{"$f":"\"E-PR1-\"&D13","v":"E-PR1-a"},null,"a",{"$f":"VLOOKUP(B13,ALLdata!A:F,6,FALSE)","v":"Stakeholders are involved in development of the purposes."},null,null,null,null,null,"Element Rating:",null,null,null,null,null,0,null,null,null,null,null,null,null,null,"Stakeholders are involved in development of the purposes.",{"$f":"K13","v":"Element Rating:"}]
[null,null,null,null,"Evidence:",null,null,null,null,null,null,null,null,null,null,null,1,null,null,null,null,null,null,null,null,"Evidence:"]
[null,{"$f":"LEFT(B13,6)&D15","v":"E-PR1-b"},null,"b",{"$f":"VLOOKUP(B15,ALLdata!A:F,6,FALSE)","v":"Written statement addresses why data are being collected and how data will be used. Statement specifies who will use the data and for what purposes."},null,null,null,null,null,"Element Rating:",null,null,null,null,null,0,null,null,null,null,null,null,null,null,"Written statement addresses why data are being collected and how data will be used. Statement specifies who will use the data and for what purposes.",{"$f":"K15","v":"Element Rating:"}]
[null,null,null,null,"Evidence:",null,null,null,null,null,null,null,null,null,null,null,1,null,null,null,null,null,null,null,null,"Evidence:"]
[null,{"$f":"LEFT(B15,6)&D17","v":"E-PR1-c"},null,"c",{"$f":"VLOOKUP(B17,ALLdata!A:F,6,FALSE)","v":"Statement is easily accessible to local administrators, providers, families, and the general public."},null,null,null,null,null,"Element Rating:",null,null,null,null,null,0,null,null,null,null,null,null,null,null,"Statement is easily accessible to local administrators, providers, families, and the general public.",{"$f":"K17","v":"Element Rating:"}]
[null,null,null,null,"Evidence:",null,null,null,null,null,null,null,null,null,null,null,1,null,null,null,null,null,null,null,null,"Evidence:"]
[null,{"$f":"LEFT(B17,6)&D19","v":"E-PR1-d"},null,"d",{"$f":"VLOOKUP(B19,ALLdata!A:F,6,FALSE)","v":"Families receiving services are fully informed of the purposes for collecting data on family experiences and outcomes."},null,null,null,null,null,"Element Rating:",null,null,null,null,null,0,null,null,null,null,null,null,null,null,"Families receiving services are fully informed of the purposes for collecting data on family experiences and outcomes.",{"$f":"K19","v":"Element Rating:"}]
[null,null,null,null,"Evidence:",null,null,null,null,null,null,null,null,null,null,null,1,null,null,null,null,null,null,null,null,"Evidence:"]
[null,{"$f":"LEFT(B19,6)&D21","v":"E-PR1-e"},null,"e",{"$f":"VLOOKUP(B21,ALLdata!A:F,6,FALSE)","v":"Purposes include meeting reporting requirements and providing ongoing information for data-based decision-making for program improvement."},null,null,null,null,null,"Element Rating:",null,null,null,null,null,0,null,null,null,null,null,null,null,null,"Purposes include meeting reporting requirements and providing ongoing information for data-based decision-making for program improvement.",{"$f":"K21","v":"Element Rating:"}]
[null,null,null,null,"Evidence:",null,null,null,null,null,null,null,null,null,null,null,1,null,null,null,null,null,null,null,null,"Evidence:"]
[null,{"$f":"LEFT(B21,6)&D23","v":"E-PR1-f"},null,"f",{"$f":"VLOOKUP(B23,ALLdata!A:F,6,FALSE)","v":"Purpose includes examining multiple aspects of families’ experiences with the program and their outcomes (e.g., helpfulness of early intervention, family outcomes, family-centered services)."},null,null,null,null,null,"Element Rating:",null,null,null,null,null,{"$f":"IF(E23=\"Evidence:\",1,0)","v":0},null,null,null,null,null,null,null,null,{"$f":"E23&F23","v":"Purpose includes examining multiple aspects of families’ experiences with the program and their outcomes (e.g., helpfulness of early intervention, family outcomes, family-centered services)."},{"$f":"K23","v":"Element Rating:"}]
[null,null,null,null,"Evidence:",null,null,null,null,null,null,null,null,null,null,null,1,null,null,null,null,null,null,null,null,"Evidence:"]

{"sheet":"DataCollection","index":4,"n_rows":64,"n_cols":27,"rows_kept":64,"cut":false,"hidden":false,"merged":[[0,3,1,5],[10,22,11,22],[10,23,11,23],[13,22,14,23],[44,22,45,22],[44,23,45,23],[47,22,48,23],[10,18,10,21],[12,17,13,17],[14,17,15,17],[16,17,17,17],[18,17,19,17],[20,17,21,17],[22,17,23,17],[24,17,25,17],[26,17,27,17],[28,17,29,17],[46,4,46,8],[27,5,27,8],[26,4,26,8],[28,4,28,8],[32,4,32,8],[32,10,33,10],[32,11,33,11],[56,4,56,8],[60,4,60,8],[45,4,45,8],[38,4,38,8],[39,5,39,8],[40,4,40,8],[47,5,47,8],[48,4,48,8],[49,5,49,8],[50,4,50,8],[51,5,51,8],[52,4,52,8],[53,5,53,8],[54,4,54,8],[55,5,55,8],[41,5,41,8],[42,4,42,8],[43,5,43,8],[36,4,36,8],[36,10,37,10],[36,11,37,11],[29,5,29,8],[30,4,30,8],[31,5,31,8],[33,5,33,8],[35,5,35,8],[37,5,37,8],[30,10,31,10],[30,11,31,11],[19,5,19,8],[20,4,20,8],[21,5,21,8],[22,4,22,8],[23,5,23,8],[24,4,24,8],[25,5,25,8],[12,10,13,10],[18,10,19,10],[22,10,23,10],[14,10,15,10],[14,18,14,21],[15,18,15,21],[10,10,10,11],[60,10,61,10],[60,11,61,11],[60,13,61,13],[34,17,35,17],[36,13,37,13],[36,17,37,17],[38,10,39,10],[38,11,39,11],[38,13,39,13],[38,17,39,17],[58,10,59,10],[58,11,59,11],[52,17,53,17],[54,17,55,17],[48,18,48,21],[49,18,49,21],[56,17,57,17],[18,11,19,11],[12,11,13,11],[22,11,23,11],[14,11,15,11],[56,10,57,10],[56,11,57,11],[56,13,57,13],[14,13,15,13],[16,10,17,10],[16,11,17,11],[16,13,17,13],[28,10,29,10],[28,11,29,11],[22,13,23,13],[24,10,25,10],[24,11,25,11],[24,13,25,13],[46,10,47,10],[44,18,44,21],[46,17,47,17],[48,17,49,17],[50,17,51,17],[26,13,27,13],[26,10,27,10],[26,11,27,11],[40,10,41,10],[40,11,41,11],[40,13,41,13],[40,17,41,17],[42,10,43,10],[42,11,43,11],[42,13,43,13],[42,17,43,17],[30,13,31,13],[30,17,31,17],[32,13,33,13],[32,17,33,17],[46,11,47,11],[46,13,47,13],[48,10,49,10],[48,11,49,11],[4,4,4,5],[5,4,5,5],[6,4,6,5],[7,4,7,5],[18,13,19,13],[20,10,21,10],[20,11,21,11],[20,13,21,13],[4,7,4,13],[8,4,8,5],[9,4,9,5],[5,8,5,13],[6,8,6,13],[7,8,7,13],[8,8,8,13],[11,4,11,8],[12,4,12,8],[13,5,13,8],[14,4,14,8],[15,5,15,8],[16,4,16,8],[17,5,17,8],[18,4,18,8],[12,13,13,13],[58,13,59,13],[58,17,59,17],[59,5,59,8],[60,17,61,17],[61,5,61,8],[2,3,2,5],[48,13,49,13],[50,10,51,10],[50,11,51,11],[50,13,51,13],[52,10,53,10],[52,11,53,11],[52,13,53,13],[54,10,55,10],[54,11,55,11],[54,13,55,13],[28,13,29,13],[34,4,34,8],[34,10,35,10],[34,11,35,11],[34,13,35,13],[57,5,57,8],[58,4,58,8],[3,4,3,5]]}
[null,null,null,"Data Collection and Transmission"]
[]
[null,null,null,"Quality Indicator Rating (Calculated)"]
[null,null,null,1,"None of the elements is yet planned or in place.  "]
[null,null,null,2,"Most of the elements are not yet planned or in place. ",null,null,"Element of Quality Rating (EQR)"]
[null,null,null,3,"Some elements are in place; a few may be fully implemented.",null,null,1,"No - element not in place and not planning to work on it at this time"]
[null,null,null,4,"At least half of the elements are in place; a few may be fully implemented.",null,null,2,"No - element not in place but planning to work on it or getting started"]
[null,null,null,5,"At least half of the elements are in place; some are fully implemented.",null,null,3,"Yes - element partially implemented"]
[null,null,null,6,"At least half of the elements are fully implemented; the rest are partially implemented.",null,null,4,"Yes - element fully implemented"]
[null,null,null,7,"All elements are fully implemented."]
[null,null,null,null,null,null,null,null,null,null,"Rating",null,null,"PRIORITY",null,null,null,null,null,null,null,null,null,null,null,{"$f":"E11&F11","v":""}]
[null,"Q-DC1-0",null,"DC 1",{"$f":"VLOOKUP(B12,ALLdata!A:F,6,FALSE)","v":"Data collection procedures are carried out efficiently and effectively."},null,null,null,null,null,"QI Rating: ",{"$f":"VLOOKUP(B12,ALLdata!A:H,8,FALSE)","v":0},null,null,null,null,{"$f":"IF(E12=\"Evidence:\",1,0)","v":0},null,null,null,null,null,null,null,null,{"$f":"E12&F12","v":"Data collection procedures are carried out efficiently and effectively."},{"$f":"K12","v":"QI Rating: "}]
[null,{"$f":"\"E-DC1-\"&D13","v":"E-DC1-a"},null,"a",{"$f":"VLOOKUP(B13,ALLdata!A:F,6,FALSE)","v":"Data collection methods are aligned with the purpose(s) the state wants to address. (Methods refer to multiple aspects of the data collection, such as how the data are collected, from whom, when, how often, etc.)"},null,null,null,null,null,"Element Rating:",null,null,null,null,null,0,null,null,null,null,null,null,null,null,"Data collection methods are aligned with the purpose(s) the state wants to address. (Methods refer to multiple aspects of the data collection, such as how the data are collected, from whom, when, how often, etc.)",{"$f":"K13","v":"Element Rating:"}]
[null,null,null,null,"Evidence:",null,null,null,null,null,null,null,null,null,null,null,1,null,null,null,null,null,null,null,null,"Evidence:",0]
[null,{"$f":"LEFT(B13,6)&D15","v":"E-DC1-b"},null,"b",{"$f":"VLOOKUP(B15,ALLdata!A:F,6,FALSE)","v":"Stakeholders are involved in deciding on the data collection methods."},null,null,null,null,null,"Element Rating:",null,null,null,null,null,0,null,null,null,null,null,null,null,null,"Stakeholders are involved in deciding on the data collection methods.","Element Rating:"]
[null,null,null,null,"Evidence:",null,null,null,null,null,null,null,null,null,null,null,1,null,null,null,null,null,null,null,null,"Evidence:",0]
[null,{"$f":"LEFT(B15,6)&D17","v":"E-DC1-c"},null,"c",{"$f":"VLOOKUP(B17,ALLdata!A:F,6,FALSE)","v":"State has comprehensive written policies and procedures describing the data collection and transmission approach."},null,null,null,null,null,"Element Rating:",null,null,null,null,null,0,null,null,null,null,null,null,null,null,"State has comprehensive written policies and procedures describing the data collection and transmission approach.","Element Rating:"]
[null,null,null,null,"Evidence:",null,null,null,null,null,null,null,null,null,null,null,1,null,null,null,null,null,null,null,null,"Evidence:",0]
[null,{"$f":"LEFT(B17,6)&D19","v":"E-DC1-d"},null,"d",{"$f":"VLOOKUP(B19,ALLdata!A:F,6,FALSE)","v":"Policies and procedures are clear and readily accessible."},null,null,null,null,null,"Element Rating:",null,null,null,null,null,0,null,null,null,null,null,null,null,null,"Policies and procedures are clear and readily accessible.","Element Rating:"]
[null,null,null,null,"Evidence:",null,null,null,null,null,null,null,null,null,null,null,1,null,null,null,null,null,null,null,null,"Evidence:",0]
[null,{"$f":"LEFT(B19,6)&D21","v":"E-DC1-e"},null,"e",{"$f":"VLOOKUP(B21,ALLdata!A:F,6,FALSE)","v":"Procedures are revised as necessary based on needs of local or state agency; systematic process exists for communicating changes in timely manner."},null,null,null,null,null,"Element Rating:",null,null,null,null,null,0,null,null,null,null,null,null,null,null,"Procedures are revised as necessary based on needs of local or state agency; systematic process exists for communicating changes in timely manner.","Element Rating:"]
[null,null,null,null,"Evidence:",null,null,null,null,null,null,null,null,null,null,null,1,null,null,null,null,null,null,null,null,"Evidence:",0]
[null,{"$f":"LEFT(B21,6)&D23","v":"E-DC1-f"},null,"f",{"$f":"VLOOKUP(B23,ALLdata!A:F,6,FALSE)","v":"Families are fully informed about data collection procedures (e.g., when surveys are available, how to return them)."},null,null,null,null,null,"Element Rating:",null,null,null,null,null,0,null,null,null,null,null,null,null,null,"Families are fully informed about data collection procedures (e.g., when surveys are available, how to return them).","Element Rating:"]
[null,null,null,null,"Evidence:",null,null,null,null,null,null,null,null,null,null,null,1,null,null,null,null,null,null,null,null,"Evidence:",0]
[null,{"$f":"LEFT(B23,6)&D25","v":"E-DC1-g"},null,"g",{"$f":"VLOOKUP(B25,ALLdata!A:F,6,FALSE)","v":"Data collection procedures have the capability to produce valid and reliable data."},null,null,null,null,null,"Element Rating:",null,null,null,null,null,0,null,null,null,null,null,null,null,null,"Data collection procedures have the capability to produce valid and reliable data.","Element Rating:"]
[null,null,null,null,"Evidence:",null,null,null,null,null,null,null,null,null,null,null,1,null,null,null,null,null,null,null,null,"Evidence:",0]
[null,{"$f":"LEFT(B25,6)&D27","v":"E-DC1-h"},null,"h",{"$f":"VLOOKUP(B27,ALLdata!A:F,6,FALSE)","v":"Processes are available to facilitate efficient and complete data collection."},null,null,null,null,null,"Element Rating:",null,null,null,null,null,0,null,null,null,null,null,null,null,null,"Processes are available to facilitate efficient and complete data collection.","Element Rating:"]
[null,null,null,null,"Evidence:",null,null,null,null,null,null,null,null,null,null,null,1,null,null,null,null,null,null,null,null,"Evidence:",0]
[null,{"$f":"LEFT(B27,6)&D29","v":"E-DC1-i"},null,"i",{"$f":"VLOOKUP(B29,ALLdata!A:F,6,FALSE)","v":"State has evidence that the data collection procedures are being implemented with high fidelity (e.g., state has local supervisors overseeing the data collection process or state has documentation that a vendor has mailed surveys to families)."},null,null,null,null,null,"Element Rating:",null,null,null,null,null,{"$f":"IF(E29=\"Evidence:\",1,0)","v":0},null,null,null,null,null,null,null,null,{"$f":"E29&F29","v":"State has evidence that the data collection procedures are being implemented with high fidelity (e.g., state has local supervisors overseeing the data collection process or state has documentation that a vendor has mailed surveys to families)."},{"$f":"K29","v":"Element Rating:"}]
[null,null,null,null,"Evidence:",null,null,null,null,null,null,null,null,null,null,null,1,null,null,null,null,null,null,null,null,"Evidence:",0]
[null,{"$f":"LEFT(B29,6)&D31","v":"E-DC1-j"},null,"j",{"$f":"VLOOKUP(B31,ALLdata!A:F,6,FALSE)","v":"Data collection procedures are institutionalized; implementation remains stable through staff changes or changes in a vendor."},null,null,null,null,null,"Element Rating:",null,null,null,null,null,0,null,null,null,null,null,null,null,null,"Data collection procedures are institutionalized; implementation remains stable through staff changes or changes in a vendor.","Element Rating:"]
[null,null,null,null,"Evidence:",null,null,null,null,null,null,null,null,null,null,null,1,null,null,null,null,null,null,null,null,"Evidence:",0]
[null,{"$f":"LEFT(B31,6)&D33","v":"E-DC1-k"},null,"k",{"$f":"VLOOKUP(B33,ALLdata!A:F,6,FALSE)","v":"Ongoing support and technical assistance for data collection issues are readily available; problems are addressed in a timely fashion. This includes support for families who are completing the survey and program staff who may be involved in the data collection."},null,null,null,null,null,"Element Rating:",null,null,null,null,null,0,null,null,null,null,null,null,null,null,"Ongoing support and technical assistance for data collection issues are readily available; problems are addressed in a timely fashion. This includes support for families who are completing the survey and program staff who may be involved in the data collection.","Element Rating:"]
[null,null,null,null,"Evidence:",null,null,null,null,null,null,null,null,null,null,null,1,null,null,null,null,null,null,null,null,"Evidence:",0]
[null,{"$f":"LEFT(B33,6)&D35","v":"E-DC1-l"},null,"l",{"$f":"VLOOKUP(B35,ALLdata!A:F,6,FALSE)","v":"If state is sampling, sampling procedures produce a representative sample of sufficient size. (Select “Not applicable” if not sampling.)"},null,null,null,null,null,"Element Rating:",null,null,null,null,null,0,null,null,null,null,null,null,null,null,"If state is sampling, sampling procedures produce a representative sample of sufficient size. (Select “Not applicable” if not sampling.)","Element Rating:"]
[null,null,null,null,"Evidence:",null,null,null,null,null,null,null,null,null,null,null,1,null,null,null,null,null,null,null,null,"Evidence:",0]
[null,{"$f":"LEFT(B35,6)&D37","v":"E-DC1-m"},null,"m",{"$f":"VLOOKUP(B37,ALLdata!A:F,6,FALSE)","v":"State has procedures to encourage all groups to participate in the data collection process (i.e., to ensure an adequate response rate)."},null,null,null,null,null,"Element Rating:",null,null,null,null,null,0,null,null,null,null,null,null,null,null,"State has procedures to encourage all groups to participate in the data collection process (i.e., to ensure an adequate response rate).","Element Rating:"]
[null,null,null,null,"Evidence:",null,null,null,null,null,null,null,null,null,null,null,1,null,null,null,null,null,null,null,null,"Evidence:",0]
[null,{"$f":"LEFT(B37,6)&D39","v":"E-DC1-n"},null,"n",{"$f":"VLOOKUP(B39,ALLdata!A:F,6,FALSE)","v":"Procedures make it possible for all families to participate in the data collection, including those with low literacy levels and non-English speakers."},null,null,null,null,null,"Element Rating:",null,null,null,null,null,0,null,null,null,null,null,null,null,null,"Procedures make it possible for all families to participate in the data collection, including those with low literacy levels and non-English speakers.","Element Rating:"]
[null,null,null,null,"Evidence:",null,null,null,null,null,null,null,null,null,null,null,1,null,null,null,null,null,null,null,null,"Evidence:",0]
[null,{"$f":"LEFT(B39,6)&D41","v":"E-DC1-o"},null,"o",{"$f":"VLOOKUP(B41,ALLdata!A:F,6,FALSE)","v":"If state is conducting multiple data collections with families (e.g., two different surveys), state has coordinated these data collections through an overall plan. (Select “Not applicable” if there are not multiple data collections with families.)"},null,null,null,null,null,"Element Rating:",null,null,null,null,null,{"$f":"IF(E41=\"Evidence:\",1,0)","v":0},null,null,null,null,null,null,null,null,{"$f":"E41&F41","v":"If state is conducting multiple data collections with families (e.g., two different surveys), state has coordinated these data collections through an overall plan. (Select “Not applicable” if there are not multiple data collections with families.)"},{"$f":"K41","v":"Element Rating:"}]
[null,null,null,null,"Evidence:",null,null,null,null,null,null,null,null,null,null,null,1,null,null,null,null,null,null,null,null,"Evidence:",0]
[null,{"$f":"LEFT(B41,6)&D43","v":"E-DC1-p"},null,"p",{"$f":"VLOOKUP(B43,ALLdata!A:F,6,FALSE)","v":"Program staff are fully informed about the nature and the purpose of the data collection, including service providers or others who regularly have contact with families."},null,null,null,null,null,"Element Rating:",null,null,null,null,null,0,null,null,null,null,null,null,null,null,"Program staff are fully informed about the nature and the purpose of the data collection, including service providers or others who regularly have contact with families.","Element Rating:"]
[null,null,null,null,"Evidence:",null,null,null,null,null,null,null,null,null,null,null,1,null,null,null,null,null,null,null,null,"Evidence:",0]
[null,null,null,null,null,null,null,null,null,null,null,null,null,null,null,null,0,null,null,null,null,null,null,null,null,"",0]
[null,"Q-DC2-0",null,"DC 2",{"$f":"VLOOKUP(B46,ALLdata!A:F,6,FALSE)","v":"State’s method for entering, transmitting, and storing data is effective and efficient."},null,null,null,null,null,"QI Rating: ",{"$f":"VLOOKUP(B46,ALLdata!A:H,8,FALSE)","v":0},null,null,null,null,0,null,null,null,null,null,null,null,null,"State’s method for entering, transmitting, and storing data is effective and efficient.","QI Rating: "]
[null,{"$f":"\"E-DC2-\"&D47","v":"E-DC2-a"},null,"a",{"$f":"VLOOKUP(B47,ALLdata!A:F,6,FALSE)","v":"Data on family experiences and outcomes are entered efficiently and accurately."},null,null,null,null,null,"Element Rating:",null,null,null,null,null,0,null,null,null,null,null,null,null,null,"Data on family experiences and outcomes are entered efficiently and accurately.","Element Rating:"]
[null,null,null,null,"Evidence:",null,null,null,null,null,null,null,null,null,null,null,1,null,null,null,null,null,null,null,null,"Evidence:",0]
[null,{"$f":"LEFT(B47,6)&D49","v":"E-DC2-b"},null,"b",{"$f":"VLOOKUP(B49,ALLdata!A:F,6,FALSE)","v":"Systematic checks on data entry are in place."},null,null,null,null,null,"Element Rating:",null,null,null,null,null,0,null,null,null,null,null,null,null,null,"Systematic checks on data entry are in place.","Element Rating:"]
[null,null,null,null,"Evidence:",null,null,null,null,null,null,null,null,null,null,null,1,null,null,null,null,null,null,null,null,"Evidence:",0]
[null,{"$f":"LEFT(B49,6)&D51","v":"E-DC2-c"},null,"c",{"$f":"VLOOKUP(B51,ALLdata!A:F,6,FALSE)","v":"Those entering and transmitting data have access to necessary hardware and software and know how to use them (e.g., scanning equipment is working properly)."},null,null,null,null,null,"Element Rating:",null,null,null,null,null,0,null,null,null,null,null,null,null,null,"Those entering and transmitting data have access to necessary hardware and software and know how to use them (e.g., scanning equipment is working properly).","Element Rating:"]
[null,null,null,null,"Evidence:",null,null,null,null,null,null,null,null,null,null,null,1,null,null,null,null,null,null,null,null,"Evidence:",0]
[null,{"$f":"LEFT(B51,6)&D53","v":"E-DC2-d"},null,"d",{"$f":"VLOOKUP(B53,ALLdata!A:F,6,FALSE)","v":"Technology support is effective."},null,null,null,null,null,"Element Rating:",null,null,null,null,null,0,null,null,null,null,null,null,null,null,"Technology support is effective.","Element Rating:"]
[null,null,null,null,"Evidence:",null,null,null,null,null,null,null,null,null,null,null,1,null,null,null,null,null,null,null,null,"Evidence:",0]
[null,{"$f":"LEFT(B53,6)&D55","v":"E-DC2-e"},null,"e",{"$f":"VLOOKUP(B55,ALLdata!A:F,6,FALSE)","v":"Procedures are in place to update the data system as needed and communicate changes to the users."},null,null,null,null,null,"Element Rating:",null,null,null,null,null,0,null,null,null,null,null,null,null,null,"Procedures are in place to update the data system as needed and communicate changes to the users.","Element Rating:"]
[null,null,null,null,"Evidence:",null,null,null,null,null,null,null,null,null,null,null,1,null,null,null,null,null,null,null,null,"Evidence:",0]
[null,{"$f":"LEFT(B55,6)&D57","v":"E-DC2-f"},null,"f",{"$f":"VLOOKUP(B57,ALLdata!A:F,6,FALSE)","v":"Those handling data understand and protect confidentiality."},null,null,null,null,null,"Element Rating:",null,null,null,null,null,{"$f":"IF(E57=\"Evidence:\",1,0)","v":0},null,null,null,null,null,null,null,null,{"$f":"E57&F57","v":"Those handling data understand and protect confidentiality."},{"$f":"K57","v":"Element Rating:"}]
[null,null,null,null,"Evidence:",null,null,null,null,null,null,null,null,null,null,null,1,null,null,null,null,null,null,null,null,"Evidence:",0]
[null,{"$f":"LEFT(B57,6)&D59","v":"E-DC2-g"},null,"g",{"$f":"VLOOKUP(B59,ALLdata!A:F,6,FALSE)","v":"Data system protects confidential information."},null,null,null,null,null,"Element Rating:",null,null,null,null,null,0,null,null,null,null,null,null,null,null,"Data system protects confidential information.","Element Rating:"]
[null,null,null,null,"Evidence:",null,null,null,null,null,null,null,null,null,null,null,1,null,null,null,null,null,null,null,null,"Evidence:",0]
[null,{"$f":"LEFT(B59,6)&D61","v":"E-DC2-h"},null,"h",{"$f":"VLOOKUP(B61,ALLdata!A:F,6,FALSE)","v":"Protocols for archiving data are in place."},null,null,null,null,null,"Element Rating:",null,null,null,null,null,0,null,null,null,null,null,null,null,null,"Protocols for archiving data are in place.","Element Rating:"]
[null,null,null,null,"Evidence:",null,null,null,null,null,null,null,null,null,null,null,1,null,null,null,null,null,null,null,null,"Evidence:",0]
[null,null,null,null,null,null,null,null,null,null,null,null,null,null,null,null,null,null,null,null,null,null,null,null,null,{"$f":"E63","v":0},{"$f":"K63","v":0}]
[null,null,null,null,null,null,null,null,null,null,null,null,null,null,null,null,null,null,null,null,null,null,null,null,null,null,0]

{"sheet":"Analysis","index":5,"n_rows":88,"n_cols":27,"rows_kept":88,"cut":false,"hidden":false,"merged":[[0,3,1,5],[76,4,76,8],[77,5,77,8],[78,4,78,8],[79,5,79,8],[80,4,80,8],[10,22,11,22],[67,22,68,23],[72,22,73,22],[72,23,73,23],[75,22,76,23],[10,23,11,23],[13,22,14,23],[30,22,31,22],[30,23,31,23],[34,22,35,23],[47,22,48,22],[47,23,48,23],[50,22,51,23],[63,22,64,22],[63,23,64,23],[32,4,32,8],[65,4,65,8],[30,18,30,21],[41,4,41,8],[42,5,42,8],[43,4,43,8],[44,5,44,8],[41,10,42,10],[41,11,42,11],[41,13,42,13],[33,10,34,10],[33,11,34,11],[33,13,34,13],[35,10,36,10],[35,11,36,11],[35,18,35,21],[36,18,36,21],[37,4,37,8],[38,5,38,8],[10,18,10,21],[12,17,13,17],[14,17,15,17],[16,17,17,17],[18,17,19,17],[20,17,21,17],[22,17,23,17],[24,17,25,17],[26,17,27,17],[14,18,14,21],[15,18,15,21],[20,4,20,8],[21,5,21,8],[22,4,22,8],[23,5,23,8],[24,4,24,8],[25,5,25,8],[18,4,18,8],[19,5,19,8],[10,10,10,11],[72,18,72,21],[74,17,75,17],[76,17,77,17],[78,17,79,17],[80,17,81,17],[82,17,83,17],[76,18,76,21],[77,18,77,21],[47,18,47,21],[49,17,50,17],[51,17,52,17],[53,17,54,17],[55,17,56,17],[51,18,51,21],[52,18,52,21],[63,18,63,21],[66,17,67,17],[68,17,69,17],[70,17,71,17],[68,18,68,21],[69,18,69,21],[57,17,58,17],[3,4,3,5],[4,4,4,5],[5,4,5,5],[6,4,6,5],[7,4,7,5],[2,3,2,5],[5,8,5,13],[6,8,6,13],[7,8,7,13],[4,7,4,13],[48,4,48,8],[18,13,19,13],[20,10,21,10],[20,11,21,11],[20,13,21,13],[22,10,23,10],[22,11,23,11],[22,13,23,13],[24,10,25,10],[24,11,25,11],[24,13,25,13],[18,10,19,10],[18,11,19,11],[43,13,44,13],[43,10,44,10],[43,11,44,11],[35,13,36,13],[37,10,38,10],[37,11,38,11],[37,13,38,13],[39,10,40,10],[39,11,40,11],[39,13,40,13],[31,4,31,8],[8,4,8,5],[9,4,9,5],[8,8,8,13],[64,4,64,8],[81,5,81,8],[82,4,82,8],[74,4,74,8],[66,4,66,8],[67,5,67,8],[68,4,68,8],[69,5,69,8],[70,4,70,8],[71,5,71,8],[73,4,73,8],[11,4,11,8],[12,4,12,8],[13,5,13,8],[14,4,14,8],[15,5,15,8],[16,4,16,8],[17,5,17,8],[49,4,49,8],[50,5,50,8],[12,10,13,10],[12,11,13,11],[12,13,13,13],[14,10,15,10],[14,11,15,11],[14,13,15,13],[16,10,17,10],[16,11,17,11],[16,13,17,13],[27,5,27,8],[26,4,26,8],[26,10,27,10],[26,11,27,11],[26,13,27,13],[84,13,85,13],[74,10,75,10],[74,11,75,11],[74,13,75,13],[66,10,67,10],[66,11,67,11],[66,13,67,13],[68,10,69,10],[68,11,69,11],[68,13,69,13],[70,10,71,10],[70,11,71,11],[70,13,71,13],[78,10,79,10],[78,11,79,11],[78,13,79,13],[82,10,83,10],[76,10,77,10],[84,10,85,10],[84,11,85,11],[49,13,50,13],[51,10,52,10],[51,11,52,11],[51,13,52,13],[53,13,54,13],[55,10,56,10],[55,11,56,11],[57,4,57,8],[57,10,58,10],[57,11,58,11],[57,13,58,13],[58,5,58,8],[55,13,56,13],[53,10,54,10],[53,11,54,11],[56,5,56,8],[51,4,51,8],[52,5,52,8],[53,4,53,8],[54,5,54,8],[49,10,50,10],[49,11,50,11],[55,4,55,8],[28,4,28,8],[28,10,29,10],[28,11,29,11],[28,13,29,13],[45,4,45,8],[45,10,46,10],[45,11,46,11],[45,13,46,13],[45,17,46,17],[46,5,46,8],[28,17,29,17],[29,5,29,8],[36,5,36,8],[33,17,34,17],[35,17,36,17],[37,17,38,17],[39,17,40,17],[41,17,42,17],[43,17,44,17],[33,4,33,8],[34,5,34,8],[35,4,35,8],[39,4,39,8],[40,5,40,8],[84,17,85,17],[85,5,85,8],[59,4,59,8],[59,10,60,10],[59,11,60,11],[59,13,60,13],[59,17,60,17],[60,5,60,8],[61,4,61,8],[61,10,62,10],[61,11,62,11],[61,13,62,13],[61,17,62,17],[62,5,62,8],[82,13,83,13],[82,11,83,11],[76,11,77,11],[76,13,77,13],[80,10,81,10],[80,11,81,11],[80,13,81,13],[84,4,84,8],[83,5,83,8],[75,5,75,8]]}
[null,null,null,"Analysis",null,null,null,null,null,null,null,null,null,null,null,null,null,null,null,null,null,null,null,null,null,{"$f":"E1&F1","v":""}]
[null,null,null,null,null,null,null,null,null,null,null,null,null,null,null,null,null,null,null,null,null,null,null,null,null,""]
[null,null,null,"Quality Indicator Rating (Calculated)",null,null,null,null,null,null,null,null,null,null,null,null,null,null,null,null,null,null,null,null,null,""]
[null,null,null,1,"None of the elements is yet planned or in place.  ",null,null,null,null,null,null,null,null,null,null,null,null,null,null,null,null,null,null,null,null,"None of the elements is yet planned or in place.  "]
[null,null,null,2,"Most of the elements are not yet planned or in place. ",null,null,"Element of Quality Rating (EQR)",null,null,null,null,null,null,null,null,null,null,null,null,null,null,null,null,null,"Most of the elements are not yet planned or in place. "]
[null,null,null,3,"Some elements are in place; a few may be fully implemented.",null,null,1,"No - element not in place and not planning to work on it at this time",null,null,null,null,null,null,null,null,null,null,null,null,null,null,null,null,"Some elements are in place; a few may be fully implemented."]
[null,null,null,4,"At least half of the elements are in place; a few may be fully implemented.",null,null,2,"No - element not in place but planning to work on it or getting started",null,null,null,null,null,null,null,null,null,null,null,null,null,null,null,null,"At least half of the elements are in place; a few may be fully implemented."]
[null,null,null,5,"At least half of the elements are in place; some are fully implemented.",null,null,3,"Yes - element partially implemented",null,null,null,null,null,null,null,null,null,null,null,null,null,null,null,null,"At least half of the elements are in place; some are fully implemented."]
[null,null,null,6,"At least half of the elements are fully implemented; the rest are partially implemented.",null,null,4,"Yes - element fully implemented",null,null,null,null,null,null,null,null,null,null,null,null,null,null,null,null,"At least half of the elements are fully implemented; the rest are partially implemented."]
[null,null,null,7,"All elements are fully implemented.",null,null,null,null,null,null,null,null,null,null,null,null,null,null,null,null,null,null,null,null,"All elements are fully implemented."]
[null,null,null,null,null,null,null,null,null,null,"Rating",null,null,"PRIORITY",null,null,null,null,null,null,null,null,null,null,null,""]
[null,"Q-AN1-0",null,"AN 1",{"$f":"VLOOKUP(B12,ALLdata!A:F,6,FALSE)","v":"State identifies accountability and program improvement questions related to family experiences and outcomes."},null,null,null,null,null,"QI Rating: ",{"$f":"VLOOKUP(B12,ALLdata!A:H,8,FALSE)","v":0},null,null,null,null,{"$f":"IF(E12=\"Evidence:\",1,0)","v":0},null,null,null,null,null,null,null,null,{"$f":"E12&F12","v":"State identifies accountability and program improvement questions related to family experiences and outcomes."},{"$f":"K12","v":"QI Rating: "}]
[null,{"$f":"\"E-AN1-\"&D13","v":"E-AN1-a"},null,"a",{"$f":"VLOOKUP(B13,ALLdata!A:F,6,FALSE)","v":"State has a written set of publicly available accountability and program improvement questions related to family experiences and outcomes."},null,null,null,null,null,"Element Rating:",null,null,null,null,null,0,null,null,null,null,null,null,null,null,"State has a written set of publicly available accountability and program improvement questions related to family experiences and outcomes.",{"$f":"K13","v":"Element Rating:"}]
[null,null,null,null,"Evidence:",null,null,null,null,null,null,null,null,null,null,null,1,null,null,null,null,null,null,null,null,"Evidence:",0]
[null,{"$f":"LEFT(B13,6)&D15","v":"E-AN1-b"},null,"b",{"$f":"VLOOKUP(B15,ALLdata!A:F,6,FALSE)","v":"The questions were developed with broad stakeholder input, including that of families."},null,null,null,null,null,"Element Rating:",null,null,null,null,null,0,null,null,null,null,null,null,null,null,"The questions were developed with broad stakeholder input, including that of families.","Element Rating:"]
[null,null,null,null,"Evidence:",null,null,null,null,null,null,null,null,null,null,null,1,null,null,null,null,null,null,null,null,"Evidence:",0]
[null,{"$f":"LEFT(B15,6)&D17","v":"E-AN1-c"},null,"c",{"$f":"VLOOKUP(B17,ALLdata!A:F,6,FALSE)","v":"The questions are consistent with the purposes of the state’s family experiences and outcomes measurement system."},null,null,null,null,null,"Element Rating:",null,null,null,null,null,0,null,null,null,null,null,null,null,null,"The questions are consistent with the purposes of the state’s family experiences and outcomes measurement system.","Element Rating:"]
[null,null,null,null,"Evidence:",null,null,null,null,null,null,null,null,null,null,null,1,null,null,null,null,null,null,null,null,"Evidence:",0]
[null,{"$f":"LEFT(B17,6)&D19","v":"E-AN1-d"},null,"d",{"$f":"VLOOKUP(B19,ALLdata!A:F,6,FALSE)","v":"The questions address family outcomes and family’s experiences with service delivery."},null,null,null,null,null,"Element Rating:",null,null,null,null,null,0,null,null,null,null,null,null,null,null,"The questions address family outcomes and family’s experiences with service delivery.","Element Rating:"]
[null,null,null,null,"Evidence:",null,null,null,null,null,null,null,null,null,null,null,1,null,null,null,null,null,null,null,null,"Evidence:",0]
[null,{"$f":"LEFT(B19,6)&D21","v":"E-AN1-e"},null,"e",{"$f":"VLOOKUP(B21,ALLdata!A:F,6,FALSE)","v":"The questions address how family experiences and outcomes relate to child, family, service, and system characteristics. These questions require the family survey be linked to a child identifier."},null,null,null,null,null,"Element Rating:",null,null,null,null,null,0,null,null,null,null,null,null,null,null,"The questions address how family experiences and outcomes relate to child, family, service, and system characteristics. These questions require the family survey be linked to a child identifier.","Element Rating:"]
[null,null,null,null,"Evidence:",null,null,null,null,null,null,null,null,null,null,null,1,null,null,null,null,null,null,null,null,"Evidence:",0]
[null,{"$f":"LEFT(B21,6)&D23","v":"E-AN1-f"},null,"f",{"$f":"VLOOKUP(B23,ALLdata!A:F,6,FALSE)","v":"Answers to the questions will provide useful information for accountability and program improvement."},null,null,null,null,null,"Element Rating:",null,null,null,null,null,0,null,null,null,null,null,null,null,null,"Answers to the questions will provide useful information for accountability and program improvement.","Element Rating:"]
[null,null,null,null,"Evidence:",null,null,null,null,null,null,null,null,null,null,null,1,null,null,null,null,null,null,null,null,"Evidence:",0]
[null,{"$f":"LEFT(B23,6)&D25","v":"E-AN1-g"},null,"g",{"$f":"VLOOKUP(B25,ALLdata!A:F,6,FALSE)","v":"A process is in place for regularly reviewing and revising the questions."},null,null,null,null,null,"Element Rating:",null,null,null,null,null,0,null,null,null,null,null,null,null,null,"A process is in place for regularly reviewing and revising the questions.","Element Rating:"]
[null,null,null,null,"Evidence:",null,null,null,null,null,null,null,null,null,null,null,1,null,null,null,null,null,null,null,null,"Evidence:",0]
[null,{"$f":"LEFT(B25,6)&D27","v":"E-AN1-h"},null,"h",{"$f":"VLOOKUP(B27,ALLdata!A:F,6,FALSE)","v":"State has policy or guidance that addresses local program responsibilities with regard to the development of accountability and program improvement questions."},null,null,null,null,null,"Element Rating:",null,null,null,null,null,0,null,null,null,null,null,null,null,null,"State has policy or guidance that addresses local program responsibilities with regard to the development of accountability and program improvement questions.","Element Rating:"]
[null,null,null,null,"Evidence:",null,null,null,null,null,null,null,null,null,null,null,1,null,null,null,null,null,null,null,null,"Evidence:",0]
[null,{"$f":"LEFT(B27,6)&D29","v":"E-AN1-i"},null,"i",{"$f":"VLOOKUP(B29,ALLdata!A:F,6,FALSE)","v":"State helps build the capacity of local programs to develop accountability and program improvement questions."},null,null,null,null,null,"Element Rating:",null,null,null,null,null,{"$f":"IF(E29=\"Evidence:\",1,0)","v":0},null,null,null,null,null,null,null,null,{"$f":"E29&F29","v":"State helps build the capacity of local programs to develop accountability and program improvement questions."},{"$f":"K29","v":"Element Rating:"}]
[null,null,null,null,"Evidence:",null,null,null,null,null,null,null,null,null,null,null,{"$f":"IF(E30=\"Evidence:\",1,0)","v":1},null,null,null,null,null,null,null,null,{"$f":"E30&F30","v":"Evidence:"},{"$f":"K30","v":0}]
[null,null,null,null,null,null,null,null,null,null,null,null,null,null,null,null,0,null,null,null,null,null,null,null,null,"",0]
[null,"Q-AN2-0",null,"AN 2",{"$f":"VLOOKUP(B32,ALLdata!A:F,6,FALSE)","v":"Local programs identify accountability and program improvement questions related to family experiences and outcomes."},null,null,null,null,null,"QI Rating: ",{"$f":"VLOOKUP(B32,ALLdata!A:H,8,FALSE)","v":0},null,null,null,null,0,null,null,null,null,null,null,null,null,"Local programs identify accountability and program improvement questions related to family experiences and outcomes.","QI Rating: "]
[null,null,null,null,"Does state have a process for systematically collecting information from local programs about how they are identifying accountability and program improvement questions related to family experiences and outcomes? ",null,null,null,null,null,"Yes",null,null,null,null,null,0,null,null,null,null,null,null,null,null,{"$f":"E33&F33","v":"Does state have a process for systematically collecting information from local programs about how they are identifying accountability and program improvement questions related to family experiences and outcomes? "},{"$f":"K33","v":"Yes"}]
[null,{"$f":"\"E-AN2-\"&D34","v":"E-AN2-a"},null,"a",{"$f":"VLOOKUP(B34,ALLdata!A:F,6,FALSE)","v":"Local programs have a written set of publicly available accountability and program improvement questions related to family experiences and outcomes."},null,null,null,null,null,"Element Rating:",null,null,null,null,null,0,null,null,null,null,null,null,null,null,"Local programs have a written set of publicly available accountability and program improvement questions related to family experiences and outcomes.","Element Rating:"]
[null,null,null,null,"Evidence:",null,null,null,null,null,null,null,null,null,null,null,1,null,null,null,null,null,null,null,null,"Evidence:",0]
[null,{"$f":"LEFT(B34,6)&D36","v":"E-AN2-b"},null,"b",{"$f":"VLOOKUP(B36,ALLdata!A:F,6,FALSE)","v":"The questions were developed with broad stakeholder input, including families."},null,null,null,null,null,"Element Rating:",null,null,null,null,null,0,null,null,null,null,null,null,null,null,"The questions were developed with broad stakeholder input, including families.","Element Rating:"]
[null,null,null,null,"Evidence:",null,null,null,null,null,null,null,null,null,null,null,1,null,null,null,null,null,null,null,null,"Evidence:",0]
[null,{"$f":"LEFT(B36,6)&D38","v":"E-AN2-c"},null,"c",{"$f":"VLOOKUP(B38,ALLdata!A:F,6,FALSE)","v":"The questions are aligned with the vision and purposes of the state’s outcomes measurement system."},null,null,null,null,null,"Element Rating:",null,null,null,null,null,0,null,null,null,null,null,null,null,null,"The questions are aligned with the vision and purposes of the state’s outcomes measurement system.","Element Rating:"]
[null,null,null,null,"Evidence:",null,null,null,null,null,null,null,null,null,null,null,1,null,null,null,null,null,null,null,null,"Evidence:",0]
[null,{"$f":"LEFT(B38,6)&D40","v":"E-AN2-d"},null,"d",{"$f":"VLOOKUP(B40,ALLdata!A:F,6,FALSE)","v":"The questions address family outcomes and family experiences with service delivery."},null,null,null,null,null,"Element Rating:",null,null,null,null,null,0,null,null,null,null,null,null,null,null,"The questions address family outcomes and family experiences with service delivery.","Element Rating:"]
[null,null,null,null,"Evidence:",null,null,null,null,null,null,null,null,null,null,null,1,null,null,null,null,null,null,null,null,"Evidence:",0]
[null,{"$f":"LEFT(B40,6)&D42","v":"E-AN2-e"},null,"e",{"$f":"VLOOKUP(B42,ALLdata!A:F,6,FALSE)","v":"The questions address how outcomes relate to child, family, and service characteristics. These questions require the family survey be linked to a child identifier."},null,null,null,null,null,"Element Rating:",null,null,null,null,null,0,null,null,null,null,null,null,null,null,"The questions address how outcomes relate to child, family, and service characteristics. These questions require the family survey be linked to a child identifier.","Element Rating:"]
[null,null,null,null,"Evidence:",null,null,null,null,null,null,null,null,null,null,null,1,null,null,null,null,null,null,null,null,"Evidence:",0]
[null,{"$f":"LEFT(B42,6)&D44","v":"E-AN2-f"},null,"f",{"$f":"VLOOKUP(B44,ALLdata!A:F,6,FALSE)","v":"Answers to the questions will provide useful information for accountability and program improvement."},null,null,null,null,null,"Element Rating:",null,null,null,null,null,0,null,null,null,null,null,null,null,null,"Answers to the questions will provide useful information for accountability and program improvement.","Element Rating:"]
[null,null,null,null,"Evidence:",null,null,null,null,null,null,null,null,null,null,null,1,null,null,null,null,null,null,null,null,"Evidence:",0]
[null,{"$f":"LEFT(B44,6)&D46","v":"E-AN2-g"},null,"g",{"$f":"VLOOKUP(B46,ALLdata!A:F,6,FALSE)","v":"A process is in place for regularly reviewing and revising the questions."},null,null,null,null,null,"Element Rating:",null,null,null,null,null,{"$f":"IF(E46=\"Evidence:\",1,0)","v":0},null,null,null,null,null,null,null,null,{"$f":"E46&F46","v":"A process is in place for regularly reviewing and revising the questions."},{"$f":"K46","v":"Element Rating:"}]
[null,null,null,null,"Evidence:",null,null,null,null,null,null,null,null,null,null,null,1,null,null,null,null,null,null,null,null,"Evidence:",0]
[null,{"$f":"IF(D48=\"\",A48&E48,\"\")","v":""},null,null,null,null,null,null,null,null,null,null,null,null,null,null,0,null,null,null,null,null,null,null,null,"",0]
[null,"Q-AN3-0",null,"AN 3",{"$f":"VLOOKUP(B49,ALLdata!A:F,6,FALSE)","v":"State agency analyzes data in a timely manner."},null,null,null,null,null,"QI Rating: ",{"$f":"VLOOKUP(B49,ALLdata!A:H,8,FALSE)","v":0},null,null,null,null,0,null,null,null,null,null,null,null,null,"State agency analyzes data in a timely manner.","QI Rating: "]
[null,{"$f":"\"E-AN3-\"&D50","v":"E-AN3-a"},null,"a",{"$f":"VLOOKUP(B50,ALLdata!A:F,6,FALSE)","v":"State has sufficient resources to conduct data analyses in a timely and accurate manner."},null,null,null,null,null,"Element Rating:",null,null,null,null,null,0,null,null,null,null,null,null,null,null,"State has sufficient resources to conduct data analyses in a timely and accurate manner.","Element Rating:"]
[null,null,null,null,"Evidence:",null,null,null,null,null,null,null,null,null,null,null,1,null,null,null,null,null,null,null,null,"Evidence:",0]
[null,{"$f":"LEFT(B50,6)&D52","v":"E-AN3-b"},null,"b",{"$f":"VLOOKUP(B52,ALLdata!A:F,6,FALSE)","v":"State can access all data elements necessary to address state level questions."},null,null,null,null,null,"Element Rating:",null,null,null,null,null,0,null,null,null,null,null,null,null,null,"State can access all data elements necessary to address state level questions.","Element Rating:"]
[null,null,null,null,"Evidence:",null,null,null,null,null,null,null,null,null,null,null,1,null,null,null,null,null,null,null,null,"Evidence:",0]
[null,{"$f":"LEFT(B52,6)&D54","v":"E-AN3-c"},null,"c",{"$f":"VLOOKUP(B54,ALLdata!A:F,6,FALSE)","v":"State conducts analyses to address accountability and program improvement questions at least annually."},null,null,null,null,null,"Element Rating:",null,null,null,null,null,0,null,null,null,null,null,null,null,null,"State conducts analyses to address accountability and program improvement questions at least annually.","Element Rating:"]
[null,null,null,null,"Evidence:",null,null,null,null,null,null,null,null,null,null,null,1,null,null,null,null,null,null,null,null,"Evidence:",0]
[null,{"$f":"LEFT(B54,6)&D56","v":"E-AN3-d"},null,"d",{"$f":"VLOOKUP(B56,ALLdata!A:F,6,FALSE)","v":"State conducts additional ad hoc analyses as needed."},null,null,null,null,null,"Element Rating:",null,null,null,null,null,0,null,null,null,null,null,null,null,null,"State conducts additional ad hoc analyses as needed.","Element Rating:"]
[null,null,null,null,"Evidence:",null,null,null,null,null,null,null,null,null,null,null,1,null,null,null,null,null,null,null,null,"Evidence:",0]
[null,{"$f":"LEFT(B56,6)&D58","v":"E-AN3-e"},null,"e",{"$f":"VLOOKUP(B58,ALLdata!A:F,6,FALSE)","v":"State thoroughly documents analyses so that a new analyst could repeat the analyses and find the same results."},null,null,null,null,null,"Element Rating:",null,null,null,null,null,{"$f":"IF(E58=\"Evidence:\",1,0)","v":0},null,null,null,null,null,null,null,null,{"$f":"E58&F58","v":"State thoroughly documents analyses so that a new analyst could repeat the analyses and find the same results."},{"$f":"K58","v":"Element Rating:"}]
[null,null,null,null,"Evidence:",null,null,null,null,null,null,null,null,null,null,null,1,null,null,null,null,null,null,null,null,"Evidence:",0]
[null,{"$f":"LEFT(B58,6)&D60","v":"E-AN3-f"},null,"f",{"$f":"VLOOKUP(B60,ALLdata!A:F,6,FALSE)","v":"State provides support to local programs to build capacity to analyze local data. Support can include the state agency providing analyzed data to the local program."},null,null,null,null,null,"Element Rating:",null,null,null,null,null,0,null,null,null,null,null,null,null,null,"State provides support to local programs to build capacity to analyze local data. Support can include the state agency providing analyzed data to the local program.","Element Rating:"]
[null,null,null,null,"Evidence:",null,null,null,null,null,null,null,null,null,null,null,1,null,null,null,null,null,null,null,null,"Evidence:",0]
[null,{"$f":"LEFT(B60,6)&D62","v":"E-AN3-g"},null,"g",{"$f":"VLOOKUP(B62,ALLdata!A:F,6,FALSE)","v":"State has policy or guidance that addresses local program responsibilities with regard to data analysis."},null,null,null,null,null,"Element Rating:",null,null,null,null,null,0,null,null,null,null,null,null,null,null,"State has policy or guidance that addresses local program responsibilities with regard to data analysis.","Element Rating:"]
[null,null,null,null,"Evidence:",null,null,null,null,null,null,null,null,null,null,null,1,null,null,null,null,null,null,null,null,"Evidence:",0]
[null,"",null,null,null,null,null,null,null,null,null,null,null,null,null,null,0,null,null,null,null,null,null,null,null,"",0]
[null,"Q-AN4-0",null,"AN 4",{"$f":"VLOOKUP(B65,ALLdata!A:F,6,FALSE)","v":"Local programs analyze data in a timely manner."},null,null,null,null,null,"QI Rating: ",{"$f":"VLOOKUP(B65,ALLdata!A:H,8,FALSE)","v":0},null,null,null,null,0,null,null,null,null,null,null,null,null,"Local programs analyze data in a timely manner.","QI Rating: "]
[null,null,null,null,"Does the state have a process for collecting information from local programs about whether local programs are analyzing information related to family experiences and outcomes?",null,null,null,null,null,"Yes",null,null,null,null,null,0,null,null,null,null,null,null,null,null,"Does the state have a process for collecting information from local programs about whether local programs are analyzing information related to family experiences and outcomes?","Yes"]
[null,{"$f":"\"E-AN4-\"&D67","v":"E-AN4-a"},null,"a",{"$f":"VLOOKUP(B67,ALLdata!A:F,6,FALSE)","v":"With appropriate safeguards (i.e., de-identified family experiences or outcomes data), local programs have access to the data elements necessary to address local accountability and program improvement questions."},null,null,null,null,null,"Element Rating:",null,null,null,null,null,0,null,null,null,null,null,null,null,null,"With appropriate safeguards (i.e., de-identified family experiences or outcomes data), local programs have access to the data elements necessary to address local accountability and program improvement questions.","Element Rating:"]
[null,null,null,null,"Evidence:",null,null,null,null,null,null,null,null,null,null,null,1,null,null,null,null,null,null,null,null,"Evidence:",0]
[null,{"$f":"LEFT(B67,6)&D69","v":"E-AN4-b"},null,"b",{"$f":"VLOOKUP(B69,ALLdata!A:F,6,FALSE)","v":"Local programs conduct analyses or work with another entity to conduct analyses in a timely and accurate manner.  "},null,null,null,null,null,"Element Rating:",null,null,null,null,null,0,null,null,null,null,null,null,null,null,"Local programs conduct analyses or work with another entity to conduct analyses in a timely and accurate manner.  ","Element Rating:"]
[null,null,null,null,"Evidence:",null,null,null,null,null,null,null,null,null,null,null,1,null,null,null,null,null,null,null,null,"Evidence:",0]
[null,{"$f":"LEFT(B69,6)&D71","v":"E-AN4-c"},null,"c",{"$f":"VLOOKUP(B71,ALLdata!A:F,6,FALSE)","v":"Local programs thoroughly document the analyses so that a new analyst could repeat the analyses and find the same results."},null,null,null,null,null,"Element Rating:",null,null,null,null,null,0,null,null,null,null,null,null,null,null,"Local programs thoroughly document the analyses so that a new analyst could repeat the analyses and find the same results.","Element Rating:"]
[null,null,null,null,"Evidence:",null,null,null,null,null,null,null,null,null,null,null,1,null,null,null,null,null,null,null,null,"Evidence:",0]
[null,null,null,null,null,null,null,null,null,null,null,null,null,null,null,null,0,null,null,null,null,null,null,null,null,"",0]
[null,"Q-AN5-0",null,"AN 5",{"$f":"VLOOKUP(B74,ALLdata!A:F,6,FALSE)","v":"State agency ensures completeness and accuracy of data."},null,null,null,null,null,"QI Rating: ",{"$f":"VLOOKUP(B74,ALLdata!A:H,8,FALSE)","v":0},null,null,null,null,0,null,null,null,null,null,null,null,null,"State agency ensures completeness and accuracy of data.","QI Rating: "]
[null,{"$f":"\"E-AN5-\"&D75","v":"E-AN5-a"},null,"a",{"$f":"VLOOKUP(B75,ALLdata!A:F,6,FALSE)","v":"State implements a process for checking the completeness and accuracy of the data."},null,null,null,null,null,"Element Rating:",null,null,null,null,null,0,null,null,null,null,null,null,null,null,"State implements a process for checking the completeness and accuracy of the data.","Element Rating:"]
[null,null,null,null,"Evidence:",null,null,null,null,null,null,null,null,null,null,null,1,null,null,null,null,null,null,null,null,"Evidence:",0]
[null,{"$f":"LEFT(B75,6)&D77","v":"E-AN5-b"},null,"b",{"$f":"VLOOKUP(B77,ALLdata!A:F,6,FALSE)","v":"The results of the process provide evidence that the data are high quality for the intended purposes."},null,null,null,null,null,"Element Rating:",null,null,null,null,null,0,null,null,null,null,null,null,null,null,"The results of the process provide evidence that the data are high quality for the intended purposes.","Element Rating:"]
[null,null,null,null,"Evidence:",null,null,null,null,null,null,null,null,null,null,null,1,null,null,null,null,null,null,null,null,"Evidence:",0]
[null,{"$f":"LEFT(B77,6)&D79","v":"E-AN5-c"},null,"c",{"$f":"VLOOKUP(B79,ALLdata!A:F,6,FALSE)","v":"State regularly tracks missing and incomplete data and has implemented a plan for reducing missing and incomplete data."},null,null,null,null,null,"Element Rating:",null,null,null,null,null,0,null,null,null,null,null,null,null,null,"State regularly tracks missing and incomplete data and has implemented a plan for reducing missing and incomplete data.","Element Rating:"]
[null,null,null,null,"Evidence:",null,null,null,null,null,null,null,null,null,null,null,1,null,null,null,null,null,null,null,null,"Evidence:",0]
[null,{"$f":"LEFT(B79,6)&D81","v":"E-AN5-d"},null,"d",{"$f":"VLOOKUP(B81,ALLdata!A:F,6,FALSE)","v":"The state’s survey response rate is sufficient to provide valid generalization to the target population."},null,null,null,null,null,"Element Rating:",null,null,null,null,null,0,null,null,null,null,null,null,null,null,"The state’s survey response rate is sufficient to provide valid generalization to the target population.","Element Rating:"]
[null,null,null,null,"Evidence:",null,null,null,null,null,null,null,null,null,null,null,1,null,null,null,null,null,null,null,null,"Evidence:",0]
[null,{"$f":"LEFT(B81,6)&D83","v":"E-AN5-e"},null,"e",{"$f":"VLOOKUP(B83,ALLdata!A:F,6,FALSE)","v":"The data are representative at the state level."},null,null,null,null,null,"Element Rating:",null,null,null,null,null,0,null,null,null,null,null,null,null,null,"The data are representative at the state level.","Element Rating:"]
[null,null,null,null,"Evidence:",null,null,null,null,null,null,null,null,null,null,null,{"$f":"IF(E84=\"Evidence:\",1,0)","v":1},null,null,null,null,null,null,null,null,{"$f":"E84&F84","v":"Evidence:"},0]
[null,{"$f":"LEFT(B83,6)&D85","v":"E-AN5-f"},null,"f",{"$f":"VLOOKUP(B85,ALLdata!A:F,6,FALSE)","v":"The data are representative at the local program-level."},null,null,null,null,null,"Element Rating:",null,null,null,null,null,{"$f":"IF(E85=\"Evidence:\",1,0)","v":0},null,null,null,null,null,null,null,null,{"$f":"E85&F85","v":"The data are representative at the local program-level."},{"$f":"K85","v":"Element Rating:"}]
[null,null,null,null,"Evidence:",null,null,null,null,null,null,null,null,null,null,null,{"$f":"IF(E86=\"Evidence:\",1,0)","v":1},null,null,null,null,null,null,null,null,{"$f":"E86&F86","v":"Evidence:"},{"$f":"K86","v":0}]
[null,null,null,null,null,null,null,null,null,null,null,null,null,null,null,null,null,null,null,null,null,null,null,null,null,{"$f":"E87","v":0},{"$f":"K87","v":0}]
[null,null,null,null,null,null,null,null,null,null,null,null,null,null,null,null,null,null,null,null,null,null,null,null,null,{"$f":"E88","v":0},{"$f":"K88","v":0}]

{"sheet":"Reporting","index":6,"n_rows":45,"n_cols":27,"rows_kept":45,"cut":false,"hidden":false,"merged":[[0,3,1,5],[10,22,11,22],[10,23,11,23],[13,22,14,23],[28,22,29,22],[28,23,29,23],[32,22,33,23],[42,5,42,8],[29,4,29,8],[31,4,31,8],[32,5,32,8],[33,4,33,8],[34,5,34,8],[35,4,35,8],[36,5,36,8],[37,4,37,8],[38,5,38,8],[39,4,39,8],[40,5,40,8],[41,4,41,8],[16,4,16,8],[17,5,17,8],[18,4,18,8],[24,4,24,8],[12,11,13,11],[12,13,13,13],[14,10,15,10],[14,11,15,11],[14,13,15,13],[16,10,17,10],[16,11,17,11],[16,13,17,13],[18,13,19,13],[18,10,19,10],[18,11,19,11],[41,17,42,17],[23,5,23,8],[20,10,21,10],[20,11,21,11],[22,10,23,10],[22,11,23,11],[24,10,25,10],[24,11,25,11],[25,5,25,8],[31,10,32,10],[31,11,32,11],[31,13,32,13],[33,10,34,10],[33,11,34,11],[20,13,21,13],[22,13,23,13],[24,13,25,13],[33,13,34,13],[41,13,42,13],[41,10,42,10],[41,11,42,11],[35,11,36,11],[35,13,36,13],[37,10,38,10],[33,18,33,21],[34,18,34,21],[10,18,10,21],[12,17,13,17],[14,17,15,17],[16,17,17,17],[18,17,19,17],[20,17,21,17],[22,17,23,17],[24,17,25,17],[14,18,14,21],[15,18,15,21],[28,18,28,21],[31,17,32,17],[33,17,34,17],[39,11,40,11],[39,13,40,13],[35,10,36,10],[26,4,26,8],[26,10,27,10],[26,11,27,11],[26,13,27,13],[26,17,27,17],[27,5,27,8],[35,17,36,17],[37,17,38,17],[39,17,40,17],[37,11,38,11],[37,13,38,13],[39,10,40,10],[30,4,30,8],[10,10,10,11],[19,5,19,8],[20,4,20,8],[21,5,21,8],[22,4,22,8],[2,3,2,5],[3,4,3,5],[4,4,4,5],[5,4,5,5],[6,4,6,5],[7,4,7,5],[8,4,8,5],[9,4,9,5],[5,8,5,13],[6,8,6,13],[7,8,7,13],[8,8,8,13],[4,7,4,13],[11,4,11,8],[12,4,12,8],[13,5,13,8],[14,4,14,8],[15,5,15,8],[12,10,13,10]]}
[null,null,null,"Reporting"]
[]
[null,null,null,"Quality Indicator Rating (Calculated)"]
[null,null,null,1,"None of the elements is yet planned or in place.  "]
[null,null,null,2,"Most of the elements are not yet planned or in place. ",null,null,"Element of Quality Rating (EQR)"]
[null,null,null,3,"Some elements are in place; a few may be fully implemented.",null,null,1,"No - element not in place and not planning to work on it at this time"]
[null,null,null,4,"At least half of the elements are in place; a few may be fully implemented.",null,null,2,"No - element not in place but planning to work on it or getting started"]
[null,null,null,5,"At least half of the elements are in place; some are fully implemented.",null,null,3,"Yes - element partially implemented"]
[null,null,null,6,"At least half of the elements are fully implemented; the rest are partially implemented.",null,null,4,"Yes - element fully implemented"]
[null,null,null,7,"All elements are fully implemented."]
[null,null,null,null,null,null,null,null,null,null,"Rating",null,null,"PRIORITY",null,null,null,null,null,null,null,null,null,null,null,{"$f":"E11&F11","v":""}]
[null,"Q-RP1-0",null,"RP 1",{"$f":"VLOOKUP(B12,ALLdata!A:F,6,FALSE)","v":"State agency interprets, reports, and communicates information related to family experiences and outcomes."},null,null,null,null,null,"QI Rating: ",{"$f":"VLOOKUP(B12,ALLdata!A:H,8,FALSE)","v":0},null,null,null,null,{"$f":"IF(E12=\"Evidence:\",1,0)","v":0},null,null,null,null,null,null,null,null,{"$f":"E12&F12","v":"State agency interprets, reports, and communicates information related to family experiences and outcomes."},{"$f":"K12","v":"QI Rating: "}]
[null,{"$f":"\"E-RP1-\"&D13","v":"E-RP1-a"},null,"a",{"$f":"VLOOKUP(B13,ALLdata!A:F,6,FALSE)","v":"State has developed a comprehensive plan for interpreting, reporting, and communicating evidence related to family experiences and outcomes to relevant audiences, including families."},null,null,null,null,null,"Element Rating:",null,null,null,null,null,0,null,null,null,null,null,null,null,null,"State has developed a comprehensive plan for interpreting, reporting, and communicating evidence related to family experiences and outcomes to relevant audiences, including families.",{"$f":"K13","v":"Element Rating:"}]
[null,null,null,null,"Evidence:",null,null,null,null,null,null,null,null,null,null,null,1,null,null,null,null,null,null,null,null,"Evidence:",0]
[null,{"$f":"LEFT(B13,6)&D15","v":"E-RP1-b"},null,"b",{"$f":"VLOOKUP(B15,ALLdata!A:F,6,FALSE)","v":"State has procedures in place to address confidentiality issues raised by analyses that produce cells with small numbers."},null,null,null,null,null,"Element Rating:",null,null,null,null,null,0,null,null,null,null,null,null,null,null,"State has procedures in place to address confidentiality issues raised by analyses that produce cells with small numbers.","Element Rating:"]
[null,null,null,null,"Evidence:",null,null,null,null,null,null,null,null,null,null,null,1,null,null,null,null,null,null,null,null,"Evidence:",0]
[null,{"$f":"LEFT(B15,6)&D17","v":"E-RP1-c"},null,"c",{"$f":"VLOOKUP(B17,ALLdata!A:F,6,FALSE)","v":"State agency conducts systematic and comprehensive review of analyses including consideration of possible interpretations about family experiences and outcomes and the relationships between these and child, family, service, and system characteristics."},null,null,null,null,null,"Element Rating:",null,null,null,null,null,0,null,null,null,null,null,null,null,null,"State agency conducts systematic and comprehensive review of analyses including consideration of possible interpretations about family experiences and outcomes and the relationships between these and child, family, service, and system characteristics.","Element Rating:"]
[null,null,null,null,"Evidence:",null,null,null,null,null,null,null,null,null,null,null,1,null,null,null,null,null,null,null,null,"Evidence:",0]
[null,{"$f":"LEFT(B17,6)&D19","v":"E-RP1-d"},null,"d",{"$f":"VLOOKUP(B19,ALLdata!A:F,6,FALSE)","v":"Representative stakeholders are included in the process of review and interpretation. Interpretation reflects stakeholder input."},null,null,null,null,null,"Element Rating:",null,null,null,null,null,0,null,null,null,null,null,null,null,null,"Representative stakeholders are included in the process of review and interpretation. Interpretation reflects stakeholder input.","Element Rating:"]
[null,null,null,null,"Evidence:",null,null,null,null,null,null,null,null,null,null,null,1,null,null,null,null,null,null,null,null,"Evidence:",0]
[null,{"$f":"LEFT(B19,6)&D21","v":"E-RP1-e"},null,"e",{"$f":"VLOOKUP(B21,ALLdata!A:F,6,FALSE)","v":"State agency leadership is knowledgeable about family experiences and outcomes and can explain the results to relevant audiences."},null,null,null,null,null,"Element Rating:",null,null,null,null,null,0,null,null,null,null,null,null,null,null,"State agency leadership is knowledgeable about family experiences and outcomes and can explain the results to relevant audiences.","Element Rating:"]
[null,null,null,null,"Evidence:",null,null,null,null,null,null,null,null,null,null,null,1,null,null,null,null,null,null,null,null,"Evidence:",0]
[null,{"$f":"LEFT(B21,6)&D23","v":"E-RP1-f"},null,"f",{"$f":"VLOOKUP(B23,ALLdata!A:F,6,FALSE)","v":"State communicates results to target audiences for intended purposes in appropriate formats."},null,null,null,null,null,"Element Rating:",null,null,null,null,null,0,null,null,null,null,null,null,null,null,"State communicates results to target audiences for intended purposes in appropriate formats.","Element Rating:"]
[null,null,null,null,"Evidence:",null,null,null,null,null,null,null,null,null,null,null,1,null,null,null,null,null,null,null,null,"Evidence:",0]
[null,{"$f":"LEFT(B23,6)&D25","v":"E-RP1-g"},null,"g",{"$f":"VLOOKUP(B25,ALLdata!A:F,6,FALSE)","v":"State provides support to local programs related to interpreting and reporting family experiences and outcomes data."},null,null,null,null,null,"Element Rating:",null,null,null,null,null,0,null,null,null,null,null,null,null,null,"State provides support to local programs related to interpreting and reporting family experiences and outcomes data.","Element Rating:"]
[null,null,null,null,"Evidence:",null,null,null,null,null,null,null,null,null,null,null,1,null,null,null,null,null,null,null,null,"Evidence:",0]
[null,{"$f":"LEFT(B25,6)&D27","v":"E-RP1-h"},null,"h",{"$f":"VLOOKUP(B27,ALLdata!A:F,6,FALSE)","v":"State has policy or guidance that addresses local program responsibilities with regard to interpreting and sharing family experiences and outcomes data."},null,null,null,null,null,"Element Rating:",null,null,null,null,null,{"$f":"IF(E27=\"Evidence:\",1,0)","v":0},null,null,null,null,null,null,null,null,{"$f":"E27&F27","v":"State has policy or guidance that addresses local program responsibilities with regard to interpreting and sharing family experiences and outcomes data."},{"$f":"K27","v":"Element Rating:"}]
[null,null,null,null,"Evidence:",null,null,null,null,null,null,null,null,null,null,null,{"$f":"IF(E28=\"Evidence:\",1,0)","v":1},null,null,null,null,null,null,null,null,{"$f":"E28&F28","v":"Evidence:"},{"$f":"K28","v":0}]
[null,{"$f":"IF(D29=\"\",A29&E29,\"\")","v":""},null,null,null,null,null,null,null,null,null,null,null,null,null,null,0,null,null,null,null,null,null,null,null,"",0]
[null,"Q-RP2-0",null,"RP 2",{"$f":"VLOOKUP(B30,ALLdata!A:F,6,FALSE)","v":"Local programs interpret, report, and communicate information related to family experiences and outcomes."},null,null,null,null,null,"QI Rating: ",{"$f":"VLOOKUP(B30,ALLdata!A:H,8,FALSE)","v":0},null,null,null,null,0,null,null,null,null,null,null,null,null,"Local programs interpret, report, and communicate information related to family experiences and outcomes.","QI Rating: "]
[null,null,null,null,"Does the state have a process for systematically collecting information from local programs about interpreting, reporting, and communicating information related to family experiences and outcomes?",null,null,null,null,null,"Yes",null,null,null,null,null,0,null,null,null,null,null,null,null,null,"Does the state have a process for systematically collecting information from local programs about interpreting, reporting, and communicating information related to family experiences and outcomes?","Yes"]
[null,{"$f":"\"E-RP2-\"&D32","v":"E-RP2-a"},null,"a",{"$f":"VLOOKUP(B32,ALLdata!A:F,6,FALSE)","v":"Local programs interpret, report, and communicate information related to family experiences and outcomes in a manner appropriate to the size of the program."},null,null,null,null,null,"Element Rating:",null,null,null,null,null,0,null,null,null,null,null,null,null,null,"Local programs interpret, report, and communicate information related to family experiences and outcomes in a manner appropriate to the size of the program.","Element Rating:"]
[null,null,null,null,"Evidence:",null,null,null,null,null,null,null,null,null,null,null,1,null,null,null,null,null,null,null,null,"Evidence:",0]
[null,{"$f":"LEFT(B32,6)&D34","v":"E-RP2-b"},null,"b",{"$f":"VLOOKUP(B34,ALLdata!A:F,6,FALSE)","v":"Local programs have procedures in place to address confidentiality issues raised by analyses that produce cells with small numbers."},null,null,null,null,null,"Element Rating:",null,null,null,null,null,0,null,null,null,null,null,null,null,null,"Local programs have procedures in place to address confidentiality issues raised by analyses that produce cells with small numbers.","Element Rating:"]
[null,null,null,null,"Evidence:",null,null,null,null,null,null,null,null,null,null,null,1,null,null,null,null,null,null,null,null,"Evidence:",0]
[null,{"$f":"LEFT(B34,6)&D36","v":"E-RP2-c"},null,"c",{"$f":"VLOOKUP(B36,ALLdata!A:F,6,FALSE)","v":"Local programs conduct a systematic and comprehensive review of analyses including consideration of possible interpretations about family experiences and outcomes and the relationships between these and child, family, service, and system characteristics per the program’s questions."},null,null,null,null,null,"Element Rating:",null,null,null,null,null,0,null,null,null,null,null,null,null,null,"Local programs conduct a systematic and comprehensive review of analyses including consideration of possible interpretations about family experiences and outcomes and the relationships between these and child, family, service, and system characteristics per the program’s questions.","Element Rating:"]
[null,null,null,null,"Evidence:",null,null,null,null,null,null,null,null,null,null,null,1,null,null,null,null,null,null,null,null,"Evidence:",0]
[null,{"$f":"LEFT(B36,6)&D38","v":"E-RP2-d"},null,"d",{"$f":"VLOOKUP(B38,ALLdata!A:F,6,FALSE)","v":"Local programs include representative stakeholders in the process of developing interpretations of the data. Interpretations reflect stakeholder input."},null,null,null,null,null,"Element Rating:",null,null,null,null,null,0,null,null,null,null,null,null,null,null,"Local programs include representative stakeholders in the process of developing interpretations of the data. Interpretations reflect stakeholder input.","Element Rating:"]
[null,null,null,null,"Evidence:",null,null,null,null,null,null,null,null,null,null,null,1,null,null,null,null,null,null,null,null,"Evidence:",0]
[null,{"$f":"LEFT(B38,6)&D40","v":"E-RP2-e"},null,"e",{"$f":"VLOOKUP(B40,ALLdata!A:F,6,FALSE)","v":"Local program staff are knowledgeable about family experiences and outcomes and can explain family experiences and outcomes results to relevant audiences."},null,null,null,null,null,"Element Rating:",null,null,null,null,null,0,null,null,null,null,null,null,null,null,"Local program staff are knowledgeable about family experiences and outcomes and can explain family experiences and outcomes results to relevant audiences.","Element Rating:"]
[null,null,null,null,"Evidence:",null,null,null,null,null,null,null,null,null,null,null,1,null,null,null,null,null,null,null,null,"Evidence:",0]
[null,{"$f":"LEFT(B40,6)&D42","v":"E-RP2-f"},null,"f",{"$f":"VLOOKUP(B42,ALLdata!A:F,6,FALSE)","v":"Local programs communicate results to target audiences for intended purposes in appropriate formats."},null,null,null,null,null,"Element Rating:",null,null,null,null,null,0,null,null,null,null,null,null,null,null,"Local programs communicate results to target audiences for intended purposes in appropriate formats.","Element Rating:"]
[null,null,null,null,"Evidence:",null,null,null,null,null,null,null,null,null,null,null,1,null,null,null,null,null,null,null,null,"Evidence:",0]
[null,null,null,null,null,null,null,null,null,null,null,null,null,null,null,null,null,null,null,null,null,null,null,null,null,{"$f":"E44&F44","v":""},{"$f":"K44","v":0}]
[null,null,null,null,null,null,null,null,null,null,null,null,null,null,null,null,null,null,null,null,null,null,null,null,null,{"$f":"E45","v":0},{"$f":"K45","v":0}]

{"sheet":"UsingData","index":7,"n_rows":37,"n_cols":27,"rows_kept":37,"cut":false,"hidden":false,"merged":[[0,3,1,5],[33,4,33,8],[34,5,34,8],[0,23,8,23],[10,22,11,22],[10,23,11,23],[13,22,14,23],[26,22,27,22],[26,23,27,23],[30,22,31,23],[27,4,27,8],[29,4,29,8],[30,5,30,8],[31,4,31,8],[32,5,32,8],[21,5,21,8],[22,4,22,8],[23,5,23,8],[24,4,24,8],[25,5,25,8],[26,18,26,21],[22,10,23,10],[22,11,23,11],[29,17,30,17],[28,4,28,8],[31,17,32,17],[33,17,34,17],[31,18,31,21],[32,18,32,21],[20,17,21,17],[22,17,23,17],[24,17,25,17],[14,18,14,21],[15,18,15,21],[10,18,10,21],[12,17,13,17],[14,17,15,17],[16,17,17,17],[18,17,19,17],[17,5,17,8],[18,4,18,8],[19,5,19,8],[20,4,20,8],[14,10,15,10],[20,10,21,10],[14,4,14,8],[15,5,15,8],[16,4,16,8],[14,11,15,11],[14,13,15,13],[5,8,5,13],[6,8,6,13],[11,4,11,8],[12,4,12,8],[13,5,13,8],[7,4,7,5],[12,10,13,10],[12,11,13,11],[10,10,10,11],[12,13,13,13],[7,8,7,13],[8,8,8,13],[8,4,8,5],[9,4,9,5],[2,3,2,5],[3,4,3,5],[4,4,4,5],[5,4,5,5],[6,4,6,5],[20,11,21,11],[20,13,21,13],[16,10,17,10],[16,11,17,11],[18,10,19,10],[18,11,19,11],[4,7,4,13],[31,13,32,13],[33,10,34,10],[33,11,34,11],[33,13,34,13],[29,10,30,10],[29,11,30,11],[29,13,30,13],[31,10,32,10],[31,11,32,11],[22,13,23,13],[24,10,25,10],[24,11,25,11],[24,13,25,13],[16,13,17,13],[18,13,19,13]]}
[null,null,null,"Using Data"]
[]
[null,null,null,"Quality Indicator Rating (Calculated)"]
[null,null,null,1,"None of the elements is yet planned or in place.  "]
[null,null,null,2,"Most of the elements are not yet planned or in place. ",null,null,"Element of Quality Rating (EQR)"]
[null,null,null,3,"Some elements are in place; a few may be fully implemented.",null,null,1,"No - element not in place and not planning to work on it at this time"]
[null,null,null,4,"At least half of the elements are in place; a few may be fully implemented.",null,null,2,"No - element not in place but planning to work on it or getting started"]
[null,null,null,5,"At least half of the elements are in place; some are fully implemented.",null,null,3,"Yes - element partially implemented"]
[null,null,null,6,"At least half of the elements are fully implemented; the rest are partially implemented.",null,null,4,"Yes - element fully implemented"]
[null,null,null,7,"All elements are fully implemented."]
[null,null,null,null,null,null,null,null,null,null,"Rating",null,null,"PRIORITY",null,null,null,null,null,null,null,null,null,null,null,{"$f":"E11&F11","v":""}]
[null,"Q-UD1-0",null,"UD 1",{"$f":"VLOOKUP(B12,ALLdata!A:F,6,FALSE)","v":"State agency makes regular use of information on family experiences and outcomes to improve programs."},null,null,null,null,null,"QI Rating: ",{"$f":"VLOOKUP(B12,ALLdata!A:H,8,FALSE)","v":0},null,null,null,null,{"$f":"IF(E12=\"Evidence:\",1,0)","v":0},null,null,null,null,null,null,null,null,{"$f":"E12&F12","v":"State agency makes regular use of information on family experiences and outcomes to improve programs."},{"$f":"K12","v":"QI Rating: "}]
[null,{"$f":"\"E-UD1-\"&D13","v":"E-UD1-a"},null,"a",{"$f":"VLOOKUP(B13,ALLdata!A:F,6,FALSE)","v":"State regularly implements a stakeholder process that includes families to consider the implications of family experiences and outcomes and other data."},null,null,null,null,null,"Element Rating:",null,null,null,null,null,0,null,null,null,null,null,null,null,null,"State regularly implements a stakeholder process that includes families to consider the implications of family experiences and outcomes and other data.",{"$f":"K13","v":"Element Rating:"}]
[null,null,null,null,"Evidence:",null,null,null,null,null,null,null,null,null,null,null,1,null,null,null,null,null,null,null,null,"Evidence:",0]
[null,{"$f":"LEFT(B13,6)&D15","v":"E-UD1-b"},null,"b",{"$f":"VLOOKUP(B15,ALLdata!A:F,6,FALSE)","v":"As appropriate, state identifies some local programs for targeted support and then works with these programs to jointly develop action plans."},null,null,null,null,null,"Element Rating:",null,null,null,null,null,0,null,null,null,null,null,null,null,null,"As appropriate, state identifies some local programs for targeted support and then works with these programs to jointly develop action plans.","Element Rating:"]
[null,null,null,null,"Evidence:",null,null,null,null,null,null,null,null,null,null,null,1,null,null,null,null,null,null,null,null,"Evidence:",0]
[null,{"$f":"LEFT(B15,6)&D17","v":"E-UD1-c"},null,"c",{"$f":"VLOOKUP(B17,ALLdata!A:F,6,FALSE)","v":"State identifies statewide systemic goals for improvement."},null,null,null,null,null,"Element Rating:",null,null,null,null,null,0,null,null,null,null,null,null,null,null,"State identifies statewide systemic goals for improvement.","Element Rating:"]
[null,null,null,null,"Evidence:",null,null,null,null,null,null,null,null,null,null,null,1,null,null,null,null,null,null,null,null,"Evidence:",0]
[null,{"$f":"LEFT(B17,6)&D19","v":"E-UD1-d"},null,"d",{"$f":"VLOOKUP(B19,ALLdata!A:F,6,FALSE)","v":"State uses data to develop a comprehensive plan for program improvement."},null,null,null,null,null,"Element Rating:",null,null,null,null,null,0,null,null,null,null,null,null,null,null,"State uses data to develop a comprehensive plan for program improvement.","Element Rating:"]
[null,null,null,null,"Evidence:",null,null,null,null,null,null,null,null,null,null,null,1,null,null,null,null,null,null,null,null,"Evidence:",0]
[null,{"$f":"LEFT(B19,6)&D21","v":"E-UD1-e"},null,"e",{"$f":"VLOOKUP(B21,ALLdata!A:F,6,FALSE)","v":"State implements and evaluates program improvement activities on a regular cycle."},null,null,null,null,null,"Element Rating:",null,null,null,null,null,0,null,null,null,null,null,null,null,null,"State implements and evaluates program improvement activities on a regular cycle.","Element Rating:"]
[null,null,null,null,"Evidence:",null,null,null,null,null,null,null,null,null,null,null,1,null,null,null,null,null,null,null,null,"Evidence:",0]
[null,{"$f":"LEFT(B21,6)&D23","v":"E-UD1-f"},null,"f",{"$f":"VLOOKUP(B23,ALLdata!A:F,6,FALSE)","v":"State provides data and support to local programs related to use of data for program improvement."},null,null,null,null,null,"Element Rating:",null,null,null,null,null,0,null,null,null,null,null,null,null,null,"State provides data and support to local programs related to use of data for program improvement.","Element Rating:"]
[null,null,null,null,"Evidence:",null,null,null,null,null,null,null,null,null,null,null,1,null,null,null,null,null,null,null,null,"Evidence:",0]
[null,{"$f":"LEFT(B23,6)&D25","v":"E-UD1-g"},null,"g",{"$f":"VLOOKUP(B25,ALLdata!A:F,6,FALSE)","v":"State has policy or guidance that addresses local program responsibilities with regard to use of data for program improvement."},null,null,null,null,null,"Element Rating:",null,null,null,null,null,0,null,null,null,null,null,null,null,null,"State has policy or guidance that addresses local program responsibilities with regard to use of data for program improvement.","Element Rating:"]
[null,null,null,null,"Evidence:",null,null,null,null,null,null,null,null,null,null,null,1,null,null,null,null,null,null,null,null,"Evidence:",0]
[null,{"$f":"IF(D27=\"\",A27&E27,\"\")","v":""},null,null,null,null,null,null,null,null,null,null,null,null,null,null,0,null,null,null,null,null,null,null,null,"",0]
[null,"Q-UD2-0",null,"UD 2",{"$f":"VLOOKUP(B28,ALLdata!A:F,6,FALSE)","v":"Local programs make regular use of information on family experiences and outcomes to improve programs."},null,null,null,null,null,"QI Rating: ",{"$f":"VLOOKUP(B28,ALLdata!A:H,8,FALSE)","v":0},null,null,null,null,0,null,null,null,null,null,null,null,null,"Local programs make regular use of information on family experiences and outcomes to improve programs.","QI Rating: "]
[null,null,null,null,"Does the state have a process for systematically collecting information from local programs about making regular use of data to improve family experiences and outcomes?",null,null,null,null,null,"Yes",null,null,null,null,null,0,null,null,null,null,null,null,null,null,"Does the state have a process for systematically collecting information from local programs about making regular use of data to improve family experiences and outcomes?","Yes"]
[null,{"$f":"\"E-UD2-\"&D30","v":"E-UD2-a"},null,"a",{"$f":"VLOOKUP(B30,ALLdata!A:F,6,FALSE)","v":"Local programs regularly implement a stakeholder process that includes families for considering the implications of family experiences and outcomes data and other data."},null,null,null,null,null,"Element Rating:",null,null,null,null,null,0,null,null,null,null,null,null,null,null,"Local programs regularly implement a stakeholder process that includes families for considering the implications of family experiences and outcomes data and other data.","Element Rating:"]
[null,null,null,null,"Evidence:",null,null,null,null,null,null,null,null,null,null,null,1,null,null,null,null,null,null,null,null,"Evidence:",0]
[null,{"$f":"LEFT(B30,6)&D32","v":"E-UD2-b"},null,"b",{"$f":"VLOOKUP(B32,ALLdata!A:F,6,FALSE)","v":"Local programs use data to develop a comprehensive plan for program improvement."},null,null,null,null,null,"Element Rating:",null,null,null,null,null,0,null,null,null,null,null,null,null,null,"Local programs use data to develop a comprehensive plan for program improvement.","Element Rating:"]
[null,null,null,null,"Evidence:",null,null,null,null,null,null,null,null,null,null,null,1,null,null,null,null,null,null,null,null,"Evidence:",0]
[null,{"$f":"LEFT(B32,6)&D34","v":"E-UD2-c"},null,"c",{"$f":"VLOOKUP(B34,ALLdata!A:F,6,FALSE)","v":"Local programs implement and evaluate program improvement activities on a regular cycle."},null,null,null,null,null,"Element Rating:",null,null,null,null,null,0,null,null,null,null,null,null,null,null,"Local programs implement and evaluate program improvement activities on a regular cycle.","Element Rating:"]
[null,null,null,null,"Evidence:",null,null,null,null,null,null,null,null,null,null,null,1,null,null,null,null,null,null,null,null,"Evidence:",0]
[null,null,null,null,null,null,null,null,null,null,null,null,null,null,null,null,null,null,null,null,null,null,null,null,null,{"$f":"E36&F36","v":""},{"$f":"K36","v":0}]
[null,null,null,null,null,null,null,null,null,null,null,null,null,null,null,null,null,null,null,null,null,null,null,null,null,{"$f":"E37","v":0},{"$f":"K37","v":0}]

{"sheet":"Evaluation","index":8,"n_rows":49,"n_cols":27,"rows_kept":49,"cut":false,"hidden":false,"merged":[[0,3,1,5],[16,4,16,8],[17,5,17,8],[10,23,11,23],[13,22,14,23],[10,22,11,22],[14,4,14,8],[15,5,15,8],[16,17,17,17],[14,18,14,21],[15,18,15,21],[14,13,15,13],[16,10,17,10],[16,11,17,11],[16,13,17,13],[12,4,12,8],[13,5,13,8],[10,18,10,21],[12,17,13,17],[14,17,15,17],[11,4,11,8],[12,10,13,10],[12,11,13,11],[12,13,13,13],[14,10,15,10],[14,11,15,11],[10,10,10,11],[2,3,2,5],[3,4,3,5],[4,4,4,5],[5,4,5,5],[6,4,6,5],[4,7,4,13],[7,4,7,5],[8,4,8,5],[9,4,9,5],[5,8,5,13],[6,8,6,13],[7,8,7,13],[8,8,8,13]]}
[null,null,null,"Evaluation"]
[]
[null,null,null,"Quality Indicator Rating (Calculated)"]
[null,null,null,1,"None of the elements is yet planned or in place.  "]
[null,null,null,2,"Most of the elements are not yet planned or in place. ",null,null,"Element of Quality Rating (EQR)"]
[null,null,null,3,"Some elements are in place; a few may be fully implemented.",null,null,1,"No - element not in place and not planning to work on it at this time"]
[null,null,null,4,"At least half of the elements are in place; a few may be fully implemented.",null,null,2,"No - element not in place but planning to work on it or getting started"]
[null,null,null,5,"At least half of the elements are in place; some are fully implemented.",null,null,3,"Yes - element partially implemented"]
[null,null,null,6,"At least half of the elements are fully implemented; the rest are partially implemented.",null,null,4,"Yes - element fully implemented"]
[null,null,null,7,"All elements are fully implemented."]
[null,null,null,null,null,null,null,null,null,null,"Rating",null,null,"PRIORITY",null,null,null,null,null,null,null,null,null,null,null,{"$f":"E11&F11","v":""}]
[null,"Q-EV1-0",null,"EV 1",{"$f":"VLOOKUP(B12,ALLdata!A:F,6,FALSE)","v":"State evaluates its family experiences and outcomes measurement system regularly."},null,null,null,null,null,"QI Rating: ",{"$f":"VLOOKUP(B12,ALLdata!A:H,8,FALSE)","v":0},null,null,null,null,{"$f":"IF(E12=\"Evidence:\",1,0)","v":0},null,null,null,null,null,null,null,null,{"$f":"E12&F12","v":"State evaluates its family experiences and outcomes measurement system regularly."},{"$f":"K12","v":"QI Rating: "}]
[null,{"$f":"\"E-EV1-\"&D13","v":"E-EV1-a"},null,"a",{"$f":"VLOOKUP(B13,ALLdata!A:F,6,FALSE)","v":"State regularly develops/updates an evaluation plan addressing whether the individual components of the family experiences and outcomes measurement system are being implemented as planned/with fidelity, each component is producing its intended result(s), and the outcomes system as a whole is accomplishing its intended purpose(s)."},null,null,null,null,null,"Element Rating:",null,null,null,null,null,0,null,null,null,null,null,null,null,null,"State regularly develops/updates an evaluation plan addressing whether the individual components of the family experiences and outcomes measurement system are being implemented as planned/with fidelity, each component is producing its intended result(s), and the outcomes system as a whole is accomplishing its intended purpose(s).",{"$f":"K13","v":"Element Rating:"}]
[null,null,null,null,"Evidence:",null,null,null,null,null,null,null,null,null,null,null,1,null,null,null,null,null,null,null,null,"Evidence:",0]
[null,{"$f":"LEFT(B13,6)&D15","v":"E-EV1-b"},null,"b",{"$f":"VLOOKUP(B15,ALLdata!A:F,6,FALSE)","v":"State implements its evaluation strategies according to plan."},null,null,null,null,null,"Element Rating:",null,null,null,null,null,0,null,null,null,null,null,null,null,null,"State implements its evaluation strategies according to plan.","Element Rating:"]
[null,null,null,null,"Evidence:",null,null,null,null,null,null,null,null,null,null,null,1,null,null,null,null,null,null,null,null,"Evidence:",0]
[null,{"$f":"LEFT(B15,6)&D17","v":"E-EV1-c"},null,"c",{"$f":"VLOOKUP(B17,ALLdata!A:F,6,FALSE)","v":"State regularly uses evaluation results to improve the measurement system components, to improve the effectiveness of the measurement system, and to revise the evaluation plan."},null,null,null,null,null,"Element Rating:",null,null,null,null,null,0,null,null,null,null,null,null,null,null,"State regularly uses evaluation results to improve the measurement system components, to improve the effectiveness of the measurement system, and to revise the evaluation plan.","Element Rating:"]
[null,null,null,null,"Evidence:",null,null,null,null,null,null,null,null,null,null,null,1,null,null,null,null,null,null,null,null,"Evidence:",0]
[null,null,null,null,null,null,null,null,null,null,null,null,null,null,null,null,null,null,null,null,null,null,null,null,null,""]
[null,null,null,null,null,null,null,null,null,null,null,null,null,null,null,null,null,null,null,null,null,null,null,null,null,{"$f":"E20","v":0}]
[null,null,null,null,null,null,null,null,null,null,null,null,null,null,null,null,null,null,null,null,null,null,null,null,null,0]
[null,null,null,null,null,null,null,null,null,null,null,null,null,null,null,null,null,null,null,null,null,null,null,null,null,0]
[null,null,null,null,null,null,null,null,null,null,null,null,null,null,null,null,null,null,null,null,null,null,null,null,null,0]
[null,null,null,null,null,null,null,null,null,null,null,null,null,null,null,null,null,null,null,null,null,null,null,null,null,0]
[null,null,null,null,null,null,null,null,null,null,null,null,null,null,null,null,null,null,null,null,null,null,null,null,null,0]
[null,null,null,null,null,null,null,null,null,null,null,null,null,null,null,null,null,null,null,null,null,null,null,null,null,0]
[null,null,null,null,null,null,null,null,null,null,null,null,null,null,null,null,null,null,null,null,null,null,null,null,null,0]
[null,null,null,null,null,null,null,null,null,null,null,null,null,null,null,null,null,null,null,null,null,null,null,null,null,0]
[null,null,null,null,null,null,null,null,null,null,null,null,null,null,null,null,null,null,null,null,null,null,null,null,null,0]
[null,null,null,null,null,null,null,null,null,null,null,null,null,null,null,null,null,null,null,null,null,null,null,null,null,0]
[null,null,null,null,null,null,null,null,null,null,null,null,null,null,null,null,null,null,null,null,null,null,null,null,null,0]
[null,null,null,null,null,null,null,null,null,null,null,null,null,null,null,null,null,null,null,null,null,null,null,null,null,0]
[null,null,null,null,null,null,null,null,null,null,null,null,null,null,null,null,null,null,null,null,null,null,null,null,null,0]
[null,null,null,null,null,null,null,null,null,null,null,null,null,null,null,null,null,null,null,null,null,null,null,null,null,0]
[null,null,null,null,null,null,null,null,null,null,null,null,null,null,null,null,null,null,null,null,null,null,null,null,null,{"$f":"E35","v":0}]
[null,null,null,null,null,null,null,null,null,null,null,null,null,null,null,null,null,null,null,null,null,null,null,null,null,0]
[null,null,null,null,null,null,null,null,null,null,null,null,null,null,null,null,null,null,null,null,null,null,null,null,null,0]
[null,null,null,null,null,null,null,null,null,null,null,null,null,null,null,null,null,null,null,null,null,null,null,null,null,0]
[null,null,null,null,null,null,null,null,null,null,null,null,null,null,null,null,null,null,null,null,null,null,null,null,null,0]
[null,null,null,null,null,null,null,null,null,null,null,null,null,null,null,null,null,null,null,null,null,null,null,null,null,0]
[null,null,null,null,null,null,null,null,null,null,null,null,null,null,null,null,null,null,null,null,null,null,null,null,null,0]
[null,null,null,null,null,null,null,null,null,null,null,null,null,null,null,null,null,null,null,null,null,null,null,null,null,0]
[null,null,null,null,null,null,null,null,null,null,null,null,null,null,null,null,null,null,null,null,null,null,null,null,null,0]
[null,null,null,null,null,null,null,null,null,null,null,null,null,null,null,null,null,null,null,null,null,null,null,null,null,0]
[null,null,null,null,null,null,null,null,null,null,null,null,null,null,null,null,null,null,null,null,null,null,null,null,null,0]
[null,null,null,null,null,null,null,null,null,null,null,null,null,null,null,null,null,null,null,null,null,null,null,null,null,0]
[null,null,null,null,null,null,null,null,null,null,null,null,null,null,null,null,null,null,null,null,null,null,null,null,null,0]
[null,null,null,null,null,null,null,null,null,null,null,null,null,null,null,null,null,null,null,null,null,null,null,null,null,0]
[null,null,null,null,null,null,null,null,null,null,null,null,null,null,null,null,null,null,null,null,null,null,null,null,null,0]

{"sheet":"CrossSystem","index":9,"n_rows":32,"n_cols":27,"rows_kept":32,"cut":false,"hidden":false,"merged":[[0,3,1,5],[10,23,11,23],[13,22,14,23],[18,22,19,22],[18,23,19,23],[10,22,11,22],[10,18,10,21],[12,17,13,17],[14,17,15,17],[16,17,17,17],[14,18,14,21],[15,18,15,21],[5,8,5,13],[6,8,6,13],[7,8,7,13],[10,10,10,11],[21,22,22,23],[18,18,18,21],[20,17,21,17],[28,4,28,8],[29,5,29,8],[28,17,29,17],[26,4,26,8],[27,5,27,8],[20,10,21,10],[22,10,23,10],[28,10,29,10],[28,11,29,11],[26,17,27,17],[26,10,27,10],[26,11,27,11],[26,13,27,13],[8,8,8,13],[22,13,23,13],[24,10,25,10],[24,11,25,11],[24,13,25,13],[20,11,21,11],[20,13,21,13],[12,13,13,13],[14,11,15,11],[14,13,15,13],[16,10,17,10],[16,11,17,11],[16,13,17,13],[14,4,14,8],[15,5,15,8],[16,4,16,8],[8,4,8,5],[9,4,9,5],[14,10,15,10],[28,13,29,13],[2,3,2,5],[3,4,3,5],[4,4,4,5],[5,4,5,5],[6,4,6,5],[7,4,7,5],[11,4,11,8],[12,4,12,8],[13,5,13,8],[4,7,4,13],[12,10,13,10],[12,11,13,11],[17,5,17,8],[19,4,19,8],[20,4,20,8],[22,17,23,17],[24,17,25,17],[24,4,24,8],[25,5,25,8],[22,11,23,11],[22,18,22,21],[23,18,23,21],[21,5,21,8],[22,4,22,8],[23,5,23,8]]}
[null,null,null,"Cross-system Coordination"]
[]
[null,null,null,"Quality Indicator Rating (Calculated)"]
[null,null,null,1,"None of the elements is yet planned or in place.  "]
[null,null,null,2,"Most of the elements are not yet planned or in place. ",null,null,"Element of Quality Rating (EQR)"]
[null,null,null,3,"Some elements are in place; a few may be fully implemented.",null,null,1,"No - element not in place and not planning to work on it at this time"]
[null,null,null,4,"At least half of the elements are in place; a few may be fully implemented.",null,null,2,"No - element not in place but planning to work on it or getting started"]
[null,null,null,5,"At least half of the elements are in place; some are fully implemented.",null,null,3,"Yes - element partially implemented"]
[null,null,null,6,"At least half of the elements are fully implemented; the rest are partially implemented.",null,null,4,"Yes - element fully implemented"]
[null,null,null,7,"All elements are fully implemented."]
[null,null,null,null,null,null,null,null,null,null,"Rating",null,null,"PRIORITY",null,null,null,null,null,null,null,null,null,null,null,{"$f":"E11&F11","v":""}]
[null,"Q-CC1-0",null,"CC 1",{"$f":"VLOOKUP(B12,ALLdata!A:F,6,FALSE)","v":"Part C and Part B 619 coordinate family experiences and outcomes measurement."},null,null,null,null,null,"QI Rating: ",{"$f":"VLOOKUP(B12,ALLdata!A:H,8,FALSE)","v":0},null,null,null,null,{"$f":"IF(E12=\"Evidence:\",1,0)","v":0},null,null,null,null,null,null,null,null,{"$f":"E12&F12","v":"Part C and Part B 619 coordinate family experiences and outcomes measurement."},{"$f":"K12","v":"QI Rating: "}]
[null,{"$f":"\"E-CC1-\"&D13","v":"E-CC1-a"},null,"a",{"$f":"VLOOKUP(B13,ALLdata!A:F,6,FALSE)","v":"Part C and Part B 619 programs use a coordinated approach for measuring family experiences and outcomes so that a common core of data is available to improve programs."},null,null,null,null,null,"Element Rating:",null,null,null,null,null,0,null,null,null,null,null,null,null,null,"Part C and Part B 619 programs use a coordinated approach for measuring family experiences and outcomes so that a common core of data is available to improve programs.",{"$f":"K13","v":"Element Rating:"}]
[null,null,null,null,"Evidence:",null,null,null,null,null,null,null,null,null,null,null,1,null,null,null,null,null,null,null,null,"Evidence:",0]
[null,{"$f":"LEFT(B13,6)&D15","v":"E-CC1-b"},null,"b",{"$f":"VLOOKUP(B15,ALLdata!A:F,6,FALSE)","v":"Part C and Part B 619 programs routinely coordinate family experiences and outcomes data analysis and reporting."},null,null,null,null,null,"Element Rating:",null,null,null,null,null,0,null,null,null,null,null,null,null,null,"Part C and Part B 619 programs routinely coordinate family experiences and outcomes data analysis and reporting.","Element Rating:"]
[null,null,null,null,"Evidence:",null,null,null,null,null,null,null,null,null,null,null,1,null,null,null,null,null,null,null,null,"Evidence:",0]
[null,{"$f":"LEFT(B15,6)&D17","v":"E-CC1-c"},null,"c",{"$f":"VLOOKUP(B17,ALLdata!A:F,6,FALSE)","v":"Part C and Part B 619 state and local programs work together to use the family data to assure that families uniformly experience quality programs and benefit from services across the early childhood years."},null,null,null,null,null,"Element Rating:",null,null,null,null,null,0,null,null,null,null,null,null,null,null,"Part C and Part B 619 state and local programs work together to use the family data to assure that families uniformly experience quality programs and benefit from services across the early childhood years.","Element Rating:"]
[null,null,null,null,"Evidence:",null,null,null,null,null,null,null,null,null,null,null,1,null,null,null,null,null,null,null,null,"Evidence:",0]
[null,{"$f":"IF(D19=\"\",A19&E19,\"\")","v":""},null,null,null,null,null,null,null,null,null,null,null,null,null,null,0,null,null,null,null,null,null,null,null,"",0]
[null,"Q-CC2-0",null,"CC 2",{"$f":"VLOOKUP(B20,ALLdata!A:F,6,FALSE)","v":"Family experiences and outcomes measurement is integrated across early childhood (EC) programs statewide."},null,null,null,null,null,"QI Rating: ",{"$f":"VLOOKUP(B20,ALLdata!A:H,8,FALSE)","v":0},null,null,null,null,0,null,null,null,null,null,null,null,null,"Family experiences and outcomes measurement is integrated across early childhood (EC) programs statewide.","QI Rating: "]
[null,{"$f":"\"E-CC2-\"&D21","v":"E-CC2-a"},null,"a",{"$f":"VLOOKUP(B21,ALLdata!A:F,6,FALSE)","v":"EC programs use a coordinated data collection approach for measuring family experiences and outcomes to minimize the need for families to complete multiple surveys and so that a common core of data is available to improve programs."},null,null,null,null,null,"Element Rating:",null,null,null,null,null,0,null,null,null,null,null,null,null,null,"EC programs use a coordinated data collection approach for measuring family experiences and outcomes to minimize the need for families to complete multiple surveys and so that a common core of data is available to improve programs.","Element Rating:"]
[null,null,null,null,"Evidence:",null,null,null,null,null,null,null,null,null,null,null,1,null,null,null,null,null,null,null,null,"Evidence:",0]
[null,{"$f":"LEFT(B21,6)&D23","v":"E-CC2-b"},null,"b",{"$f":"VLOOKUP(B23,ALLdata!A:F,6,FALSE)","v":"EC programs use common data standards so that data can be linked across programs."},null,null,null,null,null,"Element Rating:",null,null,null,null,null,0,null,null,null,null,null,null,null,null,"EC programs use common data standards so that data can be linked across programs.","Element Rating:"]
[null,null,null,null,"Evidence:",null,null,null,null,null,null,null,null,null,null,null,1,null,null,null,null,null,null,null,null,"Evidence:",0]
[null,{"$f":"LEFT(B23,6)&D25","v":"E-CC2-c"},null,"c",{"$f":"VLOOKUP(B25,ALLdata!A:F,6,FALSE)","v":"EC programs routinely coordinate family experiences and outcomes data analysis and reporting."},null,null,null,null,null,"Element Rating:",null,null,null,null,null,0,null,null,null,null,null,null,null,null,"EC programs routinely coordinate family experiences and outcomes data analysis and reporting.","Element Rating:"]
[null,null,null,null,"Evidence:",null,null,null,null,null,null,null,null,null,null,null,1,null,null,null,null,null,null,null,null,"Evidence:",0]
[null,{"$f":"LEFT(B25,6)&D27","v":"E-CC2-d"},null,"d",{"$f":"VLOOKUP(B27,ALLdata!A:F,6,FALSE)","v":"With appropriate safeguards, stakeholders have access to a common core of de-identified data to allow a coordinated examination of issues related to family experiences and outcomes over time and across programs."},null,null,null,null,null,"Element Rating:",null,null,null,null,null,0,null,null,null,null,null,null,null,null,"With appropriate safeguards, stakeholders have access to a common core of de-identified data to allow a coordinated examination of issues related to family experiences and outcomes over time and across programs.","Element Rating:"]
[null,null,null,null,"Evidence:",null,null,null,null,null,null,null,null,null,null,null,1,null,null,null,null,null,null,null,null,"Evidence:",0]
[null,{"$f":"LEFT(B27,6)&D29","v":"E-CC2-e"},null,"e",{"$f":"VLOOKUP(B29,ALLdata!A:F,6,FALSE)","v":"EC state and local early childhood programs work together to use the family data to assure that families uniformly experience quality programs and benefit from them."},null,null,null,null,null,"Element Rating:",null,null,null,null,null,0,null,null,null,null,null,null,null,null,"EC state and local early childhood programs work together to use the family data to assure that families uniformly experience quality programs and benefit from them.","Element Rating:"]
[null,null,null,null,"Evidence:",null,null,null,null,null,null,null,null,null,null,null,1,null,null,null,null,null,null,null,null,"Evidence:",0]
[null,null,null,null,null,null,null,null,null,null,null,null,null,null,null,null,{"$f":"IF(E31=\"Evidence:\",1,0)","v":0},null,null,null,null,null,null,null,null,{"$f":"E31&F31","v":""},{"$f":"K31","v":0}]
[null,null,null,null,null,null,null,null,null,null,null,null,null,null,null,null,null,null,null,null,null,null,null,null,null,{"$f":"E32","v":0},{"$f":"K32","v":0}]

{"sheet":"QISummary","index":10,"n_rows":33,"n_cols":30,"rows_kept":33,"cut":false,"hidden":false,"merged":[[0,5,1,5],[0,6,1,6],[0,7,1,7],[0,8,1,8],[0,1,1,1],[0,2,1,2],[0,3,1,3],[0,4,1,4],[0,27,0,29],[1,27,1,29],[28,12,28,18],[0,21,0,25],[1,21,1,25],[5,12,5,18],[6,12,6,18],[20,12,20,18],[21,12,21,18],[16,12,16,18],[0,19,2,19],[17,12,17,18],[19,2,19,8],[3,1,3,10],[3,12,3,18],[9,12,9,18],[10,1,10,10],[10,12,10,18],[4,2,4,8],[7,2,7,8],[8,2,8,8],[6,1,6,10],[31,12,31,18],[24,12,24,18],[25,1,25,10],[25,12,25,18],[27,12,27,18],[2,1,2,8],[32,2,32,8],[22,2,22,8],[23,2,23,8],[26,2,26,8],[29,2,29,8],[30,2,30,8],[11,2,11,8],[12,2,12,8],[13,2,13,8],[14,2,14,8],[15,2,15,8],[28,1,28,10],[21,1,21,10],[17,1,17,10],[18,2,18,8]]}
[null,"Jump to:","PURPOSE","DATA COL","ANALYSIS","REPORT","USE DATA","EVAL","CROSS SYS",null,null,null,null,null,null,null,null,null,null,"Total # of Elements",null,"# of Elements in this QI",null,null,null,null,null,"# of Elements in this QI"]
[null,null,null,null,null,null,null,null,null,null,null,null,null,null,null,null,null,null,null,null,null,"with RATING…",null,null,null,null,null,"with PRIORITY…"]
[null,"Quality Indicator",null,null,null,null,null,null,null,"Rating","Priority",null,1,2,3,4,5,6,7,null,null,1,2,3,4,"Not Applicable",null,"Low","Medium","High"]
[null,"Purpose (PURPOSE)",null,null,null,null,null,null,null,null,null,null,"QI Rating"]
["Q-PR1-0","PR 1",{"$f":"VLOOKUP(A5,ALLdata!A:F,6,FALSE)","v":"State has articulated the purposes(s) of the family experiences and outcomes measurement system."},null,null,null,null,null,null,{"$f":"Purpose!L12","v":0},{"$f":"PROPER(Purpose!N12)","v":""},null,{"$f":"VLOOKUP($A5,ALLdata!$A:$I,8,FALSE)","v":0},{"$f":"VLOOKUP($A5,ALLdata!$A:$I,8,FALSE)","v":0},{"$f":"VLOOKUP($A5,ALLdata!$A:$I,8,FALSE)","v":0},{"$f":"VLOOKUP($A5,ALLdata!$A:$I,8,FALSE)","v":0},{"$f":"VLOOKUP($A5,ALLdata!$A:$I,8,FALSE)","v":0},{"$f":"VLOOKUP($A5,ALLdata!$A:$I,8,FALSE)","v":0},{"$f":"VLOOKUP($A5,ALLdata!$A:$I,8,FALSE)","v":0},{"$f":"COUNTIFS(ALLdata!B:B,\"Element\",ALLdata!D:D,B5)","v":6},null,{"$f":"COUNTIFS(ALLdata!$B:$B,\"Element\",ALLdata!$D:$D,$B5,ALLdata!$G:$G,V$3)","v":0},{"$f":"COUNTIFS(ALLdata!$B:$B,\"Element\",ALLdata!$D:$D,$B5,ALLdata!$G:$G,W$3)","v":0},{"$f":"COUNTIFS(ALLdata!$B:$B,\"Element\",ALLdata!$D:$D,$B5,ALLdata!$G:$G,X$3)","v":0},{"$f":"COUNTIFS(ALLdata!$B:$B,\"Element\",ALLdata!$D:$D,$B5,ALLdata!$G:$G,Y$3)","v":0},null,null,{"$f":"COUNTIFS(ALLdata!$B:$B,\"Element\",ALLdata!$D:$D,$B5,ALLdata!$I:$I,LEFT(AB$3))","v":0},{"$f":"COUNTIFS(ALLdata!$B:$B,\"Element\",ALLdata!$D:$D,$B5,ALLdata!$I:$I,LEFT(AC$3))","v":0},{"$f":"COUNTIFS(ALLdata!$B:$B,\"Element\",ALLdata!$D:$D,$B5,ALLdata!$I:$I,LEFT(AD$3))","v":0}]
[]
[null,"Data Collection and Transmission (DATA COL)",null,null,null,null,null,null,null,null,null,null,"QI Rating"]
["Q-DC1-0","DC 1",{"$f":"VLOOKUP(A8,ALLdata!A:F,6,FALSE)","v":"Data collection procedures are carried out efficiently and effectively."},null,null,null,null,null,null,{"$f":"DataCollection!L12","v":0},{"$f":"PROPER(DataCollection!N12)","v":""},null,{"$f":"VLOOKUP($A8,ALLdata!$A:$I,8,FALSE)","v":0},{"$f":"VLOOKUP($A8,ALLdata!$A:$I,8,FALSE)","v":0},{"$f":"VLOOKUP($A8,ALLdata!$A:$I,8,FALSE)","v":0},{"$f":"VLOOKUP($A8,ALLdata!$A:$I,8,FALSE)","v":0},{"$f":"VLOOKUP($A8,ALLdata!$A:$I,8,FALSE)","v":0},{"$f":"VLOOKUP($A8,ALLdata!$A:$I,8,FALSE)","v":0},{"$f":"VLOOKUP($A8,ALLdata!$A:$I,8,FALSE)","v":0},{"$f":"COUNTIFS(ALLdata!B:B,\"Element\",ALLdata!D:D,B8)","v":16},null,{"$f":"COUNTIFS(ALLdata!$B:$B,\"Element\",ALLdata!$D:$D,$B8,ALLdata!$G:$G,V$3)","v":0},{"$f":"COUNTIFS(ALLdata!$B:$B,\"Element\",ALLdata!$D:$D,$B8,ALLdata!$G:$G,W$3)","v":0},{"$f":"COUNTIFS(ALLdata!$B:$B,\"Element\",ALLdata!$D:$D,$B8,ALLdata!$G:$G,X$3)","v":0},{"$f":"COUNTIFS(ALLdata!$B:$B,\"Element\",ALLdata!$D:$D,$B8,ALLdata!$G:$G,Y$3)","v":0},{"$f":"COUNTIFS(ALLdata!$B:$B,\"Element\",ALLdata!$D:$D,$B8,ALLdata!$G:$G,Z$3)","v":0},null,{"$f":"COUNTIFS(ALLdata!$B:$B,\"Element\",ALLdata!$D:$D,$B8,ALLdata!$I:$I,LEFT(AB$3))","v":0},{"$f":"COUNTIFS(ALLdata!$B:$B,\"Element\",ALLdata!$D:$D,$B8,ALLdata!$I:$I,LEFT(AC$3))","v":0},{"$f":"COUNTIFS(ALLdata!$B:$B,\"Element\",ALLdata!$D:$D,$B8,ALLdata!$I:$I,LEFT(AD$3))","v":0}]
["Q-DC2-0","DC 2",{"$f":"VLOOKUP(A9,ALLdata!A:F,6,FALSE)","v":"State’s method for entering, transmitting, and storing data is effective and efficient."},null,null,null,null,null,null,{"$f":"DataCollection!L46","v":0},{"$f":"PROPER(DataCollection!N46)","v":""},null,{"$f":"VLOOKUP($A9,ALLdata!$A:$I,8,FALSE)","v":0},{"$f":"VLOOKUP($A9,ALLdata!$A:$I,8,FALSE)","v":0},{"$f":"VLOOKUP($A9,ALLdata!$A:$I,8,FALSE)","v":0},{"$f":"VLOOKUP($A9,ALLdata!$A:$I,8,FALSE)","v":0},{"$f":"VLOOKUP($A9,ALLdata!$A:$I,8,FALSE)","v":0},{"$f":"VLOOKUP($A9,ALLdata!$A:$I,8,FALSE)","v":0},{"$f":"VLOOKUP($A9,ALLdata!$A:$I,8,FALSE)","v":0},{"$f":"COUNTIFS(ALLdata!B:B,\"Element\",ALLdata!D:D,B9)","v":8},null,{"$f":"COUNTIFS(ALLdata!$B:$B,\"Element\",ALLdata!$D:$D,$B9,ALLdata!$G:$G,V$3)","v":0},{"$f":"COUNTIFS(ALLdata!$B:$B,\"Element\",ALLdata!$D:$D,$B9,ALLdata!$G:$G,W$3)","v":0},{"$f":"COUNTIFS(ALLdata!$B:$B,\"Element\",ALLdata!$D:$D,$B9,ALLdata!$G:$G,X$3)","v":0},{"$f":"COUNTIFS(ALLdata!$B:$B,\"Element\",ALLdata!$D:$D,$B9,ALLdata!$G:$G,Y$3)","v":0},null,null,{"$f":"COUNTIFS(ALLdata!$B:$B,\"Element\",ALLdata!$D:$D,$B9,ALLdata!$I:$I,LEFT(AB$3))","v":0},{"$f":"COUNTIFS(ALLdata!$B:$B,\"Element\",ALLdata!$D:$D,$B9,ALLdata!$I:$I,LEFT(AC$3))","v":0},{"$f":"COUNTIFS(ALLdata!$B:$B,\"Element\",ALLdata!$D:$D,$B9,ALLdata!$I:$I,LEFT(AD$3))","v":0}]
[]
[null,"Analysis (ANALYSIS)",null,null,null,null,null,null,null,null,null,null,"QI Rating"]
["Q-AN1-0","AN 1",{"$f":"VLOOKUP(A12,ALLdata!A:F,6,FALSE)","v":"State identifies accountability and program improvement questions related to family experiences and outcomes."},null,null,null,null,null,null,{"$f":"Analysis!L12","v":0},{"$f":"PROPER(Analysis!N12)","v":""},null,{"$f":"VLOOKUP($A12,ALLdata!$A:$I,8,FALSE)","v":0},{"$f":"VLOOKUP($A12,ALLdata!$A:$I,8,FALSE)","v":0},{"$f":"VLOOKUP($A12,ALLdata!$A:$I,8,FALSE)","v":0},{"$f":"VLOOKUP($A12,ALLdata!$A:$I,8,FALSE)","v":0},{"$f":"VLOOKUP($A12,ALLdata!$A:$I,8,FALSE)","v":0},{"$f":"VLOOKUP($A12,ALLdata!$A:$I,8,FALSE)","v":0},{"$f":"VLOOKUP($A12,ALLdata!$A:$I,8,FALSE)","v":0},{"$f":"COUNTIFS(ALLdata!B:B,\"Element\",ALLdata!D:D,B12)","v":9},null,{"$f":"COUNTIFS(ALLdata!$B:$B,\"Element\",ALLdata!$D:$D,$B12,ALLdata!$G:$G,V$3)","v":0},{"$f":"COUNTIFS(ALLdata!$B:$B,\"Element\",ALLdata!$D:$D,$B12,ALLdata!$G:$G,W$3)","v":0},{"$f":"COUNTIFS(ALLdata!$B:$B,\"Element\",ALLdata!$D:$D,$B12,ALLdata!$G:$G,X$3)","v":0},{"$f":"COUNTIFS(ALLdata!$B:$B,\"Element\",ALLdata!$D:$D,$B12,ALLdata!$G:$G,Y$3)","v":0},null,null,{"$f":"COUNTIFS(ALLdata!$B:$B,\"Element\",ALLdata!$D:$D,$B12,ALLdata!$I:$I,LEFT(AB$3))","v":0},{"$f":"COUNTIFS(ALLdata!$B:$B,\"Element\",ALLdata!$D:$D,$B12,ALLdata!$I:$I,LEFT(AC$3))","v":0},{"$f":"COUNTIFS(ALLdata!$B:$B,\"Element\",ALLdata!$D:$D,$B12,ALLdata!$I:$I,LEFT(AD$3))","v":0}]
["Q-AN2-0","AN 2",{"$f":"VLOOKUP(A13,ALLdata!A:F,6,FALSE)&\"*\"","v":"Local programs identify accountability and program improvement questions related to family experiences and outcomes.*"},null,null,null,null,null,null,{"$f":"Analysis!L32","v":0},{"$f":"PROPER(Analysis!N32)","v":""},null,{"$f":"VLOOKUP($A13,ALLdata!$A:$I,8,FALSE)","v":0},{"$f":"VLOOKUP($A13,ALLdata!$A:$I,8,FALSE)","v":0},{"$f":"VLOOKUP($A13,ALLdata!$A:$I,8,FALSE)","v":0},{"$f":"VLOOKUP($A13,ALLdata!$A:$I,8,FALSE)","v":0},{"$f":"VLOOKUP($A13,ALLdata!$A:$I,8,FALSE)","v":0},{"$f":"VLOOKUP($A13,ALLdata!$A:$I,8,FALSE)","v":0},{"$f":"VLOOKUP($A13,ALLdata!$A:$I,8,FALSE)","v":0},{"$f":"IF(Analysis!K33=\"No\",\"N/A\",COUNTIFS(ALLdata!B:B,\"Element\",ALLdata!D:D,B13))","v":7},null,{"$f":"IF(Analysis!K33=\"No\",\"-\",COUNTIFS(ALLdata!$B:$B,\"Element\",ALLdata!$D:$D,$B13,ALLdata!$G:$G,V$3))","v":0},{"$f":"IF(Analysis!K33=\"No\",\"-\",COUNTIFS(ALLdata!$B:$B,\"Element\",ALLdata!$D:$D,$B13,ALLdata!$G:$G,W$3))","v":0},{"$f":"IF(Analysis!K33=\"No\",\"-\",COUNTIFS(ALLdata!$B:$B,\"Element\",ALLdata!$D:$D,$B13,ALLdata!$G:$G,X$3))","v":0},{"$f":"IF(Analysis!K33=\"No\",\"-\",COUNTIFS(ALLdata!$B:$B,\"Element\",ALLdata!$D:$D,$B13,ALLdata!$G:$G,Y$3))","v":0},null,null,{"$f":"IF(Analysis!K33=\"No\",\"-\",COUNTIFS(ALLdata!$B:$B,\"Element\",ALLdata!$D:$D,$B13,ALLdata!$I:$I,LEFT(AB$3)))","v":0},{"$f":"IF(Analysis!K33=\"No\",\"-\",COUNTIFS(ALLdata!$B:$B,\"Element\",ALLdata!$D:$D,$B13,ALLdata!$I:$I,LEFT(AC$3)))","v":0},{"$f":"IF(Analysis!K33=\"No\",\"-\",COUNTIFS(ALLdata!$B:$B,\"Element\",ALLdata!$D:$D,$B13,ALLdata!$I:$I,LEFT(AD$3)))","v":0}]
["Q-AN3-0","AN 3",{"$f":"VLOOKUP(A14,ALLdata!A:F,6,FALSE)","v":"State agency analyzes data in a timely manner."},null,null,null,null,null,null,{"$f":"Analysis!L49","v":0},{"$f":"PROPER(Analysis!N49)","v":""},null,{"$f":"VLOOKUP($A14,ALLdata!$A:$I,8,FALSE)","v":0},{"$f":"VLOOKUP($A14,ALLdata!$A:$I,8,FALSE)","v":0},{"$f":"VLOOKUP($A14,ALLdata!$A:$I,8,FALSE)","v":0},{"$f":"VLOOKUP($A14,ALLdata!$A:$I,8,FALSE)","v":0},{"$f":"VLOOKUP($A14,ALLdata!$A:$I,8,FALSE)","v":0},{"$f":"VLOOKUP($A14,ALLdata!$A:$I,8,FALSE)","v":0},{"$f":"VLOOKUP($A14,ALLdata!$A:$I,8,FALSE)","v":0},{"$f":"COUNTIFS(ALLdata!B:B,\"Element\",ALLdata!D:D,B14)","v":7},null,{"$f":"COUNTIFS(ALLdata!$B:$B,\"Element\",ALLdata!$D:$D,$B14,ALLdata!$G:$G,V$3)","v":0},{"$f":"COUNTIFS(ALLdata!$B:$B,\"Element\",ALLdata!$D:$D,$B14,ALLdata!$G:$G,W$3)","v":0},{"$f":"COUNTIFS(ALLdata!$B:$B,\"Element\",ALLdata!$D:$D,$B14,ALLdata!$G:$G,X$3)","v":0},{"$f":"COUNTIFS(ALLdata!$B:$B,\"Element\",ALLdata!$D:$D,$B14,ALLdata!$G:$G,Y$3)","v":0},null,null,{"$f":"COUNTIFS(ALLdata!$B:$B,\"Element\",ALLdata!$D:$D,$B14,ALLdata!$I:$I,LEFT(AB$3))","v":0},{"$f":"COUNTIFS(ALLdata!$B:$B,\"Element\",ALLdata!$D:$D,$B14,ALLdata!$I:$I,LEFT(AC$3))","v":0},{"$f":"COUNTIFS(ALLdata!$B:$B,\"Element\",ALLdata!$D:$D,$B14,ALLdata!$I:$I,LEFT(AD$3))","v":0}]
["Q-AN4-0","AN 4",{"$f":"VLOOKUP(A15,ALLdata!A:F,6,FALSE)&\"*\"","v":"Local programs analyze data in a timely manner.*"},null,null,null,null,null,null,{"$f":"Analysis!L65","v":0},{"$f":"PROPER(Analysis!N65)","v":""},null,{"$f":"VLOOKUP($A15,ALLdata!$A:$I,8,FALSE)","v":0},{"$f":"VLOOKUP($A15,ALLdata!$A:$I,8,FALSE)","v":0},{"$f":"VLOOKUP($A15,ALLdata!$A:$I,8,FALSE)","v":0},{"$f":"VLOOKUP($A15,ALLdata!$A:$I,8,FALSE)","v":0},{"$f":"VLOOKUP($A15,ALLdata!$A:$I,8,FALSE)","v":0},{"$f":"VLOOKUP($A15,ALLdata!$A:$I,8,FALSE)","v":0},{"$f":"VLOOKUP($A15,ALLdata!$A:$I,8,FALSE)","v":0},{"$f":"IF(Analysis!K66=\"No\",\"N/A\",COUNTIFS(ALLdata!B:B,\"Element\",ALLdata!D:D,B15))","v":3},null,{"$f":"IF(Analysis!K66=\"No\",\"-\",COUNTIFS(ALLdata!$B:$B,\"Element\",ALLdata!$D:$D,$B15,ALLdata!$G:$G,V$3))","v":0},{"$f":"IF(Analysis!K66=\"No\",\"-\",COUNTIFS(ALLdata!$B:$B,\"Element\",ALLdata!$D:$D,$B15,ALLdata!$G:$G,W$3))","v":0},{"$f":"IF(Analysis!K66=\"No\",\"-\",COUNTIFS(ALLdata!$B:$B,\"Element\",ALLdata!$D:$D,$B15,ALLdata!$G:$G,X$3))","v":0},{"$f":"IF(Analysis!K66=\"No\",\"-\",COUNTIFS(ALLdata!$B:$B,\"Element\",ALLdata!$D:$D,$B15,ALLdata!$G:$G,Y$3))","v":0},null,null,{"$f":"IF(Analysis!K66=\"No\",\"-\",COUNTIFS(ALLdata!$B:$B,\"Element\",ALLdata!$D:$D,$B15,ALLdata!$I:$I,LEFT(AB$3)))","v":0},{"$f":"IF(Analysis!K66=\"No\",\"-\",COUNTIFS(ALLdata!$B:$B,\"Element\",ALLdata!$D:$D,$B15,ALLdata!$I:$I,LEFT(AC$3)))","v":0},{"$f":"IF(Analysis!K66=\"No\",\"-\",COUNTIFS(ALLdata!$B:$B,\"Element\",ALLdata!$D:$D,$B15,ALLdata!$I:$I,LEFT(AD$3)))","v":0}]
["Q-AN5-0","AN 5",{"$f":"VLOOKUP(A16,ALLdata!A:F,6,FALSE)","v":"State agency ensures completeness and accuracy of data."},null,null,null,null,null,null,{"$f":"Analysis!L74","v":0},{"$f":"PROPER(Analysis!N74)","v":""},null,{"$f":"VLOOKUP($A16,ALLdata!$A:$I,8,FALSE)","v":0},{"$f":"VLOOKUP($A16,ALLdata!$A:$I,8,FALSE)","v":0},{"$f":"VLOOKUP($A16,ALLdata!$A:$I,8,FALSE)","v":0},{"$f":"VLOOKUP($A16,ALLdata!$A:$I,8,FALSE)","v":0},{"$f":"VLOOKUP($A16,ALLdata!$A:$I,8,FALSE)","v":0},{"$f":"VLOOKUP($A16,ALLdata!$A:$I,8,FALSE)","v":0},{"$f":"VLOOKUP($A16,ALLdata!$A:$I,8,FALSE)","v":0},{"$f":"COUNTIFS(ALLdata!B:B,\"Element\",ALLdata!D:D,B16)","v":6},null,{"$f":"COUNTIFS(ALLdata!$B:$B,\"Element\",ALLdata!$D:$D,$B16,ALLdata!$G:$G,V$3)","v":0},{"$f":"COUNTIFS(ALLdata!$B:$B,\"Element\",ALLdata!$D:$D,$B16,ALLdata!$G:$G,W$3)","v":0},{"$f":"COUNTIFS(ALLdata!$B:$B,\"Element\",ALLdata!$D:$D,$B16,ALLdata!$G:$G,X$3)","v":0},{"$f":"COUNTIFS(ALLdata!$B:$B,\"Element\",ALLdata!$D:$D,$B16,ALLdata!$G:$G,Y$3)","v":0},null,null,{"$f":"COUNTIFS(ALLdata!$B:$B,\"Element\",ALLdata!$D:$D,$B16,ALLdata!$I:$I,LEFT(AB$3))","v":0},{"$f":"COUNTIFS(ALLdata!$B:$B,\"Element\",ALLdata!$D:$D,$B16,ALLdata!$I:$I,LEFT(AC$3))","v":0},{"$f":"COUNTIFS(ALLdata!$B:$B,\"Element\",ALLdata!$D:$D,$B16,ALLdata!$I:$I,LEFT(AD$3))","v":0}]
[]
[null,"Reporting (REPORT)",null,null,null,null,null,null,null,null,null,null,"QI Rating"]
["Q-RP1-0","RP 1",{"$f":"VLOOKUP(A19,ALLdata!A:F,6,FALSE)","v":"State agency interprets, reports, and communicates information related to family experiences and outcomes."},null,null,null,null,null,null,{"$f":"Reporting!L12","v":0},{"$f":"PROPER(Reporting!N12)","v":""},null,{"$f":"VLOOKUP($A19,ALLdata!$A:$I,8,FALSE)","v":0},{"$f":"VLOOKUP($A19,ALLdata!$A:$I,8,FALSE)","v":0},{"$f":"VLOOKUP($A19,ALLdata!$A:$I,8,FALSE)","v":0},{"$f":"VLOOKUP($A19,ALLdata!$A:$I,8,FALSE)","v":0},{"$f":"VLOOKUP($A19,ALLdata!$A:$I,8,FALSE)","v":0},{"$f":"VLOOKUP($A19,ALLdata!$A:$I,8,FALSE)","v":0},{"$f":"VLOOKUP($A19,ALLdata!$A:$I,8,FALSE)","v":0},{"$f":"COUNTIFS(ALLdata!B:B,\"Element\",ALLdata!D:D,B19)","v":8},null,{"$f":"COUNTIFS(ALLdata!$B:$B,\"Element\",ALLdata!$D:$D,$B19,ALLdata!$G:$G,V$3)","v":0},{"$f":"COUNTIFS(ALLdata!$B:$B,\"Element\",ALLdata!$D:$D,$B19,ALLdata!$G:$G,W$3)","v":0},{"$f":"COUNTIFS(ALLdata!$B:$B,\"Element\",ALLdata!$D:$D,$B19,ALLdata!$G:$G,X$3)","v":0},{"$f":"COUNTIFS(ALLdata!$B:$B,\"Element\",ALLdata!$D:$D,$B19,ALLdata!$G:$G,Y$3)","v":0},null,null,{"$f":"COUNTIFS(ALLdata!$B:$B,\"Element\",ALLdata!$D:$D,$B19,ALLdata!$I:$I,LEFT(AB$3))","v":0},{"$f":"COUNTIFS(ALLdata!$B:$B,\"Element\",ALLdata!$D:$D,$B19,ALLdata!$I:$I,LEFT(AC$3))","v":0},{"$f":"COUNTIFS(ALLdata!$B:$B,\"Element\",ALLdata!$D:$D,$B19,ALLdata!$I:$I,LEFT(AD$3))","v":0}]
["Q-RP2-0","RP 2",{"$f":"VLOOKUP(A20,ALLdata!A:F,6,FALSE)&\"*\"","v":"Local programs interpret, report, and communicate information related to family experiences and outcomes.*"},null,null,null,null,null,null,{"$f":"Reporting!L30","v":0},{"$f":"PROPER(Reporting!N30)","v":""},null,{"$f":"VLOOKUP($A20,ALLdata!$A:$I,8,FALSE)","v":0},{"$f":"VLOOKUP($A20,ALLdata!$A:$I,8,FALSE)","v":0},{"$f":"VLOOKUP($A20,ALLdata!$A:$I,8,FALSE)","v":0},{"$f":"VLOOKUP($A20,ALLdata!$A:$I,8,FALSE)","v":0},{"$f":"VLOOKUP($A20,ALLdata!$A:$I,8,FALSE)","v":0},{"$f":"VLOOKUP($A20,ALLdata!$A:$I,8,FALSE)","v":0},{"$f":"VLOOKUP($A20,ALLdata!$A:$I,8,FALSE)","v":0},{"$f":"IF(Reporting!K31=\"No\",\"N/A\",COUNTIFS(ALLdata!B:B,\"Element\",ALLdata!D:D,B20))","v":6},null,{"$f":"IF(Reporting!K31=\"No\",\"-\",COUNTIFS(ALLdata!$B:$B,\"Element\",ALLdata!$D:$D,$B20,ALLdata!$G:$G,V$3))","v":0},{"$f":"IF(Reporting!K31=\"No\",\"-\",COUNTIFS(ALLdata!$B:$B,\"Element\",ALLdata!$D:$D,$B20,ALLdata!$G:$G,W$3))","v":0},{"$f":"IF(Reporting!K31=\"No\",\"-\",COUNTIFS(ALLdata!$B:$B,\"Element\",ALLdata!$D:$D,$B20,ALLdata!$G:$G,X$3))","v":0},{"$f":"IF(Reporting!K31=\"No\",\"-\",COUNTIFS(ALLdata!$B:$B,\"Element\",ALLdata!$D:$D,$B20,ALLdata!$G:$G,Y$3))","v":0},null,null,{"$f":"IF(Reporting!K31=\"No\",\"-\",COUNTIFS(ALLdata!$B:$B,\"Element\",ALLdata!$D:$D,$B20,ALLdata!$I:$I,LEFT(AB$3)))","v":0},{"$f":"IF(Reporting!K31=\"No\",\"-\",COUNTIFS(ALLdata!$B:$B,\"Element\",ALLdata!$D:$D,$B20,ALLdata!$I:$I,LEFT(AC$3)))","v":0},{"$f":"IF(Reporting!K31=\"No\",\"-\",COUNTIFS(ALLdata!$B:$B,\"Element\",ALLdata!$D:$D,$B20,ALLdata!$I:$I,LEFT(AD$3)))","v":0}]
[]
[null,"Using Data (USE DATA)",null,null,null,null,null,null,null,null,null,null,"QI Rating"]
["Q-UD1-0","UD 1",{"$f":"VLOOKUP(A23,ALLdata!A:F,6,FALSE)","v":"State agency makes regular use of information on family experiences and outcomes to improve programs."},null,null,null,null,null,null,{"$f":"UsingData!L12","v":0},{"$f":"PROPER(UsingData!N12)","v":""},null,{"$f":"VLOOKUP($A23,ALLdata!$A:$I,8,FALSE)","v":0},{"$f":"VLOOKUP($A23,ALLdata!$A:$I,8,FALSE)","v":0},{"$f":"VLOOKUP($A23,ALLdata!$A:$I,8,FALSE)","v":0},{"$f":"VLOOKUP($A23,ALLdata!$A:$I,8,FALSE)","v":0},{"$f":"VLOOKUP($A23,ALLdata!$A:$I,8,FALSE)","v":0},{"$f":"VLOOKUP($A23,ALLdata!$A:$I,8,FALSE)","v":0},{"$f":"VLOOKUP($A23,ALLdata!$A:$I,8,FALSE)","v":0},{"$f":"COUNTIFS(ALLdata!B:B,\"Element\",ALLdata!D:D,B23)","v":7},null,{"$f":"COUNTIFS(ALLdata!$B:$B,\"Element\",ALLdata!$D:$D,$B23,ALLdata!$G:$G,V$3)","v":0},{"$f":"COUNTIFS(ALLdata!$B:$B,\"Element\",ALLdata!$D:$D,$B23,ALLdata!$G:$G,W$3)","v":0},{"$f":"COUNTIFS(ALLdata!$B:$B,\"Element\",ALLdata!$D:$D,$B23,ALLdata!$G:$G,X$3)","v":0},{"$f":"COUNTIFS(ALLdata!$B:$B,\"Element\",ALLdata!$D:$D,$B23,ALLdata!$G:$G,Y$3)","v":0},null,null,{"$f":"COUNTIFS(ALLdata!$B:$B,\"Element\",ALLdata!$D:$D,$B23,ALLdata!$I:$I,LEFT(AB$3))","v":0},{"$f":"COUNTIFS(ALLdata!$B:$B,\"Element\",ALLdata!$D:$D,$B23,ALLdata!$I:$I,LEFT(AC$3))","v":0},{"$f":"COUNTIFS(ALLdata!$B:$B,\"Element\",ALLdata!$D:$D,$B23,ALLdata!$I:$I,LEFT(AD$3))","v":0}]
["Q-UD2-0","UD 2",{"$f":"VLOOKUP(A24,ALLdata!A:F,6,FALSE)&\"*\"","v":"Local programs make regular use of information on family experiences and outcomes to improve programs.*"},null,null,null,null,null,null,{"$f":"UsingData!L28","v":0},{"$f":"PROPER(UsingData!N28)","v":""},null,{"$f":"VLOOKUP($A24,ALLdata!$A:$I,8,FALSE)","v":0},{"$f":"VLOOKUP($A24,ALLdata!$A:$I,8,FALSE)","v":0},{"$f":"VLOOKUP($A24,ALLdata!$A:$I,8,FALSE)","v":0},{"$f":"VLOOKUP($A24,ALLdata!$A:$I,8,FALSE)","v":0},{"$f":"VLOOKUP($A24,ALLdata!$A:$I,8,FALSE)","v":0},{"$f":"VLOOKUP($A24,ALLdata!$A:$I,8,FALSE)","v":0},{"$f":"VLOOKUP($A24,ALLdata!$A:$I,8,FALSE)","v":0},{"$f":"IF(UsingData!K29=\"No\",\"N/A\",COUNTIFS(ALLdata!B:B,\"Element\",ALLdata!D:D,B24))","v":3},null,{"$f":"IF(UsingData!K29=\"No\",\"-\",COUNTIFS(ALLdata!$B:$B,\"Element\",ALLdata!$D:$D,$B24,ALLdata!$G:$G,V$3))","v":0},{"$f":"IF(UsingData!K29=\"No\",\"-\",COUNTIFS(ALLdata!$B:$B,\"Element\",ALLdata!$D:$D,$B24,ALLdata!$G:$G,W$3))","v":0},{"$f":"IF(UsingData!K29=\"No\",\"-\",COUNTIFS(ALLdata!$B:$B,\"Element\",ALLdata!$D:$D,$B24,ALLdata!$G:$G,X$3))","v":0},{"$f":"IF(UsingData!K29=\"No\",\"-\",COUNTIFS(ALLdata!$B:$B,\"Element\",ALLdata!$D:$D,$B24,ALLdata!$G:$G,Y$3))","v":0},null,null,{"$f":"IF(UsingData!K29=\"No\",\"-\",COUNTIFS(ALLdata!$B:$B,\"Element\",ALLdata!$D:$D,$B24,ALLdata!$I:$I,LEFT(AB$3)))","v":0},{"$f":"IF(UsingData!K29=\"No\",\"-\",COUNTIFS(ALLdata!$B:$B,\"Element\",ALLdata!$D:$D,$B24,ALLdata!$I:$I,LEFT(AC$3)))","v":0},{"$f":"IF(UsingData!K29=\"No\",\"-\",COUNTIFS(ALLdata!$B:$B,\"Element\",ALLdata!$D:$D,$B24,ALLdata!$I:$I,LEFT(AD$3)))","v":0}]
[]
[null,"Evaluation (EVAL)",null,null,null,null,null,null,null,null,null,null,"QI Rating"]
["Q-EV1-0","EV 1",{"$f":"VLOOKUP(A27,ALLdata!A:F,6,FALSE)","v":"State evaluates its family experiences and outcomes measurement system regularly."},null,null,null,null,null,null,{"$f":"Evaluation!L12","v":0},{"$f":"PROPER(Evaluation!N12)","v":""},null,{"$f":"VLOOKUP($A27,ALLdata!$A:$I,8,FALSE)","v":0},{"$f":"VLOOKUP($A27,ALLdata!$A:$I,8,FALSE)","v":0},{"$f":"VLOOKUP($A27,ALLdata!$A:$I,8,FALSE)","v":0},{"$f":"VLOOKUP($A27,ALLdata!$A:$I,8,FALSE)","v":0},{"$f":"VLOOKUP($A27,ALLdata!$A:$I,8,FALSE)","v":0},{"$f":"VLOOKUP($A27,ALLdata!$A:$I,8,FALSE)","v":0},{"$f":"VLOOKUP($A27,ALLdata!$A:$I,8,FALSE)","v":0},{"$f":"COUNTIFS(ALLdata!B:B,\"Element\",ALLdata!D:D,B27)","v":3},null,{"$f":"COUNTIFS(ALLdata!$B:$B,\"Element\",ALLdata!$D:$D,$B27,ALLdata!$G:$G,V$3)","v":0},{"$f":"COUNTIFS(ALLdata!$B:$B,\"Element\",ALLdata!$D:$D,$B27,ALLdata!$G:$G,W$3)","v":0},{"$f":"COUNTIFS(ALLdata!$B:$B,\"Element\",ALLdata!$D:$D,$B27,ALLdata!$G:$G,X$3)","v":0},{"$f":"COUNTIFS(ALLdata!$B:$B,\"Element\",ALLdata!$D:$D,$B27,ALLdata!$G:$G,Y$3)","v":0},null,null,{"$f":"COUNTIFS(ALLdata!$B:$B,\"Element\",ALLdata!$D:$D,$B27,ALLdata!$I:$I,LEFT(AB$3))","v":0},{"$f":"COUNTIFS(ALLdata!$B:$B,\"Element\",ALLdata!$D:$D,$B27,ALLdata!$I:$I,LEFT(AC$3))","v":0},{"$f":"COUNTIFS(ALLdata!$B:$B,\"Element\",ALLdata!$D:$D,$B27,ALLdata!$I:$I,LEFT(AD$3))","v":0}]
[]
[null,"Cross-system Coordination (CROSS SYS)",null,null,null,null,null,null,null,null,null,null,"QI Rating"]
["Q-CC1-0","CC 1",{"$f":"VLOOKUP(A30,ALLdata!A:F,6,FALSE)","v":"Part C and Part B 619 coordinate family experiences and outcomes measurement."},null,null,null,null,null,null,{"$f":"CrossSystem!L12","v":0},{"$f":"PROPER(CrossSystem!N12)","v":""},null,{"$f":"VLOOKUP($A30,ALLdata!$A:$I,8,FALSE)","v":0},{"$f":"VLOOKUP($A30,ALLdata!$A:$I,8,FALSE)","v":0},{"$f":"VLOOKUP($A30,ALLdata!$A:$I,8,FALSE)","v":0},{"$f":"VLOOKUP($A30,ALLdata!$A:$I,8,FALSE)","v":0},{"$f":"VLOOKUP($A30,ALLdata!$A:$I,8,FALSE)","v":0},{"$f":"VLOOKUP($A30,ALLdata!$A:$I,8,FALSE)","v":0},{"$f":"VLOOKUP($A30,ALLdata!$A:$I,8,FALSE)","v":0},{"$f":"COUNTIFS(ALLdata!B:B,\"Element\",ALLdata!D:D,B30)","v":3},null,{"$f":"COUNTIFS(ALLdata!$B:$B,\"Element\",ALLdata!$D:$D,$B30,ALLdata!$G:$G,V$3)","v":0},{"$f":"COUNTIFS(ALLdata!$B:$B,\"Element\",ALLdata!$D:$D,$B30,ALLdata!$G:$G,W$3)","v":0},{"$f":"COUNTIFS(ALLdata!$B:$B,\"Element\",ALLdata!$D:$D,$B30,ALLdata!$G:$G,X$3)","v":0},{"$f":"COUNTIFS(ALLdata!$B:$B,\"Element\",ALLdata!$D:$D,$B30,ALLdata!$G:$G,Y$3)","v":0},null,null,{"$f":"COUNTIFS(ALLdata!$B:$B,\"Element\",ALLdata!$D:$D,$B30,ALLdata!$I:$I,LEFT(AB$3))","v":0},{"$f":"COUNTIFS(ALLdata!$B:$B,\"Element\",ALLdata!$D:$D,$B30,ALLdata!$I:$I,LEFT(AC$3))","v":0},{"$f":"COUNTIFS(ALLdata!$B:$B,\"Element\",ALLdata!$D:$D,$B30,ALLdata!$I:$I,LEFT(AD$3))","v":0}]
["Q-CC2-0","CC 2",{"$f":"VLOOKUP(A31,ALLdata!A:F,6,FALSE)","v":"Family experiences and outcomes measurement is integrated across early childhood (EC) programs statewide."},null,null,null,null,null,null,{"$f":"CrossSystem!L20","v":0},{"$f":"PROPER(CrossSystem!N20)","v":""},null,{"$f":"VLOOKUP($A31,ALLdata!$A:$I,8,FALSE)","v":0},{"$f":"VLOOKUP($A31,ALLdata!$A:$I,8,FALSE)","v":0},{"$f":"VLOOKUP($A31,ALLdata!$A:$I,8,FALSE)","v":0},{"$f":"VLOOKUP($A31,ALLdata!$A:$I,8,FALSE)","v":0},{"$f":"VLOOKUP($A31,ALLdata!$A:$I,8,FALSE)","v":0},{"$f":"VLOOKUP($A31,ALLdata!$A:$I,8,FALSE)","v":0},{"$f":"VLOOKUP($A31,ALLdata!$A:$I,8,FALSE)","v":0},{"$f":"COUNTIFS(ALLdata!B:B,\"Element\",ALLdata!D:D,B31)","v":5},null,{"$f":"COUNTIFS(ALLdata!$B:$B,\"Element\",ALLdata!$D:$D,$B31,ALLdata!$G:$G,V$3)","v":0},{"$f":"COUNTIFS(ALLdata!$B:$B,\"Element\",ALLdata!$D:$D,$B31,ALLdata!$G:$G,W$3)","v":0},{"$f":"COUNTIFS(ALLdata!$B:$B,\"Element\",ALLdata!$D:$D,$B31,ALLdata!$G:$G,X$3)","v":0},{"$f":"COUNTIFS(ALLdata!$B:$B,\"Element\",ALLdata!$D:$D,$B31,ALLdata!$G:$G,Y$3)","v":0},null,null,{"$f":"COUNTIFS(ALLdata!$B:$B,\"Element\",ALLdata!$D:$D,$B31,ALLdata!$I:$I,LEFT(AB$3))","v":0},{"$f":"COUNTIFS(ALLdata!$B:$B,\"Element\",ALLdata!$D:$D,$B31,ALLdata!$I:$I,LEFT(AC$3))","v":0},{"$f":"COUNTIFS(ALLdata!$B:$B,\"Element\",ALLdata!$D:$D,$B31,ALLdata!$I:$I,LEFT(AD$3))","v":0}]
[]
[null,null,"* Question where state declares there is/is not a process to measure this quality indicator."]

{"sheet":"Data","index":11,"n_rows":114,"n_cols":14,"rows_kept":114,"cut":false,"hidden":false,"merged":[]}
["Index","Type","Component","QINumber","ElementNumber","Text","Rating","Priority","Date","Count_Expected","Count_Actual",null,null,"2018-01-30T17:20:23.270"]
["Q-PR1-0","QualityIndicator","Purpose","PR 1","-","State has articulated the purposes(s) of the family experiences and outcomes measurement system.","-","-","-",6,0]
["Q-DC1-0","QualityIndicator","DataCollection","DC 1","-","Data collection procedures are carried out efficiently and effectively.","-","-","-",16,0]
["Q-DC2-0","QualityIndicator","DataCollection","DC 2","-","State’s method for entering, transmitting, and storing data is effective and efficient.","-","-","-",8,0]
["Q-AN1-0","QualityIndicator","Analysis","AN 1","-","State identifies accountability and program improvement questions related to family experiences and outcomes.","-","-","-",9,0]
["Q-AN2-0","QualityIndicator","Analysis","AN 2","-","Local programs identify accountability and program improvement questions related to family experiences and outcomes.","-","-","-",7,0]
["Q-AN3-0","QualityIndicator","Analysis","AN 3","-","State agency analyzes data in a timely manner.","-","-","-",7,0]
["Q-AN4-0","QualityIndicator","Analysis","AN 4","-","Local programs analyze data in a timely manner.","-","-","-",3,0]
["Q-AN5-0","QualityIndicator","Analysis","AN 5","-","State agency ensures completeness and accuracy of data.","-","-","-",6,0]
["Q-RP1-0","QualityIndicator","Reporting","RP 1","-","State agency interprets, reports, and communicates information related to family experiences and outcomes.","-","-","-",8,0]
["Q-RP2-0","QualityIndicator","Reporting","RP 2","-","Local programs interpret, report, and communicate information related to family experiences and outcomes.","-","-","-",6,0]
["Q-UD1-0","QualityIndicator","UsingData","UD 1","-","State agency makes regular use of information on family experiences and outcomes to improve programs.","-","-","-",7,0]
["Q-UD2-0","QualityIndicator","UsingData","UD 2","-","Local programs make regular use of information on family experiences and outcomes to improve programs.","-","-","-",3,0]
["Q-EV1-0","QualityIndicator","Evaluation","EV 1","-","State evaluates its family experiences and outcomes measurement system regularly.","-","-","-",3,0]
["Q-CC1-0","QualityIndicator","CrossSystem","CC 1","-","Part C and Part B 619 coordinate family experiences and outcomes measurement.","-","-","-",3,0]
["Q-CC2-0","QualityIndicator","CrossSystem","CC 2","-","Family experiences and outcomes measurement is integrated across early childhood (EC) programs statewide.","-","-","-",5,0]
[]
["E-PR1-a","Element","Purpose","PR 1","a","Stakeholders are involved in development of the purposes.","-","-","-"]
["E-PR1-b","Element","Purpose","PR 1","b","Written statement addresses why data are being collected and how data will be used. Statement specifies who will use the data and for what purposes.","-","-","-"]
["E-PR1-c","Element","Purpose","PR 1","c","Statement is easily accessible to local administrators, providers, families, and the general public.","-","-","-"]
["E-PR1-d","Element","Purpose","PR 1","d","Families receiving services are fully informed of the purposes for collecting data on family experiences and outcomes.","-","-","-"]
["E-PR1-e","Element","Purpose","PR 1","e","Purposes include meeting reporting requirements and providing ongoing information for data-based decision-making for program improvement.","-","-","-"]
["E-PR1-f","Element","Purpose","PR 1","f","Purpose includes examining multiple aspects of families’ experiences with the program and their outcomes (e.g., helpfulness of early intervention, family outcomes, family-centered services).","-","-","-"]
["E-DC1-a","Element","DataCollection","DC 1","a","Data collection methods are aligned with the purpose(s) the state wants to address. (Methods refer to multiple aspects of the data collection, such as how the data are collected, from whom, when, how often, etc.)","-","-","-"]
["E-DC1-b","Element","DataCollection","DC 1","b","Stakeholders are involved in deciding on the data collection methods.","-","-","-"]
["E-DC1-c","Element","DataCollection","DC 1","c","State has comprehensive written policies and procedures describing the data collection and transmission approach.","-","-","-"]
["E-DC1-d","Element","DataCollection","DC 1","d","Policies and procedures are clear and readily accessible.","-","-","-"]
["E-DC1-e","Element","DataCollection","DC 1","e","Procedures are revised as necessary based on needs of local or state agency; systematic process exists for communicating changes in timely manner.","-","-","-"]
["E-DC1-f","Element","DataCollection","DC 1","f","Families are fully informed about data collection procedures (e.g., when surveys are available, how to return them).","-","-","-"]
["E-DC1-g","Element","DataCollection","DC 1","g","Data collection procedures have the capability to produce valid and reliable data.","-","-","-"]
["E-DC1-h","Element","DataCollection","DC 1","h","Processes are available to facilitate efficient and complete data collection.","-","-","-"]
["E-DC1-i","Element","DataCollection","DC 1","i","State has evidence that the data collection procedures are being implemented with high fidelity (e.g., state has local supervisors overseeing the data collection process or state has documentation that a vendor has mailed surveys to families).","-","-","-"]
["E-DC1-j","Element","DataCollection","DC 1","j","Data collection procedures are institutionalized; implementation remains stable through staff changes or changes in a vendor.","-","-","-"]
["E-DC1-k","Element","DataCollection","DC 1","k","Ongoing support and technical assistance for data collection issues are readily available; problems are addressed in a timely fashion. This includes support for families who are completing the survey and program staff who may be involved in the data collection.","-","-","-"]
["E-DC1-l","Element","DataCollection","DC 1","l","If state is sampling, sampling procedures produce a representative sample of sufficient size. (Select “Not applicable” if not sampling.)","-","-","-"]
["E-DC1-m","Element","DataCollection","DC 1","m","State has procedures to encourage all groups to participate in the data collection process (i.e., to ensure an adequate response rate).","-","-","-"]
["E-DC1-n","Element","DataCollection","DC 1","n","Procedures make it possible for all families to participate in the data collection, including those with low literacy levels and non-English speakers.","-","-","-"]
["E-DC1-o","Element","DataCollection","DC 1","o","If state is conducting multiple data collections with families (e.g., two different surveys), state has coordinated these data collections through an overall plan. (Select “Not applicable” if there are not multiple data collections with families.)","-","-","-"]
["E-DC1-p","Element","DataCollection","DC 1","p","Program staff are fully informed about the nature and the purpose of the data collection, including service providers or others who regularly have contact with families.","-","-","-"]
["E-DC2-a","Element","DataCollection","DC 2","a","Data on family experiences and outcomes are entered efficiently and accurately.","-","-","-"]
["E-DC2-b","Element","DataCollection","DC 2","b","Systematic checks on data entry are in place.","-","-","-"]
["E-DC2-c","Element","DataCollection","DC 2","c","Those entering and transmitting data have access to necessary hardware and software and know how to use them (e.g., scanning equipment is working properly).","-","-","-"]
["E-DC2-d","Element","DataCollection","DC 2","d","Technology support is effective.","-","-","-"]
["E-DC2-e","Element","DataCollection","DC 2","e","Procedures are in place to update the data system as needed and communicate changes to the users.","-","-","-"]
["E-DC2-f","Element","DataCollection","DC 2","f","Those handling data understand and protect confidentiality.","-","-","-"]
["E-DC2-g","Element","DataCollection","DC 2","g","Data system protects confidential information.","-","-","-"]
["E-DC2-h","Element","DataCollection","DC 2","h","Protocols for archiving data are in place.","-","-","-"]
["E-AN1-a","Element","Analysis","AN 1","a","State has a written set of publicly available accountability and program improvement questions related to family experiences and outcomes.","-","-","-"]
["E-AN1-b","Element","Analysis","AN 1","b","The questions were developed with broad stakeholder input, including that of families.","-","-","-"]
["E-AN1-c","Element","Analysis","AN 1","c","The questions are consistent with the purposes of the state’s family experiences and outcomes measurement system.","-","-","-"]
["E-AN1-d","Element","Analysis","AN 1","d","The questions address family outcomes and family’s experiences with service delivery.","-","-","-"]
["E-AN1-e","Element","Analysis","AN 1","e","The questions address how family experiences and outcomes relate to child, family, service, and system characteristics. These questions require the family survey be linked to a child identifier.","-","-","-"]
["E-AN1-f","Element","Analysis","AN 1","f","Answers to the questions will provide useful information for accountability and program improvement.","-","-","-"]
["E-AN1-g","Element","Analysis","AN 1","g","A process is in place for regularly reviewing and revising the questions.","-","-","-"]
["E-AN1-h","Element","Analysis","AN 1","h","State has policy or guidance that addresses local program responsibilities with regard to the development of accountability and program improvement questions.","-","-","-"]
["E-AN1-i","Element","Analysis","AN 1","i","State helps build the capacity of local programs to develop accountability and program improvement questions.","-","-","-"]
["E-AN2-a","Element","Analysis","AN 2","a","Local programs have a written set of publicly available accountability and program improvement questions related to family experiences and outcomes.","-","-","-"]
["E-AN2-b","Element","Analysis","AN 2","b","The questions were developed with broad stakeholder input, including families.","-","-","-"]
["E-AN2-c","Element","Analysis","AN 2","c","The questions are aligned with the vision and purposes of the state’s outcomes measurement system.","-","-","-"]
["E-AN2-d","Element","Analysis","AN 2","d","The questions address family outcomes and family experiences with service delivery.","-","-","-"]
["E-AN2-e","Element","Analysis","AN 2","e","The questions address how outcomes relate to child, family, and service characteristics. These questions require the family survey be linked to a child identifier.","-","-","-"]
["E-AN2-f","Element","Analysis","AN 2","f","Answers to the questions will provide useful information for accountability and program improvement.","-","-","-"]
["E-AN2-g","Element","Analysis","AN 2","g","A process is in place for regularly reviewing and revising the questions.","-","-","-"]
["E-AN3-a","Element","Analysis","AN 3","a","State has sufficient resources to conduct data analyses in a timely and accurate manner.","-","-","-"]
["E-AN3-b","Element","Analysis","AN 3","b","State can access all data elements necessary to address state level questions.","-","-","-"]
["E-AN3-c","Element","Analysis","AN 3","c","State conducts analyses to address accountability and program improvement questions at least annually.","-","-","-"]
["E-AN3-d","Element","Analysis","AN 3","d","State conducts additional ad hoc analyses as needed.","-","-","-"]
["E-AN3-e","Element","Analysis","AN 3","e","State thoroughly documents analyses so that a new analyst could repeat the analyses and find the same results.","-","-","-"]
["E-AN3-f","Element","Analysis","AN 3","f","State provides support to local programs to build capacity to analyze local data. Support can include the state agency providing analyzed data to the local program.","-","-","-"]
["E-AN3-g","Element","Analysis","AN 3","g","State has policy or guidance that addresses local program responsibilities with regard to data analysis.","-","-","-"]
["E-AN4-a","Element","Analysis","AN 4","a","With appropriate safeguards (i.e., de-identified family experiences or outcomes data), local programs have access to the data elements necessary to address local accountability and program improvement questions.","-","-","-"]
["E-AN4-b","Element","Analysis","AN 4","b","Local programs conduct analyses or work with another entity to conduct analyses in a timely and accurate manner.  ","-","-","-"]
["E-AN4-c","Element","Analysis","AN 4","c","Local programs thoroughly document the analyses so that a new analyst could repeat the analyses and find the same results.","-","-","-"]
["E-AN5-a","Element","Analysis","AN 5","a","State implements a process for checking the completeness and accuracy of the data.","-","-","-"]
["E-AN5-b","Element","Analysis","AN 5","b","The results of the process provide evidence that the data are high quality for the intended purposes.","-","-","-"]
["E-AN5-c","Element","Analysis","AN 5","c","State regularly tracks missing and incomplete data and has implemented a plan for reducing missing and incomplete data.","-","-","-"]
["E-AN5-d","Element","Analysis","AN 5","d","The state’s survey response rate is sufficient to provide valid generalization to the target population.","-","-","-"]
["E-AN5-e","Element","Analysis","AN 5","e","The data are representative at the state level.","-","-","-"]
["E-AN5-f","Element","Analysis","AN 5","f","The data are representative at the local program-level.","-","-","-"]
["E-RP1-a","Element","Reporting","RP 1","a","State has developed a comprehensive plan for interpreting, reporting, and communicating evidence related to family experiences and outcomes to relevant audiences, including families.","-","-","-"]
["E-RP1-b","Element","Reporting","RP 1","b","State has procedures in place to address confidentiality issues raised by analyses that produce cells with small numbers.","-","-","-"]
["E-RP1-c","Element","Reporting","RP 1","c","State agency conducts systematic and comprehensive review of analyses including consideration of possible interpretations about family experiences and outcomes and the relationships between these and child, family, service, and system characteristics.","-","-","-"]
["E-RP1-d","Element","Reporting","RP 1","d","Representative stakeholders are included in the process of review and interpretation. Interpretation reflects stakeholder input.","-","-","-"]
["E-RP1-e","Element","Reporting","RP 1","e","State agency leadership is knowledgeable about family experiences and outcomes and can explain the results to relevant audiences.","-","-","-"]
["E-RP1-f","Element","Reporting","RP 1","f","State communicates results to target audiences for intended purposes in appropriate formats.","-","-","-"]
["E-RP1-g","Element","Reporting","RP 1","g","State provides support to local programs related to interpreting and reporting family experiences and outcomes data.","-","-","-"]
["E-RP1-h","Element","Reporting","RP 1","h","State has policy or guidance that addresses local program responsibilities with regard to interpreting and sharing family experiences and outcomes data.","-","-","-"]
["E-RP2-a","Element","Reporting","RP 2","a","Local programs interpret, report, and communicate information related to family experiences and outcomes in a manner appropriate to the size of the program.","-","-","-"]
["E-RP2-b","Element","Reporting","RP 2","b","Local programs have procedures in place to address confidentiality issues raised by analyses that produce cells with small numbers.","-","-","-"]
["E-RP2-c","Element","Reporting","RP 2","c","Local programs conduct a systematic and comprehensive review of analyses including consideration of possible interpretations about family experiences and outcomes and the relationships between these and child, family, service, and system characteristics per the program’s questions.","-","-","-"]
["E-RP2-d","Element","Reporting","RP 2","d","Local programs include representative stakeholders in the process of developing interpretations of the data. Interpretations reflect stakeholder input.","-","-","-"]
["E-RP2-e","Element","Reporting","RP 2","e","Local program staff are knowledgeable about family experiences and outcomes and can explain family experiences and outcomes results to relevant audiences.","-","-","-"]
["E-RP2-f","Element","Reporting","RP 2","f","Local programs communicate results to target audiences for intended purposes in appropriate formats.","-","-","-"]
["E-UD1-a","Element","UsingData","UD 1","a","State regularly implements a stakeholder process that includes families to consider the implications of family experiences and outcomes and other data.","-","-","-"]
["E-UD1-b","Element","UsingData","UD 1","b","As appropriate, state identifies some local programs for targeted support and then works with these programs to jointly develop action plans.","-","-","-"]
["E-UD1-c","Element","UsingData","UD 1","c","State identifies statewide systemic goals for improvement.","-","-","-"]
["E-UD1-d","Element","UsingData","UD 1","d","State uses data to develop a comprehensive plan for program improvement.","-","-","-"]
["E-UD1-e","Element","UsingData","UD 1","e","State implements and evaluates program improvement activities on a regular cycle.","-","-","-"]
["E-UD1-f","Element","UsingData","UD 1","f","State provides data and support to local programs related to use of data for program improvement.","-","-","-"]
["E-UD1-g","Element","UsingData","UD 1","g","State has policy or guidance that addresses local program responsibilities with regard to use of data for program improvement.","-","-","-"]
["E-UD2-a","Element","UsingData","UD 2","a","Local programs regularly implement a stakeholder process that includes families for considering the implications of family experiences and outcomes data and other data.","-","-","-"]
["E-UD2-b","Element","UsingData","UD 2","b","Local programs use data to develop a comprehensive plan for program improvement.","-","-","-"]
["E-UD2-c","Element","UsingData","UD 2","c","Local programs implement and evaluate program improvement activities on a regular cycle.","-","-","-"]
["E-EV1-a","Element","Evaluation","EV 1","a","State regularly develops/updates an evaluation plan addressing whether the individual components of the family experiences and outcomes measurement system are being implemented as planned/with fidelity, each component is producing its intended result(s), and the outcomes system as a whole is accomplishing its intended purpose(s).","-","-","-"]
["E-EV1-b","Element","Evaluation","EV 1","b","State implements its evaluation strategies according to plan.","-","-","-"]
["E-EV1-c","Element","Evaluation","EV 1","c","State regularly uses evaluation results to improve the measurement system components, to improve the effectiveness of the measurement system, and to revise the evaluation plan.","-","-","-"]
["E-CC1-a","Element","CrossSystem","CC 1","a","Part C and Part B 619 programs use a coordinated approach for measuring family experiences and outcomes so that a common core of data is available to improve programs.","-","-","-"]
["E-CC1-b","Element","CrossSystem","CC 1","b","Part C and Part B 619 programs routinely coordinate family experiences and outcomes data analysis and reporting.","-","-","-"]
["E-CC1-c","Element","CrossSystem","CC 1","c","Part C and Part B 619 state and local programs work together to use the family data to assure that families uniformly experience quality programs and benefit from services across the early childhood years.","-","-","-"]
["E-CC2-a","Element","CrossSystem","CC 2","a","EC programs use a coordinated data collection approach for measuring family experiences and outcomes to minimize the need for families to complete multiple surveys and so that a common core of data is available to improve programs.","-","-","-"]
["E-CC2-b","Element","CrossSystem","CC 2","b","EC programs use common data standards so that data can be linked across programs.","-","-","-"]
["E-CC2-c","Element","CrossSystem","CC 2","c","EC programs routinely coordinate family experiences and outcomes data analysis and reporting.","-","-","-"]
["E-CC2-d","Element","CrossSystem","CC 2","d","With appropriate safeguards, stakeholders have access to a common core of de-identified data to allow a coordinated examination of issues related to family experiences and outcomes over time and across programs.","-","-","-"]
["E-CC2-e","Element","CrossSystem","CC 2","e","EC state and local early childhood programs work together to use the family data to assure that families uniformly experience quality programs and benefit from them.","-","-","-"]

{"sheet":"ALLdata","index":12,"n_rows":114,"n_cols":19,"rows_kept":114,"cut":false,"hidden":true,"merged":[]}
["Index","Type","Component","QINumber","ElementNumber","Text","ElementRating","QIRating","Priority","Date","Count_Expected","Count_Actual",1,2,3,4,"Not Applicable","RatingToLookup"]
[{"$f":"LEFT(B2,1)&\"-\"&\"PR1-\"&E2","v":"Q-PR1-0"},"QualityIndicator","Purpose","PR 1",0,"State has articulated the purposes(s) of the family experiences and outcomes measurement system.","-",{"$f":"IF(K2=L2,VLOOKUP(R2,QIRatingLookup!A:B,2,FALSE),0)","v":0},{"$f":"IFERROR(IFERROR(IFERROR(IFERROR(IFERROR(IFERROR(VLOOKUP($A2,Purpose!$B:$N,13,FALSE),VLOOKUP($A2,DataCollection!$B:$N,13,FALSE)),VLOOKUP($A2,Analysis!$B:$N,13,FALSE)),VLOOKUP($A2,Reporting!$B:$N,13,FALSE)),VLOOKUP($A2,UsingData!$B:$N,13,FALSE)),VLOOKUP($A2,Evaluation!$B:$N,13,FALSE)),VLOOKUP($A2,CrossSystem!$B:$N,13,FALSE))","v":0},{"$f":"IF(Participants!$D$12=\"\",\"-\",Participants!$D$12)","v":"-"},{"$f":"COUNTIFS($B:$B,\"Element\",$D:$D,$D2)","v":6},{"$f":"VALUE(M2)+VALUE(N2)+VALUE(O2)+VALUE(P2)+VALUE(Q2)","v":0},{"$f":"IF(LEN(COUNTIFS($D:$D,$D2,$G:$G,M$1,$B:$B,\"Element\"))=1,\"0\",\"\")&COUNTIFS($D:$D,$D2,$G:$G,M$1,$B:$B,\"Element\")","v":"00"},"00","00","00",null,{"$f":"M2&\"-\"&N2&\"-\"&O2&\"-\"&P2","v":"00-00-00-00"}]
[{"$f":"LEFT(B3,1)&\"-\"&\"DC1-\"&E3","v":"Q-DC1-0"},"QualityIndicator","DataCollection","DC 1",0,"Data collection procedures are carried out efficiently and effectively.","-",{"$f":"IF(K3=L3,VLOOKUP(R3,QIRatingLookup!A:B,2,FALSE),0)","v":0},{"$f":"IFERROR(IFERROR(IFERROR(IFERROR(IFERROR(IFERROR(VLOOKUP($A3,Purpose!$B:$N,13,FALSE),VLOOKUP($A3,DataCollection!$B:$N,13,FALSE)),VLOOKUP($A3,Analysis!$B:$N,13,FALSE)),VLOOKUP($A3,Reporting!$B:$N,13,FALSE)),VLOOKUP($A3,UsingData!$B:$N,13,FALSE)),VLOOKUP($A3,Evaluation!$B:$N,13,FALSE)),VLOOKUP($A3,CrossSystem!$B:$N,13,FALSE))","v":0},{"$f":"IF(Participants!$E$12=\"\",\"-\",Participants!$E$12)","v":"-"},16,{"$f":"VALUE(M3)+VALUE(N3)+VALUE(O3)+VALUE(P3)+VALUE(Q3)","v":0},"00","00","00","00",{"$f":"IF(LEN(COUNTIFS($D:$D,$D3,$G:$G,Q$1,$B:$B,\"Element\"))=1,\"0\",\"\")&COUNTIFS($D:$D,$D3,$G:$G,Q$1,$B:$B,\"Element\")","v":"00"},"00-00-00-00"]
[{"$f":"LEFT(B4,1)&\"-\"&\"DC2-\"&E4","v":"Q-DC2-0"},"QualityIndicator","DataCollection","DC 2",0,"State’s method for entering, transmitting, and storing data is effective and efficient.","-",{"$f":"IF(K4=L4,VLOOKUP(R4,QIRatingLookup!A:B,2,FALSE),0)","v":0},{"$f":"IFERROR(IFERROR(IFERROR(IFERROR(IFERROR(IFERROR(VLOOKUP($A4,Purpose!$B:$N,13,FALSE),VLOOKUP($A4,DataCollection!$B:$N,13,FALSE)),VLOOKUP($A4,Analysis!$B:$N,13,FALSE)),VLOOKUP($A4,Reporting!$B:$N,13,FALSE)),VLOOKUP($A4,UsingData!$B:$N,13,FALSE)),VLOOKUP($A4,Evaluation!$B:$N,13,FALSE)),VLOOKUP($A4,CrossSystem!$B:$N,13,FALSE))","v":0},{"$f":"IF(Participants!$E$12=\"\",\"-\",Participants!$E$12)","v":"-"},8,0,"00","00","00","00",null,"00-00-00-00"]
[{"$f":"LEFT(B5,1)&\"-\"&\"AN1-\"&E5","v":"Q-AN1-0"},"QualityIndicator","Analysis","AN 1",0,"State identifies accountability and program improvement questions related to family experiences and outcomes.","-",{"$f":"IF(K5=L5,VLOOKUP(R5,QIRatingLookup!A:B,2,FALSE),0)","v":0},{"$f":"IFERROR(IFERROR(IFERROR(IFERROR(IFERROR(IFERROR(VLOOKUP($A5,Purpose!$B:$N,13,FALSE),VLOOKUP($A5,DataCollection!$B:$N,13,FALSE)),VLOOKUP($A5,Analysis!$B:$N,13,FALSE)),VLOOKUP($A5,Reporting!$B:$N,13,FALSE)),VLOOKUP($A5,UsingData!$B:$N,13,FALSE)),VLOOKUP($A5,Evaluation!$B:$N,13,FALSE)),VLOOKUP($A5,CrossSystem!$B:$N,13,FALSE))","v":0},{"$f":"IF(Participants!$F$12=\"\",\"-\",Participants!$F$12)","v":"-"},9,0,"00","00","00","00",null,"00-00-00-00"]
[{"$f":"LEFT(B6,1)&\"-\"&\"AN2-\"&E6","v":"Q-AN2-0"},"QualityIndicator","Analysis","AN 2",0,"Local programs identify accountability and program improvement questions related to family experiences and outcomes.","-",{"$f":"IF(Analysis!K33=\"No\",1,IF(K6=L6,VLOOKUP(R6,QIRatingLookup!A:B,2,FALSE),0))","v":0},{"$f":"IFERROR(IFERROR(IFERROR(IFERROR(IFERROR(IFERROR(VLOOKUP($A6,Purpose!$B:$N,13,FALSE),VLOOKUP($A6,DataCollection!$B:$N,13,FALSE)),VLOOKUP($A6,Analysis!$B:$N,13,FALSE)),VLOOKUP($A6,Reporting!$B:$N,13,FALSE)),VLOOKUP($A6,UsingData!$B:$N,13,FALSE)),VLOOKUP($A6,Evaluation!$B:$N,13,FALSE)),VLOOKUP($A6,CrossSystem!$B:$N,13,FALSE))","v":0},{"$f":"IF(Participants!$F$12=\"\",\"-\",Participants!$F$12)","v":"-"},7,{"$f":"IF(Analysis!K33=\"No\",\"N/A\",VALUE(M6)+VALUE(N6)+VALUE(O6)+VALUE(P6)+VALUE(Q6))","v":0},{"$f":"IF(Analysis!K33=\"No\",\"01\",IF(LEN(COUNTIFS($D:$D,$D6,$G:$G,M$1,$B:$B,\"Element\"))=1,\"0\",\"\")&COUNTIFS($D:$D,$D6,$G:$G,M$1,$B:$B,\"Element\"))","v":"00"},{"$f":"IF(Analysis!K33=\"No\",\"00\",IF(LEN(COUNTIFS($D:$D,$D6,$G:$G,N$1,$B:$B,\"Element\"))=1,\"0\",\"\")&COUNTIFS($D:$D,$D6,$G:$G,N$1,$B:$B,\"Element\"))","v":"00"},{"$f":"IF(Analysis!K33=\"No\",\"00\",IF(LEN(COUNTIFS($D:$D,$D6,$G:$G,O$1,$B:$B,\"Element\"))=1,\"0\",\"\")&COUNTIFS($D:$D,$D6,$G:$G,O$1,$B:$B,\"Element\"))","v":"00"},{"$f":"IF(Analysis!K33=\"No\",\"00\",IF(LEN(COUNTIFS($D:$D,$D6,$G:$G,P$1,$B:$B,\"Element\"))=1,\"0\",\"\")&COUNTIFS($D:$D,$D6,$G:$G,P$1,$B:$B,\"Element\"))","v":"00"},null,"00-00-00-00","H6, L6 formula different"]
[{"$f":"LEFT(B7,1)&\"-\"&\"AN3-\"&E7","v":"Q-AN3-0"},"QualityIndicator","Analysis","AN 3",0,"State agency analyzes data in a timely manner.","-",{"$f":"IF(K7=L7,VLOOKUP(R7,QIRatingLookup!A:B,2,FALSE),0)","v":0},{"$f":"IFERROR(IFERROR(IFERROR(IFERROR(IFERROR(IFERROR(VLOOKUP($A7,Purpose!$B:$N,13,FALSE),VLOOKUP($A7,DataCollection!$B:$N,13,FALSE)),VLOOKUP($A7,Analysis!$B:$N,13,FALSE)),VLOOKUP($A7,Reporting!$B:$N,13,FALSE)),VLOOKUP($A7,UsingData!$B:$N,13,FALSE)),VLOOKUP($A7,Evaluation!$B:$N,13,FALSE)),VLOOKUP($A7,CrossSystem!$B:$N,13,FALSE))","v":0},{"$f":"IF(Participants!$F$12=\"\",\"-\",Participants!$F$12)","v":"-"},7,0,{"$f":"IF(LEN(COUNTIFS($D:$D,$D7,$G:$G,M$1,$B:$B,\"Element\"))=1,\"0\",\"\")&COUNTIFS($D:$D,$D7,$G:$G,M$1,$B:$B,\"Element\")","v":"00"},{"$f":"IF(LEN(COUNTIFS($D:$D,$D7,$G:$G,N$1,$B:$B,\"Element\"))=1,\"0\",\"\")&COUNTIFS($D:$D,$D7,$G:$G,N$1,$B:$B,\"Element\")","v":"00"},{"$f":"IF(LEN(COUNTIFS($D:$D,$D7,$G:$G,O$1,$B:$B,\"Element\"))=1,\"0\",\"\")&COUNTIFS($D:$D,$D7,$G:$G,O$1,$B:$B,\"Element\")","v":"00"},{"$f":"IF(LEN(COUNTIFS($D:$D,$D7,$G:$G,P$1,$B:$B,\"Element\"))=1,\"0\",\"\")&COUNTIFS($D:$D,$D7,$G:$G,P$1,$B:$B,\"Element\")","v":"00"},null,"00-00-00-00"]
[{"$f":"LEFT(B8,1)&\"-\"&\"AN4-\"&E8","v":"Q-AN4-0"},"QualityIndicator","Analysis","AN 4",0,"Local programs analyze data in a timely manner.","-",{"$f":"IF(Analysis!K66=\"No\",1,IF(K8=L8,VLOOKUP(R8,QIRatingLookup!A:B,2,FALSE),0))","v":0},{"$f":"IFERROR(IFERROR(IFERROR(IFERROR(IFERROR(IFERROR(VLOOKUP($A8,Purpose!$B:$N,13,FALSE),VLOOKUP($A8,DataCollection!$B:$N,13,FALSE)),VLOOKUP($A8,Analysis!$B:$N,13,FALSE)),VLOOKUP($A8,Reporting!$B:$N,13,FALSE)),VLOOKUP($A8,UsingData!$B:$N,13,FALSE)),VLOOKUP($A8,Evaluation!$B:$N,13,FALSE)),VLOOKUP($A8,CrossSystem!$B:$N,13,FALSE))","v":0},{"$f":"IF(Participants!$F$12=\"\",\"-\",Participants!$F$12)","v":"-"},3,{"$f":"IF(Analysis!K66=\"No\",\"N/A\",VALUE(M8)+VALUE(N8)+VALUE(O8)+VALUE(P8)+VALUE(Q8))","v":0},{"$f":"IF(Analysis!K66=\"No\",\"01\",IF(LEN(COUNTIFS($D:$D,$D8,$G:$G,M$1,$B:$B,\"Element\"))=1,\"0\",\"\")&COUNTIFS($D:$D,$D8,$G:$G,M$1,$B:$B,\"Element\"))","v":"00"},{"$f":"IF(Analysis!K66=\"No\",\"00\",IF(LEN(COUNTIFS($D:$D,$D8,$G:$G,N$1,$B:$B,\"Element\"))=1,\"0\",\"\")&COUNTIFS($D:$D,$D8,$G:$G,N$1,$B:$B,\"Element\"))","v":"00"},{"$f":"IF(Analysis!K66=\"No\",\"00\",IF(LEN(COUNTIFS($D:$D,$D8,$G:$G,O$1,$B:$B,\"Element\"))=1,\"0\",\"\")&COUNTIFS($D:$D,$D8,$G:$G,O$1,$B:$B,\"Element\"))","v":"00"},{"$f":"IF(Analysis!K66=\"No\",\"00\",IF(LEN(COUNTIFS($D:$D,$D8,$G:$G,P$1,$B:$B,\"Element\"))=1,\"0\",\"\")&COUNTIFS($D:$D,$D8,$G:$G,P$1,$B:$B,\"Element\"))","v":"00"},null,"00-00-00-00","H8, L8 formula different"]
[{"$f":"LEFT(B9,1)&\"-\"&\"AN5-\"&E9","v":"Q-AN5-0"},"QualityIndicator","Analysis","AN 5",0,"State agency ensures completeness and accuracy of data.","-",{"$f":"IF(K9=L9,VLOOKUP(R9,QIRatingLookup!A:B,2,FALSE),0)","v":0},{"$f":"IFERROR(IFERROR(IFERROR(IFERROR(IFERROR(IFERROR(VLOOKUP($A9,Purpose!$B:$N,13,FALSE),VLOOKUP($A9,DataCollection!$B:$N,13,FALSE)),VLOOKUP($A9,Analysis!$B:$N,13,FALSE)),VLOOKUP($A9,Reporting!$B:$N,13,FALSE)),VLOOKUP($A9,UsingData!$B:$N,13,FALSE)),VLOOKUP($A9,Evaluation!$B:$N,13,FALSE)),VLOOKUP($A9,CrossSystem!$B:$N,13,FALSE))","v":0},{"$f":"IF(Participants!$F$12=\"\",\"-\",Participants!$F$12)","v":"-"},6,0,{"$f":"IF(LEN(COUNTIFS($D:$D,$D9,$G:$G,M$1,$B:$B,\"Element\"))=1,\"0\",\"\")&COUNTIFS($D:$D,$D9,$G:$G,M$1,$B:$B,\"Element\")","v":"00"},"00","00","00",null,"00-00-00-00"]
[{"$f":"LEFT(B10,1)&\"-\"&\"RP1-\"&E10","v":"Q-RP1-0"},"QualityIndicator","Reporting","RP 1",0,"State agency interprets, reports, and communicates information related to family experiences and outcomes.","-",{"$f":"IF(K10=L10,VLOOKUP(R10,QIRatingLookup!A:B,2,FALSE),0)","v":0},{"$f":"IFERROR(IFERROR(IFERROR(IFERROR(IFERROR(IFERROR(VLOOKUP($A10,Purpose!$B:$N,13,FALSE),VLOOKUP($A10,DataCollection!$B:$N,13,FALSE)),VLOOKUP($A10,Analysis!$B:$N,13,FALSE)),VLOOKUP($A10,Reporting!$B:$N,13,FALSE)),VLOOKUP($A10,UsingData!$B:$N,13,FALSE)),VLOOKUP($A10,Evaluation!$B:$N,13,FALSE)),VLOOKUP($A10,CrossSystem!$B:$N,13,FALSE))","v":0},{"$f":"IF(Participants!$G$12=\"\",\"-\",Participants!$G$12)","v":"-"},8,0,"00","00","00","00",null,"00-00-00-00"]
[{"$f":"LEFT(B11,1)&\"-\"&\"RP2-\"&E11","v":"Q-RP2-0"},"QualityIndicator","Reporting","RP 2",0,"Local programs interpret, report, and communicate information related to family experiences and outcomes.","-",{"$f":"IF(Reporting!K31=\"No\",1,IF(K11=L11,VLOOKUP(R11,QIRatingLookup!A:B,2,FALSE),0))","v":0},{"$f":"IFERROR(IFERROR(IFERROR(IFERROR(IFERROR(IFERROR(VLOOKUP($A11,Purpose!$B:$N,13,FALSE),VLOOKUP($A11,DataCollection!$B:$N,13,FALSE)),VLOOKUP($A11,Analysis!$B:$N,13,FALSE)),VLOOKUP($A11,Reporting!$B:$N,13,FALSE)),VLOOKUP($A11,UsingData!$B:$N,13,FALSE)),VLOOKUP($A11,Evaluation!$B:$N,13,FALSE)),VLOOKUP($A11,CrossSystem!$B:$N,13,FALSE))","v":0},{"$f":"IF(Participants!$G$12=\"\",\"-\",Participants!$G$12)","v":"-"},6,{"$f":"IF(Reporting!K31=\"No\",\"N/A\",VALUE(M11)+VALUE(N11)+VALUE(O11)+VALUE(P11)+VALUE(Q11))","v":0},{"$f":"IF(Reporting!K31=\"No\",\"01\",IF(LEN(COUNTIFS($D:$D,$D11,$G:$G,M$1,$B:$B,\"Element\"))=1,\"0\",\"\")&COUNTIFS($D:$D,$D11,$G:$G,M$1,$B:$B,\"Element\"))","v":"00"},{"$f":"IF(Reporting!K31=\"No\",\"00\",IF(LEN(COUNTIFS($D:$D,$D11,$G:$G,N$1,$B:$B,\"Element\"))=1,\"0\",\"\")&COUNTIFS($D:$D,$D11,$G:$G,N$1,$B:$B,\"Element\"))","v":"00"},{"$f":"IF(Reporting!K31=\"No\",\"00\",IF(LEN(COUNTIFS($D:$D,$D11,$G:$G,O$1,$B:$B,\"Element\"))=1,\"0\",\"\")&COUNTIFS($D:$D,$D11,$G:$G,O$1,$B:$B,\"Element\"))","v":"00"},{"$f":"IF(Reporting!K31=\"No\",\"00\",IF(LEN(COUNTIFS($D:$D,$D11,$G:$G,P$1,$B:$B,\"Element\"))=1,\"0\",\"\")&COUNTIFS($D:$D,$D11,$G:$G,P$1,$B:$B,\"Element\"))","v":"00"},null,"00-00-00-00","H11, L11 formula different"]
[{"$f":"LEFT(B12,1)&\"-\"&\"UD1-\"&E12","v":"Q-UD1-0"},"QualityIndicator","UsingData","UD 1",0,"State agency makes regular use of information on family experiences and outcomes to improve programs.","-",{"$f":"IF(K12=L12,VLOOKUP(R12,QIRatingLookup!A:B,2,FALSE),0)","v":0},{"$f":"IFERROR(IFERROR(IFERROR(IFERROR(IFERROR(IFERROR(VLOOKUP($A12,Purpose!$B:$N,13,FALSE),VLOOKUP($A12,DataCollection!$B:$N,13,FALSE)),VLOOKUP($A12,Analysis!$B:$N,13,FALSE)),VLOOKUP($A12,Reporting!$B:$N,13,FALSE)),VLOOKUP($A12,UsingData!$B:$N,13,FALSE)),VLOOKUP($A12,Evaluation!$B:$N,13,FALSE)),VLOOKUP($A12,CrossSystem!$B:$N,13,FALSE))","v":0},{"$f":"IF(Participants!$H$12=\"\",\"-\",Participants!$H$12)","v":"-"},7,0,{"$f":"IF(LEN(COUNTIFS($D:$D,$D12,$G:$G,M$1,$B:$B,\"Element\"))=1,\"0\",\"\")&COUNTIFS($D:$D,$D12,$G:$G,M$1,$B:$B,\"Element\")","v":"00"},{"$f":"IF(LEN(COUNTIFS($D:$D,$D12,$G:$G,N$1,$B:$B,\"Element\"))=1,\"0\",\"\")&COUNTIFS($D:$D,$D12,$G:$G,N$1,$B:$B,\"Element\")","v":"00"},{"$f":"IF(LEN(COUNTIFS($D:$D,$D12,$G:$G,O$1,$B:$B,\"Element\"))=1,\"0\",\"\")&COUNTIFS($D:$D,$D12,$G:$G,O$1,$B:$B,\"Element\")","v":"00"},{"$f":"IF(LEN(COUNTIFS($D:$D,$D12,$G:$G,P$1,$B:$B,\"Element\"))=1,\"0\",\"\")&COUNTIFS($D:$D,$D12,$G:$G,P$1,$B:$B,\"Element\")","v":"00"},null,"00-00-00-00"]
[{"$f":"LEFT(B13,1)&\"-\"&\"UD2-\"&E13","v":"Q-UD2-0"},"QualityIndicator","UsingData","UD 2",0,"Local programs make regular use of information on family experiences and outcomes to improve programs.","-",{"$f":"IF(UsingData!K29=\"No\",1,IF(K13=L13,VLOOKUP(R13,QIRatingLookup!A:B,2,FALSE),0))","v":0},{"$f":"IFERROR(IFERROR(IFERROR(IFERROR(IFERROR(IFERROR(VLOOKUP($A13,Purpose!$B:$N,13,FALSE),VLOOKUP($A13,DataCollection!$B:$N,13,FALSE)),VLOOKUP($A13,Analysis!$B:$N,13,FALSE)),VLOOKUP($A13,Reporting!$B:$N,13,FALSE)),VLOOKUP($A13,UsingData!$B:$N,13,FALSE)),VLOOKUP($A13,Evaluation!$B:$N,13,FALSE)),VLOOKUP($A13,CrossSystem!$B:$N,13,FALSE))","v":0},{"$f":"IF(Participants!$H$12=\"\",\"-\",Participants!$H$12)","v":"-"},3,{"$f":"IF(UsingData!K29=\"No\",\"N/A\",VALUE(M13)+VALUE(N13)+VALUE(O13)+VALUE(P13)+VALUE(Q13))","v":0},{"$f":"IF(UsingData!K29=\"No\",\"01\",IF(LEN(COUNTIFS($D:$D,$D13,$G:$G,M$1,$B:$B,\"Element\"))=1,\"0\",\"\")&COUNTIFS($D:$D,$D13,$G:$G,M$1,$B:$B,\"Element\"))","v":"00"},{"$f":"IF(UsingData!K29=\"No\",\"00\",IF(LEN(COUNTIFS($D:$D,$D13,$G:$G,N$1,$B:$B,\"Element\"))=1,\"0\",\"\")&COUNTIFS($D:$D,$D13,$G:$G,N$1,$B:$B,\"Element\"))","v":"00"},{"$f":"IF(UsingData!K29=\"No\",\"00\",IF(LEN(COUNTIFS($D:$D,$D13,$G:$G,O$1,$B:$B,\"Element\"))=1,\"0\",\"\")&COUNTIFS($D:$D,$D13,$G:$G,O$1,$B:$B,\"Element\"))","v":"00"},{"$f":"IF(UsingData!K29=\"No\",\"00\",IF(LEN(COUNTIFS($D:$D,$D13,$G:$G,P$1,$B:$B,\"Element\"))=1,\"0\",\"\")&COUNTIFS($D:$D,$D13,$G:$G,P$1,$B:$B,\"Element\"))","v":"00"},null,"00-00-00-00","H13, L13 formula different"]
[{"$f":"LEFT(B14,1)&\"-\"&\"EV1-\"&E14","v":"Q-EV1-0"},"QualityIndicator","Evaluation","EV 1",0,"State evaluates its family experiences and outcomes measurement system regularly.","-",{"$f":"IF(K14=L14,VLOOKUP(R14,QIRatingLookup!A:B,2,FALSE),0)","v":0},{"$f":"IFERROR(IFERROR(IFERROR(IFERROR(IFERROR(IFERROR(VLOOKUP($A14,Purpose!$B:$N,13,FALSE),VLOOKUP($A14,DataCollection!$B:$N,13,FALSE)),VLOOKUP($A14,Analysis!$B:$N,13,FALSE)),VLOOKUP($A14,Reporting!$B:$N,13,FALSE)),VLOOKUP($A14,UsingData!$B:$N,13,FALSE)),VLOOKUP($A14,Evaluation!$B:$N,13,FALSE)),VLOOKUP($A14,CrossSystem!$B:$N,13,FALSE))","v":0},{"$f":"IF(Participants!$I$12=\"\",\"-\",Participants!$I$12)","v":"-"},3,0,{"$f":"IF(LEN(COUNTIFS($D:$D,$D14,$G:$G,M$1,$B:$B,\"Element\"))=1,\"0\",\"\")&COUNTIFS($D:$D,$D14,$G:$G,M$1,$B:$B,\"Element\")","v":"00"},"00","00","00",null,"00-00-00-00"]
[{"$f":"LEFT(B15,1)&\"-\"&\"CC1-\"&E15","v":"Q-CC1-0"},"QualityIndicator","CrossSystem","CC 1",0,"Part C and Part B 619 coordinate family experiences and outcomes measurement.","-",{"$f":"IF(K15=L15,VLOOKUP(R15,QIRatingLookup!A:B,2,FALSE),0)","v":0},{"$f":"IFERROR(IFERROR(IFERROR(IFERROR(IFERROR(IFERROR(VLOOKUP($A15,Purpose!$B:$N,13,FALSE),VLOOKUP($A15,DataCollection!$B:$N,13,FALSE)),VLOOKUP($A15,Analysis!$B:$N,13,FALSE)),VLOOKUP($A15,Reporting!$B:$N,13,FALSE)),VLOOKUP($A15,UsingData!$B:$N,13,FALSE)),VLOOKUP($A15,Evaluation!$B:$N,13,FALSE)),VLOOKUP($A15,CrossSystem!$B:$N,13,FALSE))","v":0},{"$f":"IF(Participants!$J$12=\"\",\"-\",Participants!$J$12)","v":"-"},3,0,"00","00","00","00",null,"00-00-00-00"]
[{"$f":"LEFT(B16,1)&\"-\"&\"CC2-\"&E16","v":"Q-CC2-0"},"QualityIndicator","CrossSystem","CC 2",0,"Family experiences and outcomes measurement is integrated across early childhood (EC) programs statewide.","-",{"$f":"IF(K16=L16,VLOOKUP(R16,QIRatingLookup!A:B,2,FALSE),0)","v":0},{"$f":"IFERROR(IFERROR(IFERROR(IFERROR(IFERROR(IFERROR(VLOOKUP($A16,Purpose!$B:$N,13,FALSE),VLOOKUP($A16,DataCollection!$B:$N,13,FALSE)),VLOOKUP($A16,Analysis!$B:$N,13,FALSE)),VLOOKUP($A16,Reporting!$B:$N,13,FALSE)),VLOOKUP($A16,UsingData!$B:$N,13,FALSE)),VLOOKUP($A16,Evaluation!$B:$N,13,FALSE)),VLOOKUP($A16,CrossSystem!$B:$N,13,FALSE))","v":0},{"$f":"IF(Participants!$J$12=\"\",\"-\",Participants!$J$12)","v":"-"},5,0,"00","00","00","00",null,"00-00-00-00"]
[]
[{"$f":"LEFT(B18,1)&\"-\"&LEFT(D18,2)&RIGHT(D18)&\"-\"&E18","v":"E-PR1-a"},"Element","Purpose","PR 1","a","Stakeholders are involved in development of the purposes.",{"$f":"IFERROR(IFERROR(IFERROR(IFERROR(IFERROR(IFERROR(VLOOKUP($A18,Purpose!$B:$N,11,FALSE),VLOOKUP($A18,DataCollection!$B:$N,11,FALSE)),VLOOKUP($A18,Analysis!$B:$N,11,FALSE)),VLOOKUP($A18,Reporting!$B:$N,11,FALSE)),VLOOKUP($A18,UsingData!$B:$N,11,FALSE)),VLOOKUP($A18,Evaluation!$B:$N,11,FALSE)),VLOOKUP($A18,CrossSystem!$B:$N,11,FALSE))","v":0},"-",{"$f":"IFERROR(IFERROR(IFERROR(IFERROR(IFERROR(IFERROR(VLOOKUP($A18,Purpose!$B:$N,13,FALSE),VLOOKUP($A18,DataCollection!$B:$N,13,FALSE)),VLOOKUP($A18,Analysis!$B:$N,13,FALSE)),VLOOKUP($A18,Reporting!$B:$N,13,FALSE)),VLOOKUP($A18,UsingData!$B:$N,13,FALSE)),VLOOKUP($A18,Evaluation!$B:$N,13,FALSE)),VLOOKUP($A18,CrossSystem!$B:$N,13,FALSE))","v":0},{"$f":"IF(Participants!$D$12=\"\",\"-\",Participants!$D$12)","v":"-"}]
[{"$f":"LEFT(B19,1)&\"-\"&LEFT(D19,2)&RIGHT(D19)&\"-\"&E19","v":"E-PR1-b"},"Element","Purpose","PR 1","b","Written statement addresses why data are being collected and how data will be used. Statement specifies who will use the data and for what purposes.",{"$f":"IFERROR(IFERROR(IFERROR(IFERROR(IFERROR(IFERROR(VLOOKUP($A19,Purpose!$B:$N,11,FALSE),VLOOKUP($A19,DataCollection!$B:$N,11,FALSE)),VLOOKUP($A19,Analysis!$B:$N,11,FALSE)),VLOOKUP($A19,Reporting!$B:$N,11,FALSE)),VLOOKUP($A19,UsingData!$B:$N,11,FALSE)),VLOOKUP($A19,Evaluation!$B:$N,11,FALSE)),VLOOKUP($A19,CrossSystem!$B:$N,11,FALSE))","v":0},"-",{"$f":"IFERROR(IFERROR(IFERROR(IFERROR(IFERROR(IFERROR(VLOOKUP($A19,Purpose!$B:$N,13,FALSE),VLOOKUP($A19,DataCollection!$B:$N,13,FALSE)),VLOOKUP($A19,Analysis!$B:$N,13,FALSE)),VLOOKUP($A19,Reporting!$B:$N,13,FALSE)),VLOOKUP($A19,UsingData!$B:$N,13,FALSE)),VLOOKUP($A19,Evaluation!$B:$N,13,FALSE)),VLOOKUP($A19,CrossSystem!$B:$N,13,FALSE))","v":0},{"$f":"IF(Participants!$D$12=\"\",\"-\",Participants!$D$12)","v":"-"}]
["E-PR1-c","Element","Purpose","PR 1","c","Statement is easily accessible to local administrators, providers, families, and the general public.",{"$f":"IFERROR(IFERROR(IFERROR(IFERROR(IFERROR(IFERROR(VLOOKUP($A20,Purpose!$B:$N,11,FALSE),VLOOKUP($A20,DataCollection!$B:$N,11,FALSE)),VLOOKUP($A20,Analysis!$B:$N,11,FALSE)),VLOOKUP($A20,Reporting!$B:$N,11,FALSE)),VLOOKUP($A20,UsingData!$B:$N,11,FALSE)),VLOOKUP($A20,Evaluation!$B:$N,11,FALSE)),VLOOKUP($A20,CrossSystem!$B:$N,11,FALSE))","v":0},"-",{"$f":"IFERROR(IFERROR(IFERROR(IFERROR(IFERROR(IFERROR(VLOOKUP($A20,Purpose!$B:$N,13,FALSE),VLOOKUP($A20,DataCollection!$B:$N,13,FALSE)),VLOOKUP($A20,Analysis!$B:$N,13,FALSE)),VLOOKUP($A20,Reporting!$B:$N,13,FALSE)),VLOOKUP($A20,UsingData!$B:$N,13,FALSE)),VLOOKUP($A20,Evaluation!$B:$N,13,FALSE)),VLOOKUP($A20,CrossSystem!$B:$N,13,FALSE))","v":0},{"$f":"IF(Participants!$D$12=\"\",\"-\",Participants!$D$12)","v":"-"}]
["E-PR1-d","Element","Purpose","PR 1","d","Families receiving services are fully informed of the purposes for collecting data on family experiences and outcomes.",{"$f":"IFERROR(IFERROR(IFERROR(IFERROR(IFERROR(IFERROR(VLOOKUP($A21,Purpose!$B:$N,11,FALSE),VLOOKUP($A21,DataCollection!$B:$N,11,FALSE)),VLOOKUP($A21,Analysis!$B:$N,11,FALSE)),VLOOKUP($A21,Reporting!$B:$N,11,FALSE)),VLOOKUP($A21,UsingData!$B:$N,11,FALSE)),VLOOKUP($A21,Evaluation!$B:$N,11,FALSE)),VLOOKUP($A21,CrossSystem!$B:$N,11,FALSE))","v":0},"-",{"$f":"IFERROR(IFERROR(IFERROR(IFERROR(IFERROR(IFERROR(VLOOKUP($A21,Purpose!$B:$N,13,FALSE),VLOOKUP($A21,DataCollection!$B:$N,13,FALSE)),VLOOKUP($A21,Analysis!$B:$N,13,FALSE)),VLOOKUP($A21,Reporting!$B:$N,13,FALSE)),VLOOKUP($A21,UsingData!$B:$N,13,FALSE)),VLOOKUP($A21,Evaluation!$B:$N,13,FALSE)),VLOOKUP($A21,CrossSystem!$B:$N,13,FALSE))","v":0},{"$f":"IF(Participants!$D$12=\"\",\"-\",Participants!$D$12)","v":"-"}]
["E-PR1-e","Element","Purpose","PR 1","e","Purposes include meeting reporting requirements and providing ongoing information for data-based decision-making for program improvement.",{"$f":"IFERROR(IFERROR(IFERROR(IFERROR(IFERROR(IFERROR(VLOOKUP($A22,Purpose!$B:$N,11,FALSE),VLOOKUP($A22,DataCollection!$B:$N,11,FALSE)),VLOOKUP($A22,Analysis!$B:$N,11,FALSE)),VLOOKUP($A22,Reporting!$B:$N,11,FALSE)),VLOOKUP($A22,UsingData!$B:$N,11,FALSE)),VLOOKUP($A22,Evaluation!$B:$N,11,FALSE)),VLOOKUP($A22,CrossSystem!$B:$N,11,FALSE))","v":0},"-",{"$f":"IFERROR(IFERROR(IFERROR(IFERROR(IFERROR(IFERROR(VLOOKUP($A22,Purpose!$B:$N,13,FALSE),VLOOKUP($A22,DataCollection!$B:$N,13,FALSE)),VLOOKUP($A22,Analysis!$B:$N,13,FALSE)),VLOOKUP($A22,Reporting!$B:$N,13,FALSE)),VLOOKUP($A22,UsingData!$B:$N,13,FALSE)),VLOOKUP($A22,Evaluation!$B:$N,13,FALSE)),VLOOKUP($A22,CrossSystem!$B:$N,13,FALSE))","v":0},{"$f":"IF(Participants!$D$12=\"\",\"-\",Participants!$D$12)","v":"-"}]
["E-PR1-f","Element","Purpose","PR 1","f","Purpose includes examining multiple aspects of families’ experiences with the program and their outcomes (e.g., helpfulness of early intervention, family outcomes, family-centered services).",{"$f":"IFERROR(IFERROR(IFERROR(IFERROR(IFERROR(IFERROR(VLOOKUP($A23,Purpose!$B:$N,11,FALSE),VLOOKUP($A23,DataCollection!$B:$N,11,FALSE)),VLOOKUP($A23,Analysis!$B:$N,11,FALSE)),VLOOKUP($A23,Reporting!$B:$N,11,FALSE)),VLOOKUP($A23,UsingData!$B:$N,11,FALSE)),VLOOKUP($A23,Evaluation!$B:$N,11,FALSE)),VLOOKUP($A23,CrossSystem!$B:$N,11,FALSE))","v":0},"-",{"$f":"IFERROR(IFERROR(IFERROR(IFERROR(IFERROR(IFERROR(VLOOKUP($A23,Purpose!$B:$N,13,FALSE),VLOOKUP($A23,DataCollection!$B:$N,13,FALSE)),VLOOKUP($A23,Analysis!$B:$N,13,FALSE)),VLOOKUP($A23,Reporting!$B:$N,13,FALSE)),VLOOKUP($A23,UsingData!$B:$N,13,FALSE)),VLOOKUP($A23,Evaluation!$B:$N,13,FALSE)),VLOOKUP($A23,CrossSystem!$B:$N,13,FALSE))","v":0},{"$f":"IF(Participants!$D$12=\"\",\"-\",Participants!$D$12)","v":"-"}]
["E-DC1-a","Element","DataCollection","DC 1","a","Data collection methods are aligned with the purpose(s) the state wants to address. (Methods refer to multiple aspects of the data collection, such as how the data are collected, from whom, when, how often, etc.)",{"$f":"IFERROR(IFERROR(IFERROR(IFERROR(IFERROR(IFERROR(VLOOKUP($A24,Purpose!$B:$N,11,FALSE),VLOOKUP($A24,DataCollection!$B:$N,11,FALSE)),VLOOKUP($A24,Analysis!$B:$N,11,FALSE)),VLOOKUP($A24,Reporting!$B:$N,11,FALSE)),VLOOKUP($A24,UsingData!$B:$N,11,FALSE)),VLOOKUP($A24,Evaluation!$B:$N,11,FALSE)),VLOOKUP($A24,CrossSystem!$B:$N,11,FALSE))","v":0},"-",{"$f":"IFERROR(IFERROR(IFERROR(IFERROR(IFERROR(IFERROR(VLOOKUP($A24,Purpose!$B:$N,13,FALSE),VLOOKUP($A24,DataCollection!$B:$N,13,FALSE)),VLOOKUP($A24,Analysis!$B:$N,13,FALSE)),VLOOKUP($A24,Reporting!$B:$N,13,FALSE)),VLOOKUP($A24,UsingData!$B:$N,13,FALSE)),VLOOKUP($A24,Evaluation!$B:$N,13,FALSE)),VLOOKUP($A24,CrossSystem!$B:$N,13,FALSE))","v":0},{"$f":"IF(Participants!$E$12=\"\",\"-\",Participants!$E$12)","v":"-"}]
["E-DC1-b","Element","DataCollection","DC 1","b","Stakeholders are involved in deciding on the data collection methods.",{"$f":"IFERROR(IFERROR(IFERROR(IFERROR(IFERROR(IFERROR(VLOOKUP($A25,Purpose!$B:$N,11,FALSE),VLOOKUP($A25,DataCollection!$B:$N,11,FALSE)),VLOOKUP($A25,Analysis!$B:$N,11,FALSE)),VLOOKUP($A25,Reporting!$B:$N,11,FALSE)),VLOOKUP($A25,UsingData!$B:$N,11,FALSE)),VLOOKUP($A25,Evaluation!$B:$N,11,FALSE)),VLOOKUP($A25,CrossSystem!$B:$N,11,FALSE))","v":0},"-",{"$f":"IFERROR(IFERROR(IFERROR(IFERROR(IFERROR(IFERROR(VLOOKUP($A25,Purpose!$B:$N,13,FALSE),VLOOKUP($A25,DataCollection!$B:$N,13,FALSE)),VLOOKUP($A25,Analysis!$B:$N,13,FALSE)),VLOOKUP($A25,Reporting!$B:$N,13,FALSE)),VLOOKUP($A25,UsingData!$B:$N,13,FALSE)),VLOOKUP($A25,Evaluation!$B:$N,13,FALSE)),VLOOKUP($A25,CrossSystem!$B:$N,13,FALSE))","v":0},{"$f":"IF(Participants!$E$12=\"\",\"-\",Participants!$E$12)","v":"-"}]
["E-DC1-c","Element","DataCollection","DC 1","c","State has comprehensive written policies and procedures describing the data collection and transmission approach.",{"$f":"IFERROR(IFERROR(IFERROR(IFERROR(IFERROR(IFERROR(VLOOKUP($A26,Purpose!$B:$N,11,FALSE),VLOOKUP($A26,DataCollection!$B:$N,11,FALSE)),VLOOKUP($A26,Analysis!$B:$N,11,FALSE)),VLOOKUP($A26,Reporting!$B:$N,11,FALSE)),VLOOKUP($A26,UsingData!$B:$N,11,FALSE)),VLOOKUP($A26,Evaluation!$B:$N,11,FALSE)),VLOOKUP($A26,CrossSystem!$B:$N,11,FALSE))","v":0},"-",{"$f":"IFERROR(IFERROR(IFERROR(IFERROR(IFERROR(IFERROR(VLOOKUP($A26,Purpose!$B:$N,13,FALSE),VLOOKUP($A26,DataCollection!$B:$N,13,FALSE)),VLOOKUP($A26,Analysis!$B:$N,13,FALSE)),VLOOKUP($A26,Reporting!$B:$N,13,FALSE)),VLOOKUP($A26,UsingData!$B:$N,13,FALSE)),VLOOKUP($A26,Evaluation!$B:$N,13,FALSE)),VLOOKUP($A26,CrossSystem!$B:$N,13,FALSE))","v":0},{"$f":"IF(Participants!$E$12=\"\",\"-\",Participants!$E$12)","v":"-"}]
["E-DC1-d","Element","DataCollection","DC 1","d","Policies and procedures are clear and readily accessible.",{"$f":"IFERROR(IFERROR(IFERROR(IFERROR(IFERROR(IFERROR(VLOOKUP($A27,Purpose!$B:$N,11,FALSE),VLOOKUP($A27,DataCollection!$B:$N,11,FALSE)),VLOOKUP($A27,Analysis!$B:$N,11,FALSE)),VLOOKUP($A27,Reporting!$B:$N,11,FALSE)),VLOOKUP($A27,UsingData!$B:$N,11,FALSE)),VLOOKUP($A27,Evaluation!$B:$N,11,FALSE)),VLOOKUP($A27,CrossSystem!$B:$N,11,FALSE))","v":0},"-",{"$f":"IFERROR(IFERROR(IFERROR(IFERROR(IFERROR(IFERROR(VLOOKUP($A27,Purpose!$B:$N,13,FALSE),VLOOKUP($A27,DataCollection!$B:$N,13,FALSE)),VLOOKUP($A27,Analysis!$B:$N,13,FALSE)),VLOOKUP($A27,Reporting!$B:$N,13,FALSE)),VLOOKUP($A27,UsingData!$B:$N,13,FALSE)),VLOOKUP($A27,Evaluation!$B:$N,13,FALSE)),VLOOKUP($A27,CrossSystem!$B:$N,13,FALSE))","v":0},{"$f":"IF(Participants!$E$12=\"\",\"-\",Participants!$E$12)","v":"-"}]
["E-DC1-e","Element","DataCollection","DC 1","e","Procedures are revised as necessary based on needs of local or state agency; systematic process exists for communicating changes in timely manner.",{"$f":"IFERROR(IFERROR(IFERROR(IFERROR(IFERROR(IFERROR(VLOOKUP($A28,Purpose!$B:$N,11,FALSE),VLOOKUP($A28,DataCollection!$B:$N,11,FALSE)),VLOOKUP($A28,Analysis!$B:$N,11,FALSE)),VLOOKUP($A28,Reporting!$B:$N,11,FALSE)),VLOOKUP($A28,UsingData!$B:$N,11,FALSE)),VLOOKUP($A28,Evaluation!$B:$N,11,FALSE)),VLOOKUP($A28,CrossSystem!$B:$N,11,FALSE))","v":0},"-",{"$f":"IFERROR(IFERROR(IFERROR(IFERROR(IFERROR(IFERROR(VLOOKUP($A28,Purpose!$B:$N,13,FALSE),VLOOKUP($A28,DataCollection!$B:$N,13,FALSE)),VLOOKUP($A28,Analysis!$B:$N,13,FALSE)),VLOOKUP($A28,Reporting!$B:$N,13,FALSE)),VLOOKUP($A28,UsingData!$B:$N,13,FALSE)),VLOOKUP($A28,Evaluation!$B:$N,13,FALSE)),VLOOKUP($A28,CrossSystem!$B:$N,13,FALSE))","v":0},{"$f":"IF(Participants!$E$12=\"\",\"-\",Participants!$E$12)","v":"-"}]
["E-DC1-f","Element","DataCollection","DC 1","f","Families are fully informed about data collection procedures (e.g., when surveys are available, how to return them).",{"$f":"IFERROR(IFERROR(IFERROR(IFERROR(IFERROR(IFERROR(VLOOKUP($A29,Purpose!$B:$N,11,FALSE),VLOOKUP($A29,DataCollection!$B:$N,11,FALSE)),VLOOKUP($A29,Analysis!$B:$N,11,FALSE)),VLOOKUP($A29,Reporting!$B:$N,11,FALSE)),VLOOKUP($A29,UsingData!$B:$N,11,FALSE)),VLOOKUP($A29,Evaluation!$B:$N,11,FALSE)),VLOOKUP($A29,CrossSystem!$B:$N,11,FALSE))","v":0},"-",{"$f":"IFERROR(IFERROR(IFERROR(IFERROR(IFERROR(IFERROR(VLOOKUP($A29,Purpose!$B:$N,13,FALSE),VLOOKUP($A29,DataCollection!$B:$N,13,FALSE)),VLOOKUP($A29,Analysis!$B:$N,13,FALSE)),VLOOKUP($A29,Reporting!$B:$N,13,FALSE)),VLOOKUP($A29,UsingData!$B:$N,13,FALSE)),VLOOKUP($A29,Evaluation!$B:$N,13,FALSE)),VLOOKUP($A29,CrossSystem!$B:$N,13,FALSE))","v":0},{"$f":"IF(Participants!$E$12=\"\",\"-\",Participants!$E$12)","v":"-"}]
["E-DC1-g","Element","DataCollection","DC 1","g","Data collection procedures have the capability to produce valid and reliable data.",{"$f":"IFERROR(IFERROR(IFERROR(IFERROR(IFERROR(IFERROR(VLOOKUP($A30,Purpose!$B:$N,11,FALSE),VLOOKUP($A30,DataCollection!$B:$N,11,FALSE)),VLOOKUP($A30,Analysis!$B:$N,11,FALSE)),VLOOKUP($A30,Reporting!$B:$N,11,FALSE)),VLOOKUP($A30,UsingData!$B:$N,11,FALSE)),VLOOKUP($A30,Evaluation!$B:$N,11,FALSE)),VLOOKUP($A30,CrossSystem!$B:$N,11,FALSE))","v":0},"-",{"$f":"IFERROR(IFERROR(IFERROR(IFERROR(IFERROR(IFERROR(VLOOKUP($A30,Purpose!$B:$N,13,FALSE),VLOOKUP($A30,DataCollection!$B:$N,13,FALSE)),VLOOKUP($A30,Analysis!$B:$N,13,FALSE)),VLOOKUP($A30,Reporting!$B:$N,13,FALSE)),VLOOKUP($A30,UsingData!$B:$N,13,FALSE)),VLOOKUP($A30,Evaluation!$B:$N,13,FALSE)),VLOOKUP($A30,CrossSystem!$B:$N,13,FALSE))","v":0},{"$f":"IF(Participants!$E$12=\"\",\"-\",Participants!$E$12)","v":"-"}]
["E-DC1-h","Element","DataCollection","DC 1","h","Processes are available to facilitate efficient and complete data collection.",{"$f":"IFERROR(IFERROR(IFERROR(IFERROR(IFERROR(IFERROR(VLOOKUP($A31,Purpose!$B:$N,11,FALSE),VLOOKUP($A31,DataCollection!$B:$N,11,FALSE)),VLOOKUP($A31,Analysis!$B:$N,11,FALSE)),VLOOKUP($A31,Reporting!$B:$N,11,FALSE)),VLOOKUP($A31,UsingData!$B:$N,11,FALSE)),VLOOKUP($A31,Evaluation!$B:$N,11,FALSE)),VLOOKUP($A31,CrossSystem!$B:$N,11,FALSE))","v":0},"-",{"$f":"IFERROR(IFERROR(IFERROR(IFERROR(IFERROR(IFERROR(VLOOKUP($A31,Purpose!$B:$N,13,FALSE),VLOOKUP($A31,DataCollection!$B:$N,13,FALSE)),VLOOKUP($A31,Analysis!$B:$N,13,FALSE)),VLOOKUP($A31,Reporting!$B:$N,13,FALSE)),VLOOKUP($A31,UsingData!$B:$N,13,FALSE)),VLOOKUP($A31,Evaluation!$B:$N,13,FALSE)),VLOOKUP($A31,CrossSystem!$B:$N,13,FALSE))","v":0},{"$f":"IF(Participants!$E$12=\"\",\"-\",Participants!$E$12)","v":"-"}]
["E-DC1-i","Element","DataCollection","DC 1","i","State has evidence that the data collection procedures are being implemented with high fidelity (e.g., state has local supervisors overseeing the data collection process or state has documentation that a vendor has mailed surveys to families).",{"$f":"IFERROR(IFERROR(IFERROR(IFERROR(IFERROR(IFERROR(VLOOKUP($A32,Purpose!$B:$N,11,FALSE),VLOOKUP($A32,DataCollection!$B:$N,11,FALSE)),VLOOKUP($A32,Analysis!$B:$N,11,FALSE)),VLOOKUP($A32,Reporting!$B:$N,11,FALSE)),VLOOKUP($A32,UsingData!$B:$N,11,FALSE)),VLOOKUP($A32,Evaluation!$B:$N,11,FALSE)),VLOOKUP($A32,CrossSystem!$B:$N,11,FALSE))","v":0},"-",{"$f":"IFERROR(IFERROR(IFERROR(IFERROR(IFERROR(IFERROR(VLOOKUP($A32,Purpose!$B:$N,13,FALSE),VLOOKUP($A32,DataCollection!$B:$N,13,FALSE)),VLOOKUP($A32,Analysis!$B:$N,13,FALSE)),VLOOKUP($A32,Reporting!$B:$N,13,FALSE)),VLOOKUP($A32,UsingData!$B:$N,13,FALSE)),VLOOKUP($A32,Evaluation!$B:$N,13,FALSE)),VLOOKUP($A32,CrossSystem!$B:$N,13,FALSE))","v":0},{"$f":"IF(Participants!$E$12=\"\",\"-\",Participants!$E$12)","v":"-"}]
["E-DC1-j","Element","DataCollection","DC 1","j","Data collection procedures are institutionalized; implementation remains stable through staff changes or changes in a vendor.",{"$f":"IFERROR(IFERROR(IFERROR(IFERROR(IFERROR(IFERROR(VLOOKUP($A33,Purpose!$B:$N,11,FALSE),VLOOKUP($A33,DataCollection!$B:$N,11,FALSE)),VLOOKUP($A33,Analysis!$B:$N,11,FALSE)),VLOOKUP($A33,Reporting!$B:$N,11,FALSE)),VLOOKUP($A33,UsingData!$B:$N,11,FALSE)),VLOOKUP($A33,Evaluation!$B:$N,11,FALSE)),VLOOKUP($A33,CrossSystem!$B:$N,11,FALSE))","v":0},"-",{"$f":"IFERROR(IFERROR(IFERROR(IFERROR(IFERROR(IFERROR(VLOOKUP($A33,Purpose!$B:$N,13,FALSE),VLOOKUP($A33,DataCollection!$B:$N,13,FALSE)),VLOOKUP($A33,Analysis!$B:$N,13,FALSE)),VLOOKUP($A33,Reporting!$B:$N,13,FALSE)),VLOOKUP($A33,UsingData!$B:$N,13,FALSE)),VLOOKUP($A33,Evaluation!$B:$N,13,FALSE)),VLOOKUP($A33,CrossSystem!$B:$N,13,FALSE))","v":0},{"$f":"IF(Participants!$E$12=\"\",\"-\",Participants!$E$12)","v":"-"}]
["E-DC1-k","Element","DataCollection","DC 1","k","Ongoing support and technical assistance for data collection issues are readily available; problems are addressed in a timely fashion. This includes support for families who are completing the survey and program staff who may be involved in the data collection.",{"$f":"IFERROR(IFERROR(IFERROR(IFERROR(IFERROR(IFERROR(VLOOKUP($A34,Purpose!$B:$N,11,FALSE),VLOOKUP($A34,DataCollection!$B:$N,11,FALSE)),VLOOKUP($A34,Analysis!$B:$N,11,FALSE)),VLOOKUP($A34,Reporting!$B:$N,11,FALSE)),VLOOKUP($A34,UsingData!$B:$N,11,FALSE)),VLOOKUP($A34,Evaluation!$B:$N,11,FALSE)),VLOOKUP($A34,CrossSystem!$B:$N,11,FALSE))","v":0},"-",{"$f":"IFERROR(IFERROR(IFERROR(IFERROR(IFERROR(IFERROR(VLOOKUP($A34,Purpose!$B:$N,13,FALSE),VLOOKUP($A34,DataCollection!$B:$N,13,FALSE)),VLOOKUP($A34,Analysis!$B:$N,13,FALSE)),VLOOKUP($A34,Reporting!$B:$N,13,FALSE)),VLOOKUP($A34,UsingData!$B:$N,13,FALSE)),VLOOKUP($A34,Evaluation!$B:$N,13,FALSE)),VLOOKUP($A34,CrossSystem!$B:$N,13,FALSE))","v":0},{"$f":"IF(Participants!$E$12=\"\",\"-\",Participants!$E$12)","v":"-"}]
["E-DC1-l","Element","DataCollection","DC 1","l","If state is sampling, sampling procedures produce a representative sample of sufficient size. (Select “Not applicable” if not sampling.)",{"$f":"IFERROR(IFERROR(IFERROR(IFERROR(IFERROR(IFERROR(VLOOKUP($A35,Purpose!$B:$N,11,FALSE),VLOOKUP($A35,DataCollection!$B:$N,11,FALSE)),VLOOKUP($A35,Analysis!$B:$N,11,FALSE)),VLOOKUP($A35,Reporting!$B:$N,11,FALSE)),VLOOKUP($A35,UsingData!$B:$N,11,FALSE)),VLOOKUP($A35,Evaluation!$B:$N,11,FALSE)),VLOOKUP($A35,CrossSystem!$B:$N,11,FALSE))","v":0},"-",{"$f":"IFERROR(IFERROR(IFERROR(IFERROR(IFERROR(IFERROR(VLOOKUP($A35,Purpose!$B:$N,13,FALSE),VLOOKUP($A35,DataCollection!$B:$N,13,FALSE)),VLOOKUP($A35,Analysis!$B:$N,13,FALSE)),VLOOKUP($A35,Reporting!$B:$N,13,FALSE)),VLOOKUP($A35,UsingData!$B:$N,13,FALSE)),VLOOKUP($A35,Evaluation!$B:$N,13,FALSE)),VLOOKUP($A35,CrossSystem!$B:$N,13,FALSE))","v":0},{"$f":"IF(Participants!$E$12=\"\",\"-\",Participants!$E$12)","v":"-"}]
["E-DC1-m","Element","DataCollection","DC 1","m","State has procedures to encourage all groups to participate in the data collection process (i.e., to ensure an adequate response rate).",{"$f":"IFERROR(IFERROR(IFERROR(IFERROR(IFERROR(IFERROR(VLOOKUP($A36,Purpose!$B:$N,11,FALSE),VLOOKUP($A36,DataCollection!$B:$N,11,FALSE)),VLOOKUP($A36,Analysis!$B:$N,11,FALSE)),VLOOKUP($A36,Reporting!$B:$N,11,FALSE)),VLOOKUP($A36,UsingData!$B:$N,11,FALSE)),VLOOKUP($A36,Evaluation!$B:$N,11,FALSE)),VLOOKUP($A36,CrossSystem!$B:$N,11,FALSE))","v":0},"-",{"$f":"IFERROR(IFERROR(IFERROR(IFERROR(IFERROR(IFERROR(VLOOKUP($A36,Purpose!$B:$N,13,FALSE),VLOOKUP($A36,DataCollection!$B:$N,13,FALSE)),VLOOKUP($A36,Analysis!$B:$N,13,FALSE)),VLOOKUP($A36,Reporting!$B:$N,13,FALSE)),VLOOKUP($A36,UsingData!$B:$N,13,FALSE)),VLOOKUP($A36,Evaluation!$B:$N,13,FALSE)),VLOOKUP($A36,CrossSystem!$B:$N,13,FALSE))","v":0},{"$f":"IF(Participants!$E$12=\"\",\"-\",Participants!$E$12)","v":"-"}]
["E-DC1-n","Element","DataCollection","DC 1","n","Procedures make it possible for all families to participate in the data collection, including those with low literacy levels and non-English speakers.",{"$f":"IFERROR(IFERROR(IFERROR(IFERROR(IFERROR(IFERROR(VLOOKUP($A37,Purpose!$B:$N,11,FALSE),VLOOKUP($A37,DataCollection!$B:$N,11,FALSE)),VLOOKUP($A37,Analysis!$B:$N,11,FALSE)),VLOOKUP($A37,Reporting!$B:$N,11,FALSE)),VLOOKUP($A37,UsingData!$B:$N,11,FALSE)),VLOOKUP($A37,Evaluation!$B:$N,11,FALSE)),VLOOKUP($A37,CrossSystem!$B:$N,11,FALSE))","v":0},"-",{"$f":"IFERROR(IFERROR(IFERROR(IFERROR(IFERROR(IFERROR(VLOOKUP($A37,Purpose!$B:$N,13,FALSE),VLOOKUP($A37,DataCollection!$B:$N,13,FALSE)),VLOOKUP($A37,Analysis!$B:$N,13,FALSE)),VLOOKUP($A37,Reporting!$B:$N,13,FALSE)),VLOOKUP($A37,UsingData!$B:$N,13,FALSE)),VLOOKUP($A37,Evaluation!$B:$N,13,FALSE)),VLOOKUP($A37,CrossSystem!$B:$N,13,FALSE))","v":0},{"$f":"IF(Participants!$E$12=\"\",\"-\",Participants!$E$12)","v":"-"}]
["E-DC1-o","Element","DataCollection","DC 1","o","If state is conducting multiple data collections with families (e.g., two different surveys), state has coordinated these data collections through an overall plan. (Select “Not applicable” if there are not multiple data collections with families.)",{"$f":"IFERROR(IFERROR(IFERROR(IFERROR(IFERROR(IFERROR(VLOOKUP($A38,Purpose!$B:$N,11,FALSE),VLOOKUP($A38,DataCollection!$B:$N,11,FALSE)),VLOOKUP($A38,Analysis!$B:$N,11,FALSE)),VLOOKUP($A38,Reporting!$B:$N,11,FALSE)),VLOOKUP($A38,UsingData!$B:$N,11,FALSE)),VLOOKUP($A38,Evaluation!$B:$N,11,FALSE)),VLOOKUP($A38,CrossSystem!$B:$N,11,FALSE))","v":0},"-",{"$f":"IFERROR(IFERROR(IFERROR(IFERROR(IFERROR(IFERROR(VLOOKUP($A38,Purpose!$B:$N,13,FALSE),VLOOKUP($A38,DataCollection!$B:$N,13,FALSE)),VLOOKUP($A38,Analysis!$B:$N,13,FALSE)),VLOOKUP($A38,Reporting!$B:$N,13,FALSE)),VLOOKUP($A38,UsingData!$B:$N,13,FALSE)),VLOOKUP($A38,Evaluation!$B:$N,13,FALSE)),VLOOKUP($A38,CrossSystem!$B:$N,13,FALSE))","v":0},{"$f":"IF(Participants!$E$12=\"\",\"-\",Participants!$E$12)","v":"-"}]
["E-DC1-p","Element","DataCollection","DC 1","p","Program staff are fully informed about the nature and the purpose of the data collection, including service providers or others who regularly have contact with families.",{"$f":"IFERROR(IFERROR(IFERROR(IFERROR(IFERROR(IFERROR(VLOOKUP($A39,Purpose!$B:$N,11,FALSE),VLOOKUP($A39,DataCollection!$B:$N,11,FALSE)),VLOOKUP($A39,Analysis!$B:$N,11,FALSE)),VLOOKUP($A39,Reporting!$B:$N,11,FALSE)),VLOOKUP($A39,UsingData!$B:$N,11,FALSE)),VLOOKUP($A39,Evaluation!$B:$N,11,FALSE)),VLOOKUP($A39,CrossSystem!$B:$N,11,FALSE))","v":0},"-",{"$f":"IFERROR(IFERROR(IFERROR(IFERROR(IFERROR(IFERROR(VLOOKUP($A39,Purpose!$B:$N,13,FALSE),VLOOKUP($A39,DataCollection!$B:$N,13,FALSE)),VLOOKUP($A39,Analysis!$B:$N,13,FALSE)),VLOOKUP($A39,Reporting!$B:$N,13,FALSE)),VLOOKUP($A39,UsingData!$B:$N,13,FALSE)),VLOOKUP($A39,Evaluation!$B:$N,13,FALSE)),VLOOKUP($A39,CrossSystem!$B:$N,13,FALSE))","v":0},{"$f":"IF(Participants!$E$12=\"\",\"-\",Participants!$E$12)","v":"-"}]
["E-DC2-a","Element","DataCollection","DC 2","a","Data on family experiences and outcomes are entered efficiently and accurately.",{"$f":"IFERROR(IFERROR(IFERROR(IFERROR(IFERROR(IFERROR(VLOOKUP($A40,Purpose!$B:$N,11,FALSE),VLOOKUP($A40,DataCollection!$B:$N,11,FALSE)),VLOOKUP($A40,Analysis!$B:$N,11,FALSE)),VLOOKUP($A40,Reporting!$B:$N,11,FALSE)),VLOOKUP($A40,UsingData!$B:$N,11,FALSE)),VLOOKUP($A40,Evaluation!$B:$N,11,FALSE)),VLOOKUP($A40,CrossSystem!$B:$N,11,FALSE))","v":0},"-",{"$f":"IFERROR(IFERROR(IFERROR(IFERROR(IFERROR(IFERROR(VLOOKUP($A40,Purpose!$B:$N,13,FALSE),VLOOKUP($A40,DataCollection!$B:$N,13,FALSE)),VLOOKUP($A40,Analysis!$B:$N,13,FALSE)),VLOOKUP($A40,Reporting!$B:$N,13,FALSE)),VLOOKUP($A40,UsingData!$B:$N,13,FALSE)),VLOOKUP($A40,Evaluation!$B:$N,13,FALSE)),VLOOKUP($A40,CrossSystem!$B:$N,13,FALSE))","v":0},{"$f":"IF(Participants!$E$12=\"\",\"-\",Participants!$E$12)","v":"-"}]
["E-DC2-b","Element","DataCollection","DC 2","b","Systematic checks on data entry are in place.",{"$f":"IFERROR(IFERROR(IFERROR(IFERROR(IFERROR(IFERROR(VLOOKUP($A41,Purpose!$B:$N,11,FALSE),VLOOKUP($A41,DataCollection!$B:$N,11,FALSE)),VLOOKUP($A41,Analysis!$B:$N,11,FALSE)),VLOOKUP($A41,Reporting!$B:$N,11,FALSE)),VLOOKUP($A41,UsingData!$B:$N,11,FALSE)),VLOOKUP($A41,Evaluation!$B:$N,11,FALSE)),VLOOKUP($A41,CrossSystem!$B:$N,11,FALSE))","v":0},"-",{"$f":"IFERROR(IFERROR(IFERROR(IFERROR(IFERROR(IFERROR(VLOOKUP($A41,Purpose!$B:$N,13,FALSE),VLOOKUP($A41,DataCollection!$B:$N,13,FALSE)),VLOOKUP($A41,Analysis!$B:$N,13,FALSE)),VLOOKUP($A41,Reporting!$B:$N,13,FALSE)),VLOOKUP($A41,UsingData!$B:$N,13,FALSE)),VLOOKUP($A41,Evaluation!$B:$N,13,FALSE)),VLOOKUP($A41,CrossSystem!$B:$N,13,FALSE))","v":0},{"$f":"IF(Participants!$E$12=\"\",\"-\",Participants!$E$12)","v":"-"}]
["E-DC2-c","Element","DataCollection","DC 2","c","Those entering and transmitting data have access to necessary hardware and software and know how to use them (e.g., scanning equipment is working properly).",{"$f":"IFERROR(IFERROR(IFERROR(IFERROR(IFERROR(IFERROR(VLOOKUP($A42,Purpose!$B:$N,11,FALSE),VLOOKUP($A42,DataCollection!$B:$N,11,FALSE)),VLOOKUP($A42,Analysis!$B:$N,11,FALSE)),VLOOKUP($A42,Reporting!$B:$N,11,FALSE)),VLOOKUP($A42,UsingData!$B:$N,11,FALSE)),VLOOKUP($A42,Evaluation!$B:$N,11,FALSE)),VLOOKUP($A42,CrossSystem!$B:$N,11,FALSE))","v":0},"-",{"$f":"IFERROR(IFERROR(IFERROR(IFERROR(IFERROR(IFERROR(VLOOKUP($A42,Purpose!$B:$N,13,FALSE),VLOOKUP($A42,DataCollection!$B:$N,13,FALSE)),VLOOKUP($A42,Analysis!$B:$N,13,FALSE)),VLOOKUP($A42,Reporting!$B:$N,13,FALSE)),VLOOKUP($A42,UsingData!$B:$N,13,FALSE)),VLOOKUP($A42,Evaluation!$B:$N,13,FALSE)),VLOOKUP($A42,CrossSystem!$B:$N,13,FALSE))","v":0},{"$f":"IF(Participants!$E$12=\"\",\"-\",Participants!$E$12)","v":"-"}]
["E-DC2-d","Element","DataCollection","DC 2","d","Technology support is effective.",{"$f":"IFERROR(IFERROR(IFERROR(IFERROR(IFERROR(IFERROR(VLOOKUP($A43,Purpose!$B:$N,11,FALSE),VLOOKUP($A43,DataCollection!$B:$N,11,FALSE)),VLOOKUP($A43,Analysis!$B:$N,11,FALSE)),VLOOKUP($A43,Reporting!$B:$N,11,FALSE)),VLOOKUP($A43,UsingData!$B:$N,11,FALSE)),VLOOKUP($A43,Evaluation!$B:$N,11,FALSE)),VLOOKUP($A43,CrossSystem!$B:$N,11,FALSE))","v":0},"-",{"$f":"IFERROR(IFERROR(IFERROR(IFERROR(IFERROR(IFERROR(VLOOKUP($A43,Purpose!$B:$N,13,FALSE),VLOOKUP($A43,DataCollection!$B:$N,13,FALSE)),VLOOKUP($A43,Analysis!$B:$N,13,FALSE)),VLOOKUP($A43,Reporting!$B:$N,13,FALSE)),VLOOKUP($A43,UsingData!$B:$N,13,FALSE)),VLOOKUP($A43,Evaluation!$B:$N,13,FALSE)),VLOOKUP($A43,CrossSystem!$B:$N,13,FALSE))","v":0},{"$f":"IF(Participants!$E$12=\"\",\"-\",Participants!$E$12)","v":"-"}]
["E-DC2-e","Element","DataCollection","DC 2","e","Procedures are in place to update the data system as needed and communicate changes to the users.",{"$f":"IFERROR(IFERROR(IFERROR(IFERROR(IFERROR(IFERROR(VLOOKUP($A44,Purpose!$B:$N,11,FALSE),VLOOKUP($A44,DataCollection!$B:$N,11,FALSE)),VLOOKUP($A44,Analysis!$B:$N,11,FALSE)),VLOOKUP($A44,Reporting!$B:$N,11,FALSE)),VLOOKUP($A44,UsingData!$B:$N,11,FALSE)),VLOOKUP($A44,Evaluation!$B:$N,11,FALSE)),VLOOKUP($A44,CrossSystem!$B:$N,11,FALSE))","v":0},"-",{"$f":"IFERROR(IFERROR(IFERROR(IFERROR(IFERROR(IFERROR(VLOOKUP($A44,Purpose!$B:$N,13,FALSE),VLOOKUP($A44,DataCollection!$B:$N,13,FALSE)),VLOOKUP($A44,Analysis!$B:$N,13,FALSE)),VLOOKUP($A44,Reporting!$B:$N,13,FALSE)),VLOOKUP($A44,UsingData!$B:$N,13,FALSE)),VLOOKUP($A44,Evaluation!$B:$N,13,FALSE)),VLOOKUP($A44,CrossSystem!$B:$N,13,FALSE))","v":0},{"$f":"IF(Participants!$E$12=\"\",\"-\",Participants!$E$12)","v":"-"}]
["E-DC2-f","Element","DataCollection","DC 2","f","Those handling data understand and protect confidentiality.",{"$f":"IFERROR(IFERROR(IFERROR(IFERROR(IFERROR(IFERROR(VLOOKUP($A45,Purpose!$B:$N,11,FALSE),VLOOKUP($A45,DataCollection!$B:$N,11,FALSE)),VLOOKUP($A45,Analysis!$B:$N,11,FALSE)),VLOOKUP($A45,Reporting!$B:$N,11,FALSE)),VLOOKUP($A45,UsingData!$B:$N,11,FALSE)),VLOOKUP($A45,Evaluation!$B:$N,11,FALSE)),VLOOKUP($A45,CrossSystem!$B:$N,11,FALSE))","v":0},"-",{"$f":"IFERROR(IFERROR(IFERROR(IFERROR(IFERROR(IFERROR(VLOOKUP($A45,Purpose!$B:$N,13,FALSE),VLOOKUP($A45,DataCollection!$B:$N,13,FALSE)),VLOOKUP($A45,Analysis!$B:$N,13,FALSE)),VLOOKUP($A45,Reporting!$B:$N,13,FALSE)),VLOOKUP($A45,UsingData!$B:$N,13,FALSE)),VLOOKUP($A45,Evaluation!$B:$N,13,FALSE)),VLOOKUP($A45,CrossSystem!$B:$N,13,FALSE))","v":0},{"$f":"IF(Participants!$E$12=\"\",\"-\",Participants!$E$12)","v":"-"}]
["E-DC2-g","Element","DataCollection","DC 2","g","Data system protects confidential information.",{"$f":"IFERROR(IFERROR(IFERROR(IFERROR(IFERROR(IFERROR(VLOOKUP($A46,Purpose!$B:$N,11,FALSE),VLOOKUP($A46,DataCollection!$B:$N,11,FALSE)),VLOOKUP($A46,Analysis!$B:$N,11,FALSE)),VLOOKUP($A46,Reporting!$B:$N,11,FALSE)),VLOOKUP($A46,UsingData!$B:$N,11,FALSE)),VLOOKUP($A46,Evaluation!$B:$N,11,FALSE)),VLOOKUP($A46,CrossSystem!$B:$N,11,FALSE))","v":0},"-",{"$f":"IFERROR(IFERROR(IFERROR(IFERROR(IFERROR(IFERROR(VLOOKUP($A46,Purpose!$B:$N,13,FALSE),VLOOKUP($A46,DataCollection!$B:$N,13,FALSE)),VLOOKUP($A46,Analysis!$B:$N,13,FALSE)),VLOOKUP($A46,Reporting!$B:$N,13,FALSE)),VLOOKUP($A46,UsingData!$B:$N,13,FALSE)),VLOOKUP($A46,Evaluation!$B:$N,13,FALSE)),VLOOKUP($A46,CrossSystem!$B:$N,13,FALSE))","v":0},{"$f":"IF(Participants!$E$12=\"\",\"-\",Participants!$E$12)","v":"-"}]
["E-DC2-h","Element","DataCollection","DC 2","h","Protocols for archiving data are in place.",{"$f":"IFERROR(IFERROR(IFERROR(IFERROR(IFERROR(IFERROR(VLOOKUP($A47,Purpose!$B:$N,11,FALSE),VLOOKUP($A47,DataCollection!$B:$N,11,FALSE)),VLOOKUP($A47,Analysis!$B:$N,11,FALSE)),VLOOKUP($A47,Reporting!$B:$N,11,FALSE)),VLOOKUP($A47,UsingData!$B:$N,11,FALSE)),VLOOKUP($A47,Evaluation!$B:$N,11,FALSE)),VLOOKUP($A47,CrossSystem!$B:$N,11,FALSE))","v":0},"-",{"$f":"IFERROR(IFERROR(IFERROR(IFERROR(IFERROR(IFERROR(VLOOKUP($A47,Purpose!$B:$N,13,FALSE),VLOOKUP($A47,DataCollection!$B:$N,13,FALSE)),VLOOKUP($A47,Analysis!$B:$N,13,FALSE)),VLOOKUP($A47,Reporting!$B:$N,13,FALSE)),VLOOKUP($A47,UsingData!$B:$N,13,FALSE)),VLOOKUP($A47,Evaluation!$B:$N,13,FALSE)),VLOOKUP($A47,CrossSystem!$B:$N,13,FALSE))","v":0},{"$f":"IF(Participants!$E$12=\"\",\"-\",Participants!$E$12)","v":"-"}]
["E-AN1-a","Element","Analysis","AN 1","a","State has a written set of publicly available accountability and program improvement questions related to family experiences and outcomes.",{"$f":"IFERROR(IFERROR(IFERROR(IFERROR(IFERROR(IFERROR(VLOOKUP($A48,Purpose!$B:$N,11,FALSE),VLOOKUP($A48,DataCollection!$B:$N,11,FALSE)),VLOOKUP($A48,Analysis!$B:$N,11,FALSE)),VLOOKUP($A48,Reporting!$B:$N,11,FALSE)),VLOOKUP($A48,UsingData!$B:$N,11,FALSE)),VLOOKUP($A48,Evaluation!$B:$N,11,FALSE)),VLOOKUP($A48,CrossSystem!$B:$N,11,FALSE))","v":0},"-",{"$f":"IFERROR(IFERROR(IFERROR(IFERROR(IFERROR(IFERROR(VLOOKUP($A48,Purpose!$B:$N,13,FALSE),VLOOKUP($A48,DataCollection!$B:$N,13,FALSE)),VLOOKUP($A48,Analysis!$B:$N,13,FALSE)),VLOOKUP($A48,Reporting!$B:$N,13,FALSE)),VLOOKUP($A48,UsingData!$B:$N,13,FALSE)),VLOOKUP($A48,Evaluation!$B:$N,13,FALSE)),VLOOKUP($A48,CrossSystem!$B:$N,13,FALSE))","v":0},{"$f":"IF(Participants!$F$12=\"\",\"-\",Participants!$F$12)","v":"-"}]
["E-AN1-b","Element","Analysis","AN 1","b","The questions were developed with broad stakeholder input, including that of families.",{"$f":"IFERROR(IFERROR(IFERROR(IFERROR(IFERROR(IFERROR(VLOOKUP($A49,Purpose!$B:$N,11,FALSE),VLOOKUP($A49,DataCollection!$B:$N,11,FALSE)),VLOOKUP($A49,Analysis!$B:$N,11,FALSE)),VLOOKUP($A49,Reporting!$B:$N,11,FALSE)),VLOOKUP($A49,UsingData!$B:$N,11,FALSE)),VLOOKUP($A49,Evaluation!$B:$N,11,FALSE)),VLOOKUP($A49,CrossSystem!$B:$N,11,FALSE))","v":0},"-",{"$f":"IFERROR(IFERROR(IFERROR(IFERROR(IFERROR(IFERROR(VLOOKUP($A49,Purpose!$B:$N,13,FALSE),VLOOKUP($A49,DataCollection!$B:$N,13,FALSE)),VLOOKUP($A49,Analysis!$B:$N,13,FALSE)),VLOOKUP($A49,Reporting!$B:$N,13,FALSE)),VLOOKUP($A49,UsingData!$B:$N,13,FALSE)),VLOOKUP($A49,Evaluation!$B:$N,13,FALSE)),VLOOKUP($A49,CrossSystem!$B:$N,13,FALSE))","v":0},{"$f":"IF(Participants!$F$12=\"\",\"-\",Participants!$F$12)","v":"-"}]
["E-AN1-c","Element","Analysis","AN 1","c","The questions are consistent with the purposes of the state’s family experiences and outcomes measurement system.",{"$f":"IFERROR(IFERROR(IFERROR(IFERROR(IFERROR(IFERROR(VLOOKUP($A50,Purpose!$B:$N,11,FALSE),VLOOKUP($A50,DataCollection!$B:$N,11,FALSE)),VLOOKUP($A50,Analysis!$B:$N,11,FALSE)),VLOOKUP($A50,Reporting!$B:$N,11,FALSE)),VLOOKUP($A50,UsingData!$B:$N,11,FALSE)),VLOOKUP($A50,Evaluation!$B:$N,11,FALSE)),VLOOKUP($A50,CrossSystem!$B:$N,11,FALSE))","v":0},"-",{"$f":"IFERROR(IFERROR(IFERROR(IFERROR(IFERROR(IFERROR(VLOOKUP($A50,Purpose!$B:$N,13,FALSE),VLOOKUP($A50,DataCollection!$B:$N,13,FALSE)),VLOOKUP($A50,Analysis!$B:$N,13,FALSE)),VLOOKUP($A50,Reporting!$B:$N,13,FALSE)),VLOOKUP($A50,UsingData!$B:$N,13,FALSE)),VLOOKUP($A50,Evaluation!$B:$N,13,FALSE)),VLOOKUP($A50,CrossSystem!$B:$N,13,FALSE))","v":0},{"$f":"IF(Participants!$F$12=\"\",\"-\",Participants!$F$12)","v":"-"}]
["E-AN1-d","Element","Analysis","AN 1","d","The questions address family outcomes and family’s experiences with service delivery.",{"$f":"IFERROR(IFERROR(IFERROR(IFERROR(IFERROR(IFERROR(VLOOKUP($A51,Purpose!$B:$N,11,FALSE),VLOOKUP($A51,DataCollection!$B:$N,11,FALSE)),VLOOKUP($A51,Analysis!$B:$N,11,FALSE)),VLOOKUP($A51,Reporting!$B:$N,11,FALSE)),VLOOKUP($A51,UsingData!$B:$N,11,FALSE)),VLOOKUP($A51,Evaluation!$B:$N,11,FALSE)),VLOOKUP($A51,CrossSystem!$B:$N,11,FALSE))","v":0},"-",{"$f":"IFERROR(IFERROR(IFERROR(IFERROR(IFERROR(IFERROR(VLOOKUP($A51,Purpose!$B:$N,13,FALSE),VLOOKUP($A51,DataCollection!$B:$N,13,FALSE)),VLOOKUP($A51,Analysis!$B:$N,13,FALSE)),VLOOKUP($A51,Reporting!$B:$N,13,FALSE)),VLOOKUP($A51,UsingData!$B:$N,13,FALSE)),VLOOKUP($A51,Evaluation!$B:$N,13,FALSE)),VLOOKUP($A51,CrossSystem!$B:$N,13,FALSE))","v":0},{"$f":"IF(Participants!$F$12=\"\",\"-\",Participants!$F$12)","v":"-"}]
["E-AN1-e","Element","Analysis","AN 1","e","The questions address how family experiences and outcomes relate to child, family, service, and system characteristics. These questions require the family survey be linked to a child identifier.",{"$f":"IFERROR(IFERROR(IFERROR(IFERROR(IFERROR(IFERROR(VLOOKUP($A52,Purpose!$B:$N,11,FALSE),VLOOKUP($A52,DataCollection!$B:$N,11,FALSE)),VLOOKUP($A52,Analysis!$B:$N,11,FALSE)),VLOOKUP($A52,Reporting!$B:$N,11,FALSE)),VLOOKUP($A52,UsingData!$B:$N,11,FALSE)),VLOOKUP($A52,Evaluation!$B:$N,11,FALSE)),VLOOKUP($A52,CrossSystem!$B:$N,11,FALSE))","v":0},"-",{"$f":"IFERROR(IFERROR(IFERROR(IFERROR(IFERROR(IFERROR(VLOOKUP($A52,Purpose!$B:$N,13,FALSE),VLOOKUP($A52,DataCollection!$B:$N,13,FALSE)),VLOOKUP($A52,Analysis!$B:$N,13,FALSE)),VLOOKUP($A52,Reporting!$B:$N,13,FALSE)),VLOOKUP($A52,UsingData!$B:$N,13,FALSE)),VLOOKUP($A52,Evaluation!$B:$N,13,FALSE)),VLOOKUP($A52,CrossSystem!$B:$N,13,FALSE))","v":0},{"$f":"IF(Participants!$F$12=\"\",\"-\",Participants!$F$12)","v":"-"}]
["E-AN1-f","Element","Analysis","AN 1","f","Answers to the questions will provide useful information for accountability and program improvement.",{"$f":"IFERROR(IFERROR(IFERROR(IFERROR(IFERROR(IFERROR(VLOOKUP($A53,Purpose!$B:$N,11,FALSE),VLOOKUP($A53,DataCollection!$B:$N,11,FALSE)),VLOOKUP($A53,Analysis!$B:$N,11,FALSE)),VLOOKUP($A53,Reporting!$B:$N,11,FALSE)),VLOOKUP($A53,UsingData!$B:$N,11,FALSE)),VLOOKUP($A53,Evaluation!$B:$N,11,FALSE)),VLOOKUP($A53,CrossSystem!$B:$N,11,FALSE))","v":0},"-",{"$f":"IFERROR(IFERROR(IFERROR(IFERROR(IFERROR(IFERROR(VLOOKUP($A53,Purpose!$B:$N,13,FALSE),VLOOKUP($A53,DataCollection!$B:$N,13,FALSE)),VLOOKUP($A53,Analysis!$B:$N,13,FALSE)),VLOOKUP($A53,Reporting!$B:$N,13,FALSE)),VLOOKUP($A53,UsingData!$B:$N,13,FALSE)),VLOOKUP($A53,Evaluation!$B:$N,13,FALSE)),VLOOKUP($A53,CrossSystem!$B:$N,13,FALSE))","v":0},{"$f":"IF(Participants!$F$12=\"\",\"-\",Participants!$F$12)","v":"-"}]
["E-AN1-g","Element","Analysis","AN 1","g","A process is in place for regularly reviewing and revising the questions.",{"$f":"IFERROR(IFERROR(IFERROR(IFERROR(IFERROR(IFERROR(VLOOKUP($A54,Purpose!$B:$N,11,FALSE),VLOOKUP($A54,DataCollection!$B:$N,11,FALSE)),VLOOKUP($A54,Analysis!$B:$N,11,FALSE)),VLOOKUP($A54,Reporting!$B:$N,11,FALSE)),VLOOKUP($A54,UsingData!$B:$N,11,FALSE)),VLOOKUP($A54,Evaluation!$B:$N,11,FALSE)),VLOOKUP($A54,CrossSystem!$B:$N,11,FALSE))","v":0},"-",{"$f":"IFERROR(IFERROR(IFERROR(IFERROR(IFERROR(IFERROR(VLOOKUP($A54,Purpose!$B:$N,13,FALSE),VLOOKUP($A54,DataCollection!$B:$N,13,FALSE)),VLOOKUP($A54,Analysis!$B:$N,13,FALSE)),VLOOKUP($A54,Reporting!$B:$N,13,FALSE)),VLOOKUP($A54,UsingData!$B:$N,13,FALSE)),VLOOKUP($A54,Evaluation!$B:$N,13,FALSE)),VLOOKUP($A54,CrossSystem!$B:$N,13,FALSE))","v":0},{"$f":"IF(Participants!$F$12=\"\",\"-\",Participants!$F$12)","v":"-"}]
["E-AN1-h","Element","Analysis","AN 1","h","State has policy or guidance that addresses local program responsibilities with regard to the development of accountability and program improvement questions.",{"$f":"IFERROR(IFERROR(IFERROR(IFERROR(IFERROR(IFERROR(VLOOKUP($A55,Purpose!$B:$N,11,FALSE),VLOOKUP($A55,DataCollection!$B:$N,11,FALSE)),VLOOKUP($A55,Analysis!$B:$N,11,FALSE)),VLOOKUP($A55,Reporting!$B:$N,11,FALSE)),VLOOKUP($A55,UsingData!$B:$N,11,FALSE)),VLOOKUP($A55,Evaluation!$B:$N,11,FALSE)),VLOOKUP($A55,CrossSystem!$B:$N,11,FALSE))","v":0},"-",{"$f":"IFERROR(IFERROR(IFERROR(IFERROR(IFERROR(IFERROR(VLOOKUP($A55,Purpose!$B:$N,13,FALSE),VLOOKUP($A55,DataCollection!$B:$N,13,FALSE)),VLOOKUP($A55,Analysis!$B:$N,13,FALSE)),VLOOKUP($A55,Reporting!$B:$N,13,FALSE)),VLOOKUP($A55,UsingData!$B:$N,13,FALSE)),VLOOKUP($A55,Evaluation!$B:$N,13,FALSE)),VLOOKUP($A55,CrossSystem!$B:$N,13,FALSE))","v":0},{"$f":"IF(Participants!$F$12=\"\",\"-\",Participants!$F$12)","v":"-"}]
["E-AN1-i","Element","Analysis","AN 1","i","State helps build the capacity of local programs to develop accountability and program improvement questions.",{"$f":"IFERROR(IFERROR(IFERROR(IFERROR(IFERROR(IFERROR(VLOOKUP($A56,Purpose!$B:$N,11,FALSE),VLOOKUP($A56,DataCollection!$B:$N,11,FALSE)),VLOOKUP($A56,Analysis!$B:$N,11,FALSE)),VLOOKUP($A56,Reporting!$B:$N,11,FALSE)),VLOOKUP($A56,UsingData!$B:$N,11,FALSE)),VLOOKUP($A56,Evaluation!$B:$N,11,FALSE)),VLOOKUP($A56,CrossSystem!$B:$N,11,FALSE))","v":0},"-",{"$f":"IFERROR(IFERROR(IFERROR(IFERROR(IFERROR(IFERROR(VLOOKUP($A56,Purpose!$B:$N,13,FALSE),VLOOKUP($A56,DataCollection!$B:$N,13,FALSE)),VLOOKUP($A56,Analysis!$B:$N,13,FALSE)),VLOOKUP($A56,Reporting!$B:$N,13,FALSE)),VLOOKUP($A56,UsingData!$B:$N,13,FALSE)),VLOOKUP($A56,Evaluation!$B:$N,13,FALSE)),VLOOKUP($A56,CrossSystem!$B:$N,13,FALSE))","v":0},{"$f":"IF(Participants!$F$12=\"\",\"-\",Participants!$F$12)","v":"-"}]
["E-AN2-a","Element","Analysis","AN 2","a","Local programs have a written set of publicly available accountability and program improvement questions related to family experiences and outcomes.",{"$f":"IF(Analysis!K33=\"No\",\"-\",IFERROR(IFERROR(IFERROR(IFERROR(IFERROR(IFERROR(VLOOKUP($A57,Purpose!$B:$N,11,FALSE),VLOOKUP($A57,DataCollection!$B:$N,11,FALSE)),VLOOKUP($A57,Analysis!$B:$N,11,FALSE)),VLOOKUP($A57,Reporting!$B:$N,11,FALSE)),VLOOKUP($A57,UsingData!$B:$N,11,FALSE)),VLOOKUP($A57,Evaluation!$B:$N,11,FALSE)),VLOOKUP($A57,CrossSystem!$B:$N,11,FALSE)))","v":0},"-",{"$f":"IF(Analysis!K33=\"No\",\"-\",IFERROR(IFERROR(IFERROR(IFERROR(IFERROR(IFERROR(VLOOKUP($A57,Purpose!$B:$N,13,FALSE),VLOOKUP($A57,DataCollection!$B:$N,13,FALSE)),VLOOKUP($A57,Analysis!$B:$N,13,FALSE)),VLOOKUP($A57,Reporting!$B:$N,13,FALSE)),VLOOKUP($A57,UsingData!$B:$N,13,FALSE)),VLOOKUP($A57,Evaluation!$B:$N,13,FALSE)),VLOOKUP($A57,CrossSystem!$B:$N,13,FALSE)))","v":0},{"$f":"IF(Participants!$F$12=\"\",\"-\",Participants!$F$12)","v":"-"},"G57 and I57 formulas different"]
["E-AN2-b","Element","Analysis","AN 2","b","The questions were developed with broad stakeholder input, including families.",{"$f":"IF(Analysis!K33=\"No\",\"-\",IFERROR(IFERROR(IFERROR(IFERROR(IFERROR(IFERROR(VLOOKUP($A58,Purpose!$B:$N,11,FALSE),VLOOKUP($A58,DataCollection!$B:$N,11,FALSE)),VLOOKUP($A58,Analysis!$B:$N,11,FALSE)),VLOOKUP($A58,Reporting!$B:$N,11,FALSE)),VLOOKUP($A58,UsingData!$B:$N,11,FALSE)),VLOOKUP($A58,Evaluation!$B:$N,11,FALSE)),VLOOKUP($A58,CrossSystem!$B:$N,11,FALSE)))","v":0},"-",{"$f":"IF(Analysis!K33=\"No\",\"-\",IFERROR(IFERROR(IFERROR(IFERROR(IFERROR(IFERROR(VLOOKUP($A58,Purpose!$B:$N,13,FALSE),VLOOKUP($A58,DataCollection!$B:$N,13,FALSE)),VLOOKUP($A58,Analysis!$B:$N,13,FALSE)),VLOOKUP($A58,Reporting!$B:$N,13,FALSE)),VLOOKUP($A58,UsingData!$B:$N,13,FALSE)),VLOOKUP($A58,Evaluation!$B:$N,13,FALSE)),VLOOKUP($A58,CrossSystem!$B:$N,13,FALSE)))","v":0},{"$f":"IF(Participants!$F$12=\"\",\"-\",Participants!$F$12)","v":"-"},"G58 and I58 formulas different"]
["E-AN2-c","Element","Analysis","AN 2","c","The questions are aligned with the vision and purposes of the state’s outcomes measurement system.",{"$f":"IF(Analysis!K33=\"No\",\"-\",IFERROR(IFERROR(IFERROR(IFERROR(IFERROR(IFERROR(VLOOKUP($A59,Purpose!$B:$N,11,FALSE),VLOOKUP($A59,DataCollection!$B:$N,11,FALSE)),VLOOKUP($A59,Analysis!$B:$N,11,FALSE)),VLOOKUP($A59,Reporting!$B:$N,11,FALSE)),VLOOKUP($A59,UsingData!$B:$N,11,FALSE)),VLOOKUP($A59,Evaluation!$B:$N,11,FALSE)),VLOOKUP($A59,CrossSystem!$B:$N,11,FALSE)))","v":0},"-",{"$f":"IF(Analysis!K33=\"No\",\"-\",IFERROR(IFERROR(IFERROR(IFERROR(IFERROR(IFERROR(VLOOKUP($A59,Purpose!$B:$N,13,FALSE),VLOOKUP($A59,DataCollection!$B:$N,13,FALSE)),VLOOKUP($A59,Analysis!$B:$N,13,FALSE)),VLOOKUP($A59,Reporting!$B:$N,13,FALSE)),VLOOKUP($A59,UsingData!$B:$N,13,FALSE)),VLOOKUP($A59,Evaluation!$B:$N,13,FALSE)),VLOOKUP($A59,CrossSystem!$B:$N,13,FALSE)))","v":0},{"$f":"IF(Participants!$F$12=\"\",\"-\",Participants!$F$12)","v":"-"},"G59 and I59 formulas different"]
["E-AN2-d","Element","Analysis","AN 2","d","The questions address family outcomes and family experiences with service delivery.",{"$f":"IF(Analysis!K33=\"No\",\"-\",IFERROR(IFERROR(IFERROR(IFERROR(IFERROR(IFERROR(VLOOKUP($A60,Purpose!$B:$N,11,FALSE),VLOOKUP($A60,DataCollection!$B:$N,11,FALSE)),VLOOKUP($A60,Analysis!$B:$N,11,FALSE)),VLOOKUP($A60,Reporting!$B:$N,11,FALSE)),VLOOKUP($A60,UsingData!$B:$N,11,FALSE)),VLOOKUP($A60,Evaluation!$B:$N,11,FALSE)),VLOOKUP($A60,CrossSystem!$B:$N,11,FALSE)))","v":0},"-",{"$f":"IF(Analysis!K33=\"No\",\"-\",IFERROR(IFERROR(IFERROR(IFERROR(IFERROR(IFERROR(VLOOKUP($A60,Purpose!$B:$N,13,FALSE),VLOOKUP($A60,DataCollection!$B:$N,13,FALSE)),VLOOKUP($A60,Analysis!$B:$N,13,FALSE)),VLOOKUP($A60,Reporting!$B:$N,13,FALSE)),VLOOKUP($A60,UsingData!$B:$N,13,FALSE)),VLOOKUP($A60,Evaluation!$B:$N,13,FALSE)),VLOOKUP($A60,CrossSystem!$B:$N,13,FALSE)))","v":0},{"$f":"IF(Participants!$F$12=\"\",\"-\",Participants!$F$12)","v":"-"},"G60 and I60 formulas different"]
["E-AN2-e","Element","Analysis","AN 2","e","The questions address how outcomes relate to child, family, and service characteristics. These questions require the family survey be linked to a child identifier.",{"$f":"IF(Analysis!K33=\"No\",\"-\",IFERROR(IFERROR(IFERROR(IFERROR(IFERROR(IFERROR(VLOOKUP($A61,Purpose!$B:$N,11,FALSE),VLOOKUP($A61,DataCollection!$B:$N,11,FALSE)),VLOOKUP($A61,Analysis!$B:$N,11,FALSE)),VLOOKUP($A61,Reporting!$B:$N,11,FALSE)),VLOOKUP($A61,UsingData!$B:$N,11,FALSE)),VLOOKUP($A61,Evaluation!$B:$N,11,FALSE)),VLOOKUP($A61,CrossSystem!$B:$N,11,FALSE)))","v":0},"-",{"$f":"IF(Analysis!K33=\"No\",\"-\",IFERROR(IFERROR(IFERROR(IFERROR(IFERROR(IFERROR(VLOOKUP($A61,Purpose!$B:$N,13,FALSE),VLOOKUP($A61,DataCollection!$B:$N,13,FALSE)),VLOOKUP($A61,Analysis!$B:$N,13,FALSE)),VLOOKUP($A61,Reporting!$B:$N,13,FALSE)),VLOOKUP($A61,UsingData!$B:$N,13,FALSE)),VLOOKUP($A61,Evaluation!$B:$N,13,FALSE)),VLOOKUP($A61,CrossSystem!$B:$N,13,FALSE)))","v":0},{"$f":"IF(Participants!$F$12=\"\",\"-\",Participants!$F$12)","v":"-"},"G61 and I61 formulas different"]
["E-AN2-f","Element","Analysis","AN 2","f","Answers to the questions will provide useful information for accountability and program improvement.",{"$f":"IFERROR(IFERROR(IFERROR(IFERROR(IFERROR(IFERROR(VLOOKUP($A62,Purpose!$B:$N,11,FALSE),VLOOKUP($A62,DataCollection!$B:$N,11,FALSE)),VLOOKUP($A62,Analysis!$B:$N,11,FALSE)),VLOOKUP($A62,Reporting!$B:$N,11,FALSE)),VLOOKUP($A62,UsingData!$B:$N,11,FALSE)),VLOOKUP($A62,Evaluation!$B:$N,11,FALSE)),VLOOKUP($A62,CrossSystem!$B:$N,11,FALSE))","v":0},"-",{"$f":"IFERROR(IFERROR(IFERROR(IFERROR(IFERROR(IFERROR(VLOOKUP($A62,Purpose!$B:$N,13,FALSE),VLOOKUP($A62,DataCollection!$B:$N,13,FALSE)),VLOOKUP($A62,Analysis!$B:$N,13,FALSE)),VLOOKUP($A62,Reporting!$B:$N,13,FALSE)),VLOOKUP($A62,UsingData!$B:$N,13,FALSE)),VLOOKUP($A62,Evaluation!$B:$N,13,FALSE)),VLOOKUP($A62,CrossSystem!$B:$N,13,FALSE))","v":0},{"$f":"IF(Participants!$F$12=\"\",\"-\",Participants!$F$12)","v":"-"}]
["E-AN2-g","Element","Analysis","AN 2","g","A process is in place for regularly reviewing and revising the questions.",{"$f":"IFERROR(IFERROR(IFERROR(IFERROR(IFERROR(IFERROR(VLOOKUP($A63,Purpose!$B:$N,11,FALSE),VLOOKUP($A63,DataCollection!$B:$N,11,FALSE)),VLOOKUP($A63,Analysis!$B:$N,11,FALSE)),VLOOKUP($A63,Reporting!$B:$N,11,FALSE)),VLOOKUP($A63,UsingData!$B:$N,11,FALSE)),VLOOKUP($A63,Evaluation!$B:$N,11,FALSE)),VLOOKUP($A63,CrossSystem!$B:$N,11,FALSE))","v":0},"-",{"$f":"IFERROR(IFERROR(IFERROR(IFERROR(IFERROR(IFERROR(VLOOKUP($A63,Purpose!$B:$N,13,FALSE),VLOOKUP($A63,DataCollection!$B:$N,13,FALSE)),VLOOKUP($A63,Analysis!$B:$N,13,FALSE)),VLOOKUP($A63,Reporting!$B:$N,13,FALSE)),VLOOKUP($A63,UsingData!$B:$N,13,FALSE)),VLOOKUP($A63,Evaluation!$B:$N,13,FALSE)),VLOOKUP($A63,CrossSystem!$B:$N,13,FALSE))","v":0},{"$f":"IF(Participants!$F$12=\"\",\"-\",Participants!$F$12)","v":"-"}]
["E-AN3-a","Element","Analysis","AN 3","a","State has sufficient resources to conduct data analyses in a timely and accurate manner.",{"$f":"IFERROR(IFERROR(IFERROR(IFERROR(IFERROR(IFERROR(VLOOKUP($A64,Purpose!$B:$N,11,FALSE),VLOOKUP($A64,DataCollection!$B:$N,11,FALSE)),VLOOKUP($A64,Analysis!$B:$N,11,FALSE)),VLOOKUP($A64,Reporting!$B:$N,11,FALSE)),VLOOKUP($A64,UsingData!$B:$N,11,FALSE)),VLOOKUP($A64,Evaluation!$B:$N,11,FALSE)),VLOOKUP($A64,CrossSystem!$B:$N,11,FALSE))","v":0},"-",{"$f":"IFERROR(IFERROR(IFERROR(IFERROR(IFERROR(IFERROR(VLOOKUP($A64,Purpose!$B:$N,13,FALSE),VLOOKUP($A64,DataCollection!$B:$N,13,FALSE)),VLOOKUP($A64,Analysis!$B:$N,13,FALSE)),VLOOKUP($A64,Reporting!$B:$N,13,FALSE)),VLOOKUP($A64,UsingData!$B:$N,13,FALSE)),VLOOKUP($A64,Evaluation!$B:$N,13,FALSE)),VLOOKUP($A64,CrossSystem!$B:$N,13,FALSE))","v":0},{"$f":"IF(Participants!$F$12=\"\",\"-\",Participants!$F$12)","v":"-"}]
["E-AN3-b","Element","Analysis","AN 3","b","State can access all data elements necessary to address state level questions.",{"$f":"IFERROR(IFERROR(IFERROR(IFERROR(IFERROR(IFERROR(VLOOKUP($A65,Purpose!$B:$N,11,FALSE),VLOOKUP($A65,DataCollection!$B:$N,11,FALSE)),VLOOKUP($A65,Analysis!$B:$N,11,FALSE)),VLOOKUP($A65,Reporting!$B:$N,11,FALSE)),VLOOKUP($A65,UsingData!$B:$N,11,FALSE)),VLOOKUP($A65,Evaluation!$B:$N,11,FALSE)),VLOOKUP($A65,CrossSystem!$B:$N,11,FALSE))","v":0},"-",{"$f":"IFERROR(IFERROR(IFERROR(IFERROR(IFERROR(IFERROR(VLOOKUP($A65,Purpose!$B:$N,13,FALSE),VLOOKUP($A65,DataCollection!$B:$N,13,FALSE)),VLOOKUP($A65,Analysis!$B:$N,13,FALSE)),VLOOKUP($A65,Reporting!$B:$N,13,FALSE)),VLOOKUP($A65,UsingData!$B:$N,13,FALSE)),VLOOKUP($A65,Evaluation!$B:$N,13,FALSE)),VLOOKUP($A65,CrossSystem!$B:$N,13,FALSE))","v":0},{"$f":"IF(Participants!$F$12=\"\",\"-\",Participants!$F$12)","v":"-"}]
["E-AN3-c","Element","Analysis","AN 3","c","State conducts analyses to address accountability and program improvement questions at least annually.",{"$f":"IFERROR(IFERROR(IFERROR(IFERROR(IFERROR(IFERROR(VLOOKUP($A66,Purpose!$B:$N,11,FALSE),VLOOKUP($A66,DataCollection!$B:$N,11,FALSE)),VLOOKUP($A66,Analysis!$B:$N,11,FALSE)),VLOOKUP($A66,Reporting!$B:$N,11,FALSE)),VLOOKUP($A66,UsingData!$B:$N,11,FALSE)),VLOOKUP($A66,Evaluation!$B:$N,11,FALSE)),VLOOKUP($A66,CrossSystem!$B:$N,11,FALSE))","v":0},"-",{"$f":"IFERROR(IFERROR(IFERROR(IFERROR(IFERROR(IFERROR(VLOOKUP($A66,Purpose!$B:$N,13,FALSE),VLOOKUP($A66,DataCollection!$B:$N,13,FALSE)),VLOOKUP($A66,Analysis!$B:$N,13,FALSE)),VLOOKUP($A66,Reporting!$B:$N,13,FALSE)),VLOOKUP($A66,UsingData!$B:$N,13,FALSE)),VLOOKUP($A66,Evaluation!$B:$N,13,FALSE)),VLOOKUP($A66,CrossSystem!$B:$N,13,FALSE))","v":0},{"$f":"IF(Participants!$F$12=\"\",\"-\",Participants!$F$12)","v":"-"}]
["E-AN3-d","Element","Analysis","AN 3","d","State conducts additional ad hoc analyses as needed.",{"$f":"IFERROR(IFERROR(IFERROR(IFERROR(IFERROR(IFERROR(VLOOKUP($A67,Purpose!$B:$N,11,FALSE),VLOOKUP($A67,DataCollection!$B:$N,11,FALSE)),VLOOKUP($A67,Analysis!$B:$N,11,FALSE)),VLOOKUP($A67,Reporting!$B:$N,11,FALSE)),VLOOKUP($A67,UsingData!$B:$N,11,FALSE)),VLOOKUP($A67,Evaluation!$B:$N,11,FALSE)),VLOOKUP($A67,CrossSystem!$B:$N,11,FALSE))","v":0},"-",{"$f":"IFERROR(IFERROR(IFERROR(IFERROR(IFERROR(IFERROR(VLOOKUP($A67,Purpose!$B:$N,13,FALSE),VLOOKUP($A67,DataCollection!$B:$N,13,FALSE)),VLOOKUP($A67,Analysis!$B:$N,13,FALSE)),VLOOKUP($A67,Reporting!$B:$N,13,FALSE)),VLOOKUP($A67,UsingData!$B:$N,13,FALSE)),VLOOKUP($A67,Evaluation!$B:$N,13,FALSE)),VLOOKUP($A67,CrossSystem!$B:$N,13,FALSE))","v":0},{"$f":"IF(Participants!$F$12=\"\",\"-\",Participants!$F$12)","v":"-"}]
["E-AN3-e","Element","Analysis","AN 3","e","State thoroughly documents analyses so that a new analyst could repeat the analyses and find the same results.",{"$f":"IFERROR(IFERROR(IFERROR(IFERROR(IFERROR(IFERROR(VLOOKUP($A68,Purpose!$B:$N,11,FALSE),VLOOKUP($A68,DataCollection!$B:$N,11,FALSE)),VLOOKUP($A68,Analysis!$B:$N,11,FALSE)),VLOOKUP($A68,Reporting!$B:$N,11,FALSE)),VLOOKUP($A68,UsingData!$B:$N,11,FALSE)),VLOOKUP($A68,Evaluation!$B:$N,11,FALSE)),VLOOKUP($A68,CrossSystem!$B:$N,11,FALSE))","v":0},"-",{"$f":"IFERROR(IFERROR(IFERROR(IFERROR(IFERROR(IFERROR(VLOOKUP($A68,Purpose!$B:$N,13,FALSE),VLOOKUP($A68,DataCollection!$B:$N,13,FALSE)),VLOOKUP($A68,Analysis!$B:$N,13,FALSE)),VLOOKUP($A68,Reporting!$B:$N,13,FALSE)),VLOOKUP($A68,UsingData!$B:$N,13,FALSE)),VLOOKUP($A68,Evaluation!$B:$N,13,FALSE)),VLOOKUP($A68,CrossSystem!$B:$N,13,FALSE))","v":0},{"$f":"IF(Participants!$F$12=\"\",\"-\",Participants!$F$12)","v":"-"}]
["E-AN3-f","Element","Analysis","AN 3","f","State provides support to local programs to build capacity to analyze local data. Support can include the state agency providing analyzed data to the local program.",{"$f":"IFERROR(IFERROR(IFERROR(IFERROR(IFERROR(IFERROR(VLOOKUP($A69,Purpose!$B:$N,11,FALSE),VLOOKUP($A69,DataCollection!$B:$N,11,FALSE)),VLOOKUP($A69,Analysis!$B:$N,11,FALSE)),VLOOKUP($A69,Reporting!$B:$N,11,FALSE)),VLOOKUP($A69,UsingData!$B:$N,11,FALSE)),VLOOKUP($A69,Evaluation!$B:$N,11,FALSE)),VLOOKUP($A69,CrossSystem!$B:$N,11,FALSE))","v":0},"-",{"$f":"IFERROR(IFERROR(IFERROR(IFERROR(IFERROR(IFERROR(VLOOKUP($A69,Purpose!$B:$N,13,FALSE),VLOOKUP($A69,DataCollection!$B:$N,13,FALSE)),VLOOKUP($A69,Analysis!$B:$N,13,FALSE)),VLOOKUP($A69,Reporting!$B:$N,13,FALSE)),VLOOKUP($A69,UsingData!$B:$N,13,FALSE)),VLOOKUP($A69,Evaluation!$B:$N,13,FALSE)),VLOOKUP($A69,CrossSystem!$B:$N,13,FALSE))","v":0},{"$f":"IF(Participants!$F$12=\"\",\"-\",Participants!$F$12)","v":"-"}]
["E-AN3-g","Element","Analysis","AN 3","g","State has policy or guidance that addresses local program responsibilities with regard to data analysis.",{"$f":"IFERROR(IFERROR(IFERROR(IFERROR(IFERROR(IFERROR(VLOOKUP($A70,Purpose!$B:$N,11,FALSE),VLOOKUP($A70,DataCollection!$B:$N,11,FALSE)),VLOOKUP($A70,Analysis!$B:$N,11,FALSE)),VLOOKUP($A70,Reporting!$B:$N,11,FALSE)),VLOOKUP($A70,UsingData!$B:$N,11,FALSE)),VLOOKUP($A70,Evaluation!$B:$N,11,FALSE)),VLOOKUP($A70,CrossSystem!$B:$N,11,FALSE))","v":0},"-",{"$f":"IFERROR(IFERROR(IFERROR(IFERROR(IFERROR(IFERROR(VLOOKUP($A70,Purpose!$B:$N,13,FALSE),VLOOKUP($A70,DataCollection!$B:$N,13,FALSE)),VLOOKUP($A70,Analysis!$B:$N,13,FALSE)),VLOOKUP($A70,Reporting!$B:$N,13,FALSE)),VLOOKUP($A70,UsingData!$B:$N,13,FALSE)),VLOOKUP($A70,Evaluation!$B:$N,13,FALSE)),VLOOKUP($A70,CrossSystem!$B:$N,13,FALSE))","v":0},{"$f":"IF(Participants!$F$12=\"\",\"-\",Participants!$F$12)","v":"-"}]
["E-AN4-a","Element","Analysis","AN 4","a","With appropriate safeguards (i.e., de-identified family experiences or outcomes data), local programs have access to the data elements necessary to address local accountability and program improvement questions.",{"$f":"IF(Analysis!K66=\"No\",\"-\",IFERROR(IFERROR(IFERROR(IFERROR(IFERROR(IFERROR(VLOOKUP($A71,Purpose!$B:$N,11,FALSE),VLOOKUP($A71,DataCollection!$B:$N,11,FALSE)),VLOOKUP($A71,Analysis!$B:$N,11,FALSE)),VLOOKUP($A71,Reporting!$B:$N,11,FALSE)),VLOOKUP($A71,UsingData!$B:$N,11,FALSE)),VLOOKUP($A71,Evaluation!$B:$N,11,FALSE)),VLOOKUP($A71,CrossSystem!$B:$N,11,FALSE)))","v":0},"-",{"$f":"IF(Analysis!K66=\"No\",\"-\",IFERROR(IFERROR(IFERROR(IFERROR(IFERROR(IFERROR(VLOOKUP($A71,Purpose!$B:$N,13,FALSE),VLOOKUP($A71,DataCollection!$B:$N,13,FALSE)),VLOOKUP($A71,Analysis!$B:$N,13,FALSE)),VLOOKUP($A71,Reporting!$B:$N,13,FALSE)),VLOOKUP($A71,UsingData!$B:$N,13,FALSE)),VLOOKUP($A71,Evaluation!$B:$N,13,FALSE)),VLOOKUP($A71,CrossSystem!$B:$N,13,FALSE)))","v":0},{"$f":"IF(Participants!$F$12=\"\",\"-\",Participants!$F$12)","v":"-"},"G71 and I71 formulas different"]
["E-AN4-b","Element","Analysis","AN 4","b","Local programs conduct analyses or work with another entity to conduct analyses in a timely and accurate manner.  ",{"$f":"IF(Analysis!K66=\"No\",\"-\",IFERROR(IFERROR(IFERROR(IFERROR(IFERROR(IFERROR(VLOOKUP($A72,Purpose!$B:$N,11,FALSE),VLOOKUP($A72,DataCollection!$B:$N,11,FALSE)),VLOOKUP($A72,Analysis!$B:$N,11,FALSE)),VLOOKUP($A72,Reporting!$B:$N,11,FALSE)),VLOOKUP($A72,UsingData!$B:$N,11,FALSE)),VLOOKUP($A72,Evaluation!$B:$N,11,FALSE)),VLOOKUP($A72,CrossSystem!$B:$N,11,FALSE)))","v":0},"-",{"$f":"IF(Analysis!K66=\"No\",\"-\",IFERROR(IFERROR(IFERROR(IFERROR(IFERROR(IFERROR(VLOOKUP($A72,Purpose!$B:$N,13,FALSE),VLOOKUP($A72,DataCollection!$B:$N,13,FALSE)),VLOOKUP($A72,Analysis!$B:$N,13,FALSE)),VLOOKUP($A72,Reporting!$B:$N,13,FALSE)),VLOOKUP($A72,UsingData!$B:$N,13,FALSE)),VLOOKUP($A72,Evaluation!$B:$N,13,FALSE)),VLOOKUP($A72,CrossSystem!$B:$N,13,FALSE)))","v":0},{"$f":"IF(Participants!$F$12=\"\",\"-\",Participants!$F$12)","v":"-"},"G72 and I72 formulas different"]
["E-AN4-c","Element","Analysis","AN 4","c","Local programs thoroughly document the analyses so that a new analyst could repeat the analyses and find the same results.",{"$f":"IF(Analysis!K66=\"No\",\"-\",IFERROR(IFERROR(IFERROR(IFERROR(IFERROR(IFERROR(VLOOKUP($A73,Purpose!$B:$N,11,FALSE),VLOOKUP($A73,DataCollection!$B:$N,11,FALSE)),VLOOKUP($A73,Analysis!$B:$N,11,FALSE)),VLOOKUP($A73,Reporting!$B:$N,11,FALSE)),VLOOKUP($A73,UsingData!$B:$N,11,FALSE)),VLOOKUP($A73,Evaluation!$B:$N,11,FALSE)),VLOOKUP($A73,CrossSystem!$B:$N,11,FALSE)))","v":0},"-",{"$f":"IF(Analysis!K66=\"No\",\"-\",IFERROR(IFERROR(IFERROR(IFERROR(IFERROR(IFERROR(VLOOKUP($A73,Purpose!$B:$N,13,FALSE),VLOOKUP($A73,DataCollection!$B:$N,13,FALSE)),VLOOKUP($A73,Analysis!$B:$N,13,FALSE)),VLOOKUP($A73,Reporting!$B:$N,13,FALSE)),VLOOKUP($A73,UsingData!$B:$N,13,FALSE)),VLOOKUP($A73,Evaluation!$B:$N,13,FALSE)),VLOOKUP($A73,CrossSystem!$B:$N,13,FALSE)))","v":0},{"$f":"IF(Participants!$F$12=\"\",\"-\",Participants!$F$12)","v":"-"},"G73 and I73 formulas different"]
["E-AN5-a","Element","Analysis","AN 5","a","State implements a process for checking the completeness and accuracy of the data.",{"$f":"IFERROR(IFERROR(IFERROR(IFERROR(IFERROR(IFERROR(VLOOKUP($A74,Purpose!$B:$N,11,FALSE),VLOOKUP($A74,DataCollection!$B:$N,11,FALSE)),VLOOKUP($A74,Analysis!$B:$N,11,FALSE)),VLOOKUP($A74,Reporting!$B:$N,11,FALSE)),VLOOKUP($A74,UsingData!$B:$N,11,FALSE)),VLOOKUP($A74,Evaluation!$B:$N,11,FALSE)),VLOOKUP($A74,CrossSystem!$B:$N,11,FALSE))","v":0},"-",{"$f":"IFERROR(IFERROR(IFERROR(IFERROR(IFERROR(IFERROR(VLOOKUP($A74,Purpose!$B:$N,13,FALSE),VLOOKUP($A74,DataCollection!$B:$N,13,FALSE)),VLOOKUP($A74,Analysis!$B:$N,13,FALSE)),VLOOKUP($A74,Reporting!$B:$N,13,FALSE)),VLOOKUP($A74,UsingData!$B:$N,13,FALSE)),VLOOKUP($A74,Evaluation!$B:$N,13,FALSE)),VLOOKUP($A74,CrossSystem!$B:$N,13,FALSE))","v":0},{"$f":"IF(Participants!$F$12=\"\",\"-\",Participants!$F$12)","v":"-"}]
["E-AN5-b","Element","Analysis","AN 5","b","The results of the process provide evidence that the data are high quality for the intended purposes.",{"$f":"IFERROR(IFERROR(IFERROR(IFERROR(IFERROR(IFERROR(VLOOKUP($A75,Purpose!$B:$N,11,FALSE),VLOOKUP($A75,DataCollection!$B:$N,11,FALSE)),VLOOKUP($A75,Analysis!$B:$N,11,FALSE)),VLOOKUP($A75,Reporting!$B:$N,11,FALSE)),VLOOKUP($A75,UsingData!$B:$N,11,FALSE)),VLOOKUP($A75,Evaluation!$B:$N,11,FALSE)),VLOOKUP($A75,CrossSystem!$B:$N,11,FALSE))","v":0},"-",{"$f":"IFERROR(IFERROR(IFERROR(IFERROR(IFERROR(IFERROR(VLOOKUP($A75,Purpose!$B:$N,13,FALSE),VLOOKUP($A75,DataCollection!$B:$N,13,FALSE)),VLOOKUP($A75,Analysis!$B:$N,13,FALSE)),VLOOKUP($A75,Reporting!$B:$N,13,FALSE)),VLOOKUP($A75,UsingData!$B:$N,13,FALSE)),VLOOKUP($A75,Evaluation!$B:$N,13,FALSE)),VLOOKUP($A75,CrossSystem!$B:$N,13,FALSE))","v":0},{"$f":"IF(Participants!$F$12=\"\",\"-\",Participants!$F$12)","v":"-"}]
["E-AN5-c","Element","Analysis","AN 5","c","State regularly tracks missing and incomplete data and has implemented a plan for reducing missing and incomplete data.",{"$f":"IFERROR(IFERROR(IFERROR(IFERROR(IFERROR(IFERROR(VLOOKUP($A76,Purpose!$B:$N,11,FALSE),VLOOKUP($A76,DataCollection!$B:$N,11,FALSE)),VLOOKUP($A76,Analysis!$B:$N,11,FALSE)),VLOOKUP($A76,Reporting!$B:$N,11,FALSE)),VLOOKUP($A76,UsingData!$B:$N,11,FALSE)),VLOOKUP($A76,Evaluation!$B:$N,11,FALSE)),VLOOKUP($A76,CrossSystem!$B:$N,11,FALSE))","v":0},"-",{"$f":"IFERROR(IFERROR(IFERROR(IFERROR(IFERROR(IFERROR(VLOOKUP($A76,Purpose!$B:$N,13,FALSE),VLOOKUP($A76,DataCollection!$B:$N,13,FALSE)),VLOOKUP($A76,Analysis!$B:$N,13,FALSE)),VLOOKUP($A76,Reporting!$B:$N,13,FALSE)),VLOOKUP($A76,UsingData!$B:$N,13,FALSE)),VLOOKUP($A76,Evaluation!$B:$N,13,FALSE)),VLOOKUP($A76,CrossSystem!$B:$N,13,FALSE))","v":0},{"$f":"IF(Participants!$F$12=\"\",\"-\",Participants!$F$12)","v":"-"}]
["E-AN5-d","Element","Analysis","AN 5","d","The state’s survey response rate is sufficient to provide valid generalization to the target population.",{"$f":"IFERROR(IFERROR(IFERROR(IFERROR(IFERROR(IFERROR(VLOOKUP($A77,Purpose!$B:$N,11,FALSE),VLOOKUP($A77,DataCollection!$B:$N,11,FALSE)),VLOOKUP($A77,Analysis!$B:$N,11,FALSE)),VLOOKUP($A77,Reporting!$B:$N,11,FALSE)),VLOOKUP($A77,UsingData!$B:$N,11,FALSE)),VLOOKUP($A77,Evaluation!$B:$N,11,FALSE)),VLOOKUP($A77,CrossSystem!$B:$N,11,FALSE))","v":0},"-",{"$f":"IFERROR(IFERROR(IFERROR(IFERROR(IFERROR(IFERROR(VLOOKUP($A77,Purpose!$B:$N,13,FALSE),VLOOKUP($A77,DataCollection!$B:$N,13,FALSE)),VLOOKUP($A77,Analysis!$B:$N,13,FALSE)),VLOOKUP($A77,Reporting!$B:$N,13,FALSE)),VLOOKUP($A77,UsingData!$B:$N,13,FALSE)),VLOOKUP($A77,Evaluation!$B:$N,13,FALSE)),VLOOKUP($A77,CrossSystem!$B:$N,13,FALSE))","v":0},{"$f":"IF(Participants!$F$12=\"\",\"-\",Participants!$F$12)","v":"-"}]
["E-AN5-e","Element","Analysis","AN 5","e","The data are representative at the state level.",{"$f":"IFERROR(IFERROR(IFERROR(IFERROR(IFERROR(IFERROR(VLOOKUP($A78,Purpose!$B:$N,11,FALSE),VLOOKUP($A78,DataCollection!$B:$N,11,FALSE)),VLOOKUP($A78,Analysis!$B:$N,11,FALSE)),VLOOKUP($A78,Reporting!$B:$N,11,FALSE)),VLOOKUP($A78,UsingData!$B:$N,11,FALSE)),VLOOKUP($A78,Evaluation!$B:$N,11,FALSE)),VLOOKUP($A78,CrossSystem!$B:$N,11,FALSE))","v":0},"-",{"$f":"IFERROR(IFERROR(IFERROR(IFERROR(IFERROR(IFERROR(VLOOKUP($A78,Purpose!$B:$N,13,FALSE),VLOOKUP($A78,DataCollection!$B:$N,13,FALSE)),VLOOKUP($A78,Analysis!$B:$N,13,FALSE)),VLOOKUP($A78,Reporting!$B:$N,13,FALSE)),VLOOKUP($A78,UsingData!$B:$N,13,FALSE)),VLOOKUP($A78,Evaluation!$B:$N,13,FALSE)),VLOOKUP($A78,CrossSystem!$B:$N,13,FALSE))","v":0},{"$f":"IF(Participants!$F$12=\"\",\"-\",Participants!$F$12)","v":"-"}]
["E-AN5-f","Element","Analysis","AN 5","f","The data are representative at the local program-level.",{"$f":"IFERROR(IFERROR(IFERROR(IFERROR(IFERROR(IFERROR(VLOOKUP($A79,Purpose!$B:$N,11,FALSE),VLOOKUP($A79,DataCollection!$B:$N,11,FALSE)),VLOOKUP($A79,Analysis!$B:$N,11,FALSE)),VLOOKUP($A79,Reporting!$B:$N,11,FALSE)),VLOOKUP($A79,UsingData!$B:$N,11,FALSE)),VLOOKUP($A79,Evaluation!$B:$N,11,FALSE)),VLOOKUP($A79,CrossSystem!$B:$N,11,FALSE))","v":0},"-",{"$f":"IFERROR(IFERROR(IFERROR(IFERROR(IFERROR(IFERROR(VLOOKUP($A79,Purpose!$B:$N,13,FALSE),VLOOKUP($A79,DataCollection!$B:$N,13,FALSE)),VLOOKUP($A79,Analysis!$B:$N,13,FALSE)),VLOOKUP($A79,Reporting!$B:$N,13,FALSE)),VLOOKUP($A79,UsingData!$B:$N,13,FALSE)),VLOOKUP($A79,Evaluation!$B:$N,13,FALSE)),VLOOKUP($A79,CrossSystem!$B:$N,13,FALSE))","v":0},{"$f":"IF(Participants!$F$12=\"\",\"-\",Participants!$F$12)","v":"-"}]
["E-RP1-a","Element","Reporting","RP 1","a","State has developed a comprehensive plan for interpreting, reporting, and communicating evidence related to family experiences and outcomes to relevant audiences, including families.",{"$f":"IFERROR(IFERROR(IFERROR(IFERROR(IFERROR(IFERROR(VLOOKUP($A80,Purpose!$B:$N,11,FALSE),VLOOKUP($A80,DataCollection!$B:$N,11,FALSE)),VLOOKUP($A80,Analysis!$B:$N,11,FALSE)),VLOOKUP($A80,Reporting!$B:$N,11,FALSE)),VLOOKUP($A80,UsingData!$B:$N,11,FALSE)),VLOOKUP($A80,Evaluation!$B:$N,11,FALSE)),VLOOKUP($A80,CrossSystem!$B:$N,11,FALSE))","v":0},"-",{"$f":"IFERROR(IFERROR(IFERROR(IFERROR(IFERROR(IFERROR(VLOOKUP($A80,Purpose!$B:$N,13,FALSE),VLOOKUP($A80,DataCollection!$B:$N,13,FALSE)),VLOOKUP($A80,Analysis!$B:$N,13,FALSE)),VLOOKUP($A80,Reporting!$B:$N,13,FALSE)),VLOOKUP($A80,UsingData!$B:$N,13,FALSE)),VLOOKUP($A80,Evaluation!$B:$N,13,FALSE)),VLOOKUP($A80,CrossSystem!$B:$N,13,FALSE))","v":0},{"$f":"IF(Participants!$G$12=\"\",\"-\",Participants!$G$12)","v":"-"}]
["E-RP1-b","Element","Reporting","RP 1","b","State has procedures in place to address confidentiality issues raised by analyses that produce cells with small numbers.",{"$f":"IFERROR(IFERROR(IFERROR(IFERROR(IFERROR(IFERROR(VLOOKUP($A81,Purpose!$B:$N,11,FALSE),VLOOKUP($A81,DataCollection!$B:$N,11,FALSE)),VLOOKUP($A81,Analysis!$B:$N,11,FALSE)),VLOOKUP($A81,Reporting!$B:$N,11,FALSE)),VLOOKUP($A81,UsingData!$B:$N,11,FALSE)),VLOOKUP($A81,Evaluation!$B:$N,11,FALSE)),VLOOKUP($A81,CrossSystem!$B:$N,11,FALSE))","v":0},"-",{"$f":"IFERROR(IFERROR(IFERROR(IFERROR(IFERROR(IFERROR(VLOOKUP($A81,Purpose!$B:$N,13,FALSE),VLOOKUP($A81,DataCollection!$B:$N,13,FALSE)),VLOOKUP($A81,Analysis!$B:$N,13,FALSE)),VLOOKUP($A81,Reporting!$B:$N,13,FALSE)),VLOOKUP($A81,UsingData!$B:$N,13,FALSE)),VLOOKUP($A81,Evaluation!$B:$N,13,FALSE)),VLOOKUP($A81,CrossSystem!$B:$N,13,FALSE))","v":0},{"$f":"IF(Participants!$G$12=\"\",\"-\",Participants!$G$12)","v":"-"}]
["E-RP1-c","Element","Reporting","RP 1","c","State agency conducts systematic and comprehensive review of analyses including consideration of possible interpretations about family experiences and outcomes and the relationships between these and child, family, service, and system characteristics.",{"$f":"IFERROR(IFERROR(IFERROR(IFERROR(IFERROR(IFERROR(VLOOKUP($A82,Purpose!$B:$N,11,FALSE),VLOOKUP($A82,DataCollection!$B:$N,11,FALSE)),VLOOKUP($A82,Analysis!$B:$N,11,FALSE)),VLOOKUP($A82,Reporting!$B:$N,11,FALSE)),VLOOKUP($A82,UsingData!$B:$N,11,FALSE)),VLOOKUP($A82,Evaluation!$B:$N,11,FALSE)),VLOOKUP($A82,CrossSystem!$B:$N,11,FALSE))","v":0},"-",{"$f":"IFERROR(IFERROR(IFERROR(IFERROR(IFERROR(IFERROR(VLOOKUP($A82,Purpose!$B:$N,13,FALSE),VLOOKUP($A82,DataCollection!$B:$N,13,FALSE)),VLOOKUP($A82,Analysis!$B:$N,13,FALSE)),VLOOKUP($A82,Reporting!$B:$N,13,FALSE)),VLOOKUP($A82,UsingData!$B:$N,13,FALSE)),VLOOKUP($A82,Evaluation!$B:$N,13,FALSE)),VLOOKUP($A82,CrossSystem!$B:$N,13,FALSE))","v":0},{"$f":"IF(Participants!$G$12=\"\",\"-\",Participants!$G$12)","v":"-"}]
[{"$f":"LEFT(B83,1)&\"-\"&LEFT(D83,2)&RIGHT(D83)&\"-\"&E83","v":"E-RP1-d"},"Element","Reporting","RP 1","d","Representative stakeholders are included in the process of review and interpretation. Interpretation reflects stakeholder input.",{"$f":"IFERROR(IFERROR(IFERROR(IFERROR(IFERROR(IFERROR(VLOOKUP($A83,Purpose!$B:$N,11,FALSE),VLOOKUP($A83,DataCollection!$B:$N,11,FALSE)),VLOOKUP($A83,Analysis!$B:$N,11,FALSE)),VLOOKUP($A83,Reporting!$B:$N,11,FALSE)),VLOOKUP($A83,UsingData!$B:$N,11,FALSE)),VLOOKUP($A83,Evaluation!$B:$N,11,FALSE)),VLOOKUP($A83,CrossSystem!$B:$N,11,FALSE))","v":0},"-",{"$f":"IFERROR(IFERROR(IFERROR(IFERROR(IFERROR(IFERROR(VLOOKUP($A83,Purpose!$B:$N,13,FALSE),VLOOKUP($A83,DataCollection!$B:$N,13,FALSE)),VLOOKUP($A83,Analysis!$B:$N,13,FALSE)),VLOOKUP($A83,Reporting!$B:$N,13,FALSE)),VLOOKUP($A83,UsingData!$B:$N,13,FALSE)),VLOOKUP($A83,Evaluation!$B:$N,13,FALSE)),VLOOKUP($A83,CrossSystem!$B:$N,13,FALSE))","v":0},{"$f":"IF(Participants!$G$12=\"\",\"-\",Participants!$G$12)","v":"-"}]
["E-RP1-e","Element","Reporting","RP 1","e","State agency leadership is knowledgeable about family experiences and outcomes and can explain the results to relevant audiences.",{"$f":"IFERROR(IFERROR(IFERROR(IFERROR(IFERROR(IFERROR(VLOOKUP($A84,Purpose!$B:$N,11,FALSE),VLOOKUP($A84,DataCollection!$B:$N,11,FALSE)),VLOOKUP($A84,Analysis!$B:$N,11,FALSE)),VLOOKUP($A84,Reporting!$B:$N,11,FALSE)),VLOOKUP($A84,UsingData!$B:$N,11,FALSE)),VLOOKUP($A84,Evaluation!$B:$N,11,FALSE)),VLOOKUP($A84,CrossSystem!$B:$N,11,FALSE))","v":0},"-",{"$f":"IFERROR(IFERROR(IFERROR(IFERROR(IFERROR(IFERROR(VLOOKUP($A84,Purpose!$B:$N,13,FALSE),VLOOKUP($A84,DataCollection!$B:$N,13,FALSE)),VLOOKUP($A84,Analysis!$B:$N,13,FALSE)),VLOOKUP($A84,Reporting!$B:$N,13,FALSE)),VLOOKUP($A84,UsingData!$B:$N,13,FALSE)),VLOOKUP($A84,Evaluation!$B:$N,13,FALSE)),VLOOKUP($A84,CrossSystem!$B:$N,13,FALSE))","v":0},{"$f":"IF(Participants!$G$12=\"\",\"-\",Participants!$G$12)","v":"-"}]
["E-RP1-f","Element","Reporting","RP 1","f","State communicates results to target audiences for intended purposes in appropriate formats.",{"$f":"IFERROR(IFERROR(IFERROR(IFERROR(IFERROR(IFERROR(VLOOKUP($A85,Purpose!$B:$N,11,FALSE),VLOOKUP($A85,DataCollection!$B:$N,11,FALSE)),VLOOKUP($A85,Analysis!$B:$N,11,FALSE)),VLOOKUP($A85,Reporting!$B:$N,11,FALSE)),VLOOKUP($A85,UsingData!$B:$N,11,FALSE)),VLOOKUP($A85,Evaluation!$B:$N,11,FALSE)),VLOOKUP($A85,CrossSystem!$B:$N,11,FALSE))","v":0},"-",{"$f":"IFERROR(IFERROR(IFERROR(IFERROR(IFERROR(IFERROR(VLOOKUP($A85,Purpose!$B:$N,13,FALSE),VLOOKUP($A85,DataCollection!$B:$N,13,FALSE)),VLOOKUP($A85,Analysis!$B:$N,13,FALSE)),VLOOKUP($A85,Reporting!$B:$N,13,FALSE)),VLOOKUP($A85,UsingData!$B:$N,13,FALSE)),VLOOKUP($A85,Evaluation!$B:$N,13,FALSE)),VLOOKUP($A85,CrossSystem!$B:$N,13,FALSE))","v":0},{"$f":"IF(Participants!$G$12=\"\",\"-\",Participants!$G$12)","v":"-"}]
["E-RP1-g","Element","Reporting","RP 1","g","State provides support to local programs related to interpreting and reporting family experiences and outcomes data.",{"$f":"IFERROR(IFERROR(IFERROR(IFERROR(IFERROR(IFERROR(VLOOKUP($A86,Purpose!$B:$N,11,FALSE),VLOOKUP($A86,DataCollection!$B:$N,11,FALSE)),VLOOKUP($A86,Analysis!$B:$N,11,FALSE)),VLOOKUP($A86,Reporting!$B:$N,11,FALSE)),VLOOKUP($A86,UsingData!$B:$N,11,FALSE)),VLOOKUP($A86,Evaluation!$B:$N,11,FALSE)),VLOOKUP($A86,CrossSystem!$B:$N,11,FALSE))","v":0},"-",{"$f":"IFERROR(IFERROR(IFERROR(IFERROR(IFERROR(IFERROR(VLOOKUP($A86,Purpose!$B:$N,13,FALSE),VLOOKUP($A86,DataCollection!$B:$N,13,FALSE)),VLOOKUP($A86,Analysis!$B:$N,13,FALSE)),VLOOKUP($A86,Reporting!$B:$N,13,FALSE)),VLOOKUP($A86,UsingData!$B:$N,13,FALSE)),VLOOKUP($A86,Evaluation!$B:$N,13,FALSE)),VLOOKUP($A86,CrossSystem!$B:$N,13,FALSE))","v":0},{"$f":"IF(Participants!$G$12=\"\",\"-\",Participants!$G$12)","v":"-"}]
["E-RP1-h","Element","Reporting","RP 1","h","State has policy or guidance that addresses local program responsibilities with regard to interpreting and sharing family experiences and outcomes data.",{"$f":"IFERROR(IFERROR(IFERROR(IFERROR(IFERROR(IFERROR(VLOOKUP($A87,Purpose!$B:$N,11,FALSE),VLOOKUP($A87,DataCollection!$B:$N,11,FALSE)),VLOOKUP($A87,Analysis!$B:$N,11,FALSE)),VLOOKUP($A87,Reporting!$B:$N,11,FALSE)),VLOOKUP($A87,UsingData!$B:$N,11,FALSE)),VLOOKUP($A87,Evaluation!$B:$N,11,FALSE)),VLOOKUP($A87,CrossSystem!$B:$N,11,FALSE))","v":0},"-",{"$f":"IFERROR(IFERROR(IFERROR(IFERROR(IFERROR(IFERROR(VLOOKUP($A87,Purpose!$B:$N,13,FALSE),VLOOKUP($A87,DataCollection!$B:$N,13,FALSE)),VLOOKUP($A87,Analysis!$B:$N,13,FALSE)),VLOOKUP($A87,Reporting!$B:$N,13,FALSE)),VLOOKUP($A87,UsingData!$B:$N,13,FALSE)),VLOOKUP($A87,Evaluation!$B:$N,13,FALSE)),VLOOKUP($A87,CrossSystem!$B:$N,13,FALSE))","v":0},{"$f":"IF(Participants!$G$12=\"\",\"-\",Participants!$G$12)","v":"-"}]
["E-RP2-a","Element","Reporting","RP 2","a","Local programs interpret, report, and communicate information related to family experiences and outcomes in a manner appropriate to the size of the program.",{"$f":"IF(Reporting!K31=\"No\",\"-\",IFERROR(IFERROR(IFERROR(IFERROR(IFERROR(IFERROR(VLOOKUP($A88,Purpose!$B:$N,11,FALSE),VLOOKUP($A88,DataCollection!$B:$N,11,FALSE)),VLOOKUP($A88,Analysis!$B:$N,11,FALSE)),VLOOKUP($A88,Reporting!$B:$N,11,FALSE)),VLOOKUP($A88,UsingData!$B:$N,11,FALSE)),VLOOKUP($A88,Evaluation!$B:$N,11,FALSE)),VLOOKUP($A88,CrossSystem!$B:$N,11,FALSE)))","v":0},"-",{"$f":"IF(Reporting!K31=\"No\",\"-\",IFERROR(IFERROR(IFERROR(IFERROR(IFERROR(IFERROR(VLOOKUP($A88,Purpose!$B:$N,13,FALSE),VLOOKUP($A88,DataCollection!$B:$N,13,FALSE)),VLOOKUP($A88,Analysis!$B:$N,13,FALSE)),VLOOKUP($A88,Reporting!$B:$N,13,FALSE)),VLOOKUP($A88,UsingData!$B:$N,13,FALSE)),VLOOKUP($A88,Evaluation!$B:$N,13,FALSE)),VLOOKUP($A88,CrossSystem!$B:$N,13,FALSE)))","v":0},{"$f":"IF(Participants!$G$12=\"\",\"-\",Participants!$G$12)","v":"-"},"G87 and I87 formulas different"]
["E-RP2-b","Element","Reporting","RP 2","b","Local programs have procedures in place to address confidentiality issues raised by analyses that produce cells with small numbers.",{"$f":"IF(Reporting!K31=\"No\",\"-\",IFERROR(IFERROR(IFERROR(IFERROR(IFERROR(IFERROR(VLOOKUP($A89,Purpose!$B:$N,11,FALSE),VLOOKUP($A89,DataCollection!$B:$N,11,FALSE)),VLOOKUP($A89,Analysis!$B:$N,11,FALSE)),VLOOKUP($A89,Reporting!$B:$N,11,FALSE)),VLOOKUP($A89,UsingData!$B:$N,11,FALSE)),VLOOKUP($A89,Evaluation!$B:$N,11,FALSE)),VLOOKUP($A89,CrossSystem!$B:$N,11,FALSE)))","v":0},"-",{"$f":"IF(Reporting!K31=\"No\",\"-\",IFERROR(IFERROR(IFERROR(IFERROR(IFERROR(IFERROR(VLOOKUP($A89,Purpose!$B:$N,13,FALSE),VLOOKUP($A89,DataCollection!$B:$N,13,FALSE)),VLOOKUP($A89,Analysis!$B:$N,13,FALSE)),VLOOKUP($A89,Reporting!$B:$N,13,FALSE)),VLOOKUP($A89,UsingData!$B:$N,13,FALSE)),VLOOKUP($A89,Evaluation!$B:$N,13,FALSE)),VLOOKUP($A89,CrossSystem!$B:$N,13,FALSE)))","v":0},{"$f":"IF(Participants!$G$12=\"\",\"-\",Participants!$G$12)","v":"-"},"G89 and I89 formulas different"]
["E-RP2-c","Element","Reporting","RP 2","c","Local programs conduct a systematic and comprehensive review of analyses including consideration of possible interpretations about family experiences and outcomes and the relationships between these and child, family, service, and system characteristics per the program’s questions.",{"$f":"IF(Reporting!K31=\"No\",\"-\",IFERROR(IFERROR(IFERROR(IFERROR(IFERROR(IFERROR(VLOOKUP($A90,Purpose!$B:$N,11,FALSE),VLOOKUP($A90,DataCollection!$B:$N,11,FALSE)),VLOOKUP($A90,Analysis!$B:$N,11,FALSE)),VLOOKUP($A90,Reporting!$B:$N,11,FALSE)),VLOOKUP($A90,UsingData!$B:$N,11,FALSE)),VLOOKUP($A90,Evaluation!$B:$N,11,FALSE)),VLOOKUP($A90,CrossSystem!$B:$N,11,FALSE)))","v":0},"-",{"$f":"IF(Reporting!K31=\"No\",\"-\",IFERROR(IFERROR(IFERROR(IFERROR(IFERROR(IFERROR(VLOOKUP($A90,Purpose!$B:$N,13,FALSE),VLOOKUP($A90,DataCollection!$B:$N,13,FALSE)),VLOOKUP($A90,Analysis!$B:$N,13,FALSE)),VLOOKUP($A90,Reporting!$B:$N,13,FALSE)),VLOOKUP($A90,UsingData!$B:$N,13,FALSE)),VLOOKUP($A90,Evaluation!$B:$N,13,FALSE)),VLOOKUP($A90,CrossSystem!$B:$N,13,FALSE)))","v":0},{"$f":"IF(Participants!$G$12=\"\",\"-\",Participants!$G$12)","v":"-"},"G90 and I90 formulas different"]
["E-RP2-d","Element","Reporting","RP 2","d","Local programs include representative stakeholders in the process of developing interpretations of the data. Interpretations reflect stakeholder input.",{"$f":"IF(Reporting!K31=\"No\",\"-\",IFERROR(IFERROR(IFERROR(IFERROR(IFERROR(IFERROR(VLOOKUP($A91,Purpose!$B:$N,11,FALSE),VLOOKUP($A91,DataCollection!$B:$N,11,FALSE)),VLOOKUP($A91,Analysis!$B:$N,11,FALSE)),VLOOKUP($A91,Reporting!$B:$N,11,FALSE)),VLOOKUP($A91,UsingData!$B:$N,11,FALSE)),VLOOKUP($A91,Evaluation!$B:$N,11,FALSE)),VLOOKUP($A91,CrossSystem!$B:$N,11,FALSE)))","v":0},"-",{"$f":"IF(Reporting!K31=\"No\",\"-\",IFERROR(IFERROR(IFERROR(IFERROR(IFERROR(IFERROR(VLOOKUP($A91,Purpose!$B:$N,13,FALSE),VLOOKUP($A91,DataCollection!$B:$N,13,FALSE)),VLOOKUP($A91,Analysis!$B:$N,13,FALSE)),VLOOKUP($A91,Reporting!$B:$N,13,FALSE)),VLOOKUP($A91,UsingData!$B:$N,13,FALSE)),VLOOKUP($A91,Evaluation!$B:$N,13,FALSE)),VLOOKUP($A91,CrossSystem!$B:$N,13,FALSE)))","v":0},{"$f":"IF(Participants!$G$12=\"\",\"-\",Participants!$G$12)","v":"-"},"G91 and I91 formulas different"]
["E-RP2-e","Element","Reporting","RP 2","e","Local program staff are knowledgeable about family experiences and outcomes and can explain family experiences and outcomes results to relevant audiences.",{"$f":"IF(Reporting!K31=\"No\",\"-\",IFERROR(IFERROR(IFERROR(IFERROR(IFERROR(IFERROR(VLOOKUP($A92,Purpose!$B:$N,11,FALSE),VLOOKUP($A92,DataCollection!$B:$N,11,FALSE)),VLOOKUP($A92,Analysis!$B:$N,11,FALSE)),VLOOKUP($A92,Reporting!$B:$N,11,FALSE)),VLOOKUP($A92,UsingData!$B:$N,11,FALSE)),VLOOKUP($A92,Evaluation!$B:$N,11,FALSE)),VLOOKUP($A92,CrossSystem!$B:$N,11,FALSE)))","v":0},"-",{"$f":"IF(Reporting!K31=\"No\",\"-\",IFERROR(IFERROR(IFERROR(IFERROR(IFERROR(IFERROR(VLOOKUP($A92,Purpose!$B:$N,13,FALSE),VLOOKUP($A92,DataCollection!$B:$N,13,FALSE)),VLOOKUP($A92,Analysis!$B:$N,13,FALSE)),VLOOKUP($A92,Reporting!$B:$N,13,FALSE)),VLOOKUP($A92,UsingData!$B:$N,13,FALSE)),VLOOKUP($A92,Evaluation!$B:$N,13,FALSE)),VLOOKUP($A92,CrossSystem!$B:$N,13,FALSE)))","v":0},{"$f":"IF(Participants!$G$12=\"\",\"-\",Participants!$G$12)","v":"-"},"G92 and I92 formulas different"]
["E-RP2-f","Element","Reporting","RP 2","f","Local programs communicate results to target audiences for intended purposes in appropriate formats.",{"$f":"IF(Reporting!K31=\"No\",\"-\",IFERROR(IFERROR(IFERROR(IFERROR(IFERROR(IFERROR(VLOOKUP($A93,Purpose!$B:$N,11,FALSE),VLOOKUP($A93,DataCollection!$B:$N,11,FALSE)),VLOOKUP($A93,Analysis!$B:$N,11,FALSE)),VLOOKUP($A93,Reporting!$B:$N,11,FALSE)),VLOOKUP($A93,UsingData!$B:$N,11,FALSE)),VLOOKUP($A93,Evaluation!$B:$N,11,FALSE)),VLOOKUP($A93,CrossSystem!$B:$N,11,FALSE)))","v":0},"-",{"$f":"IF(Reporting!K31=\"No\",\"-\",IFERROR(IFERROR(IFERROR(IFERROR(IFERROR(IFERROR(VLOOKUP($A93,Purpose!$B:$N,13,FALSE),VLOOKUP($A93,DataCollection!$B:$N,13,FALSE)),VLOOKUP($A93,Analysis!$B:$N,13,FALSE)),VLOOKUP($A93,Reporting!$B:$N,13,FALSE)),VLOOKUP($A93,UsingData!$B:$N,13,FALSE)),VLOOKUP($A93,Evaluation!$B:$N,13,FALSE)),VLOOKUP($A93,CrossSystem!$B:$N,13,FALSE)))","v":0},{"$f":"IF(Participants!$G$12=\"\",\"-\",Participants!$G$12)","v":"-"},"G93 and I93 formulas different"]
["E-UD1-a","Element","UsingData","UD 1","a","State regularly implements a stakeholder process that includes families to consider the implications of family experiences and outcomes and other data.",{"$f":"IFERROR(IFERROR(IFERROR(IFERROR(IFERROR(IFERROR(VLOOKUP($A94,Purpose!$B:$N,11,FALSE),VLOOKUP($A94,DataCollection!$B:$N,11,FALSE)),VLOOKUP($A94,Analysis!$B:$N,11,FALSE)),VLOOKUP($A94,Reporting!$B:$N,11,FALSE)),VLOOKUP($A94,UsingData!$B:$N,11,FALSE)),VLOOKUP($A94,Evaluation!$B:$N,11,FALSE)),VLOOKUP($A94,CrossSystem!$B:$N,11,FALSE))","v":0},"-",{"$f":"IFERROR(IFERROR(IFERROR(IFERROR(IFERROR(IFERROR(VLOOKUP($A94,Purpose!$B:$N,13,FALSE),VLOOKUP($A94,DataCollection!$B:$N,13,FALSE)),VLOOKUP($A94,Analysis!$B:$N,13,FALSE)),VLOOKUP($A94,Reporting!$B:$N,13,FALSE)),VLOOKUP($A94,UsingData!$B:$N,13,FALSE)),VLOOKUP($A94,Evaluation!$B:$N,13,FALSE)),VLOOKUP($A94,CrossSystem!$B:$N,13,FALSE))","v":0},{"$f":"IF(Participants!$H$12=\"\",\"-\",Participants!$H$12)","v":"-"}]
["E-UD1-b","Element","UsingData","UD 1","b","As appropriate, state identifies some local programs for targeted support and then works with these programs to jointly develop action plans.",{"$f":"IFERROR(IFERROR(IFERROR(IFERROR(IFERROR(IFERROR(VLOOKUP($A95,Purpose!$B:$N,11,FALSE),VLOOKUP($A95,DataCollection!$B:$N,11,FALSE)),VLOOKUP($A95,Analysis!$B:$N,11,FALSE)),VLOOKUP($A95,Reporting!$B:$N,11,FALSE)),VLOOKUP($A95,UsingData!$B:$N,11,FALSE)),VLOOKUP($A95,Evaluation!$B:$N,11,FALSE)),VLOOKUP($A95,CrossSystem!$B:$N,11,FALSE))","v":0},"-",{"$f":"IFERROR(IFERROR(IFERROR(IFERROR(IFERROR(IFERROR(VLOOKUP($A95,Purpose!$B:$N,13,FALSE),VLOOKUP($A95,DataCollection!$B:$N,13,FALSE)),VLOOKUP($A95,Analysis!$B:$N,13,FALSE)),VLOOKUP($A95,Reporting!$B:$N,13,FALSE)),VLOOKUP($A95,UsingData!$B:$N,13,FALSE)),VLOOKUP($A95,Evaluation!$B:$N,13,FALSE)),VLOOKUP($A95,CrossSystem!$B:$N,13,FALSE))","v":0},{"$f":"IF(Participants!$H$12=\"\",\"-\",Participants!$H$12)","v":"-"}]
["E-UD1-c","Element","UsingData","UD 1","c","State identifies statewide systemic goals for improvement.",{"$f":"IFERROR(IFERROR(IFERROR(IFERROR(IFERROR(IFERROR(VLOOKUP($A96,Purpose!$B:$N,11,FALSE),VLOOKUP($A96,DataCollection!$B:$N,11,FALSE)),VLOOKUP($A96,Analysis!$B:$N,11,FALSE)),VLOOKUP($A96,Reporting!$B:$N,11,FALSE)),VLOOKUP($A96,UsingData!$B:$N,11,FALSE)),VLOOKUP($A96,Evaluation!$B:$N,11,FALSE)),VLOOKUP($A96,CrossSystem!$B:$N,11,FALSE))","v":0},"-",{"$f":"IFERROR(IFERROR(IFERROR(IFERROR(IFERROR(IFERROR(VLOOKUP($A96,Purpose!$B:$N,13,FALSE),VLOOKUP($A96,DataCollection!$B:$N,13,FALSE)),VLOOKUP($A96,Analysis!$B:$N,13,FALSE)),VLOOKUP($A96,Reporting!$B:$N,13,FALSE)),VLOOKUP($A96,UsingData!$B:$N,13,FALSE)),VLOOKUP($A96,Evaluation!$B:$N,13,FALSE)),VLOOKUP($A96,CrossSystem!$B:$N,13,FALSE))","v":0},{"$f":"IF(Participants!$H$12=\"\",\"-\",Participants!$H$12)","v":"-"}]
["E-UD1-d","Element","UsingData","UD 1","d","State uses data to develop a comprehensive plan for program improvement.",{"$f":"IFERROR(IFERROR(IFERROR(IFERROR(IFERROR(IFERROR(VLOOKUP($A97,Purpose!$B:$N,11,FALSE),VLOOKUP($A97,DataCollection!$B:$N,11,FALSE)),VLOOKUP($A97,Analysis!$B:$N,11,FALSE)),VLOOKUP($A97,Reporting!$B:$N,11,FALSE)),VLOOKUP($A97,UsingData!$B:$N,11,FALSE)),VLOOKUP($A97,Evaluation!$B:$N,11,FALSE)),VLOOKUP($A97,CrossSystem!$B:$N,11,FALSE))","v":0},"-",{"$f":"IFERROR(IFERROR(IFERROR(IFERROR(IFERROR(IFERROR(VLOOKUP($A97,Purpose!$B:$N,13,FALSE),VLOOKUP($A97,DataCollection!$B:$N,13,FALSE)),VLOOKUP($A97,Analysis!$B:$N,13,FALSE)),VLOOKUP($A97,Reporting!$B:$N,13,FALSE)),VLOOKUP($A97,UsingData!$B:$N,13,FALSE)),VLOOKUP($A97,Evaluation!$B:$N,13,FALSE)),VLOOKUP($A97,CrossSystem!$B:$N,13,FALSE))","v":0},{"$f":"IF(Participants!$H$12=\"\",\"-\",Participants!$H$12)","v":"-"}]
["E-UD1-e","Element","UsingData","UD 1","e","State implements and evaluates program improvement activities on a regular cycle.",{"$f":"IFERROR(IFERROR(IFERROR(IFERROR(IFERROR(IFERROR(VLOOKUP($A98,Purpose!$B:$N,11,FALSE),VLOOKUP($A98,DataCollection!$B:$N,11,FALSE)),VLOOKUP($A98,Analysis!$B:$N,11,FALSE)),VLOOKUP($A98,Reporting!$B:$N,11,FALSE)),VLOOKUP($A98,UsingData!$B:$N,11,FALSE)),VLOOKUP($A98,Evaluation!$B:$N,11,FALSE)),VLOOKUP($A98,CrossSystem!$B:$N,11,FALSE))","v":0},"-",{"$f":"IFERROR(IFERROR(IFERROR(IFERROR(IFERROR(IFERROR(VLOOKUP($A98,Purpose!$B:$N,13,FALSE),VLOOKUP($A98,DataCollection!$B:$N,13,FALSE)),VLOOKUP($A98,Analysis!$B:$N,13,FALSE)),VLOOKUP($A98,Reporting!$B:$N,13,FALSE)),VLOOKUP($A98,UsingData!$B:$N,13,FALSE)),VLOOKUP($A98,Evaluation!$B:$N,13,FALSE)),VLOOKUP($A98,CrossSystem!$B:$N,13,FALSE))","v":0},{"$f":"IF(Participants!$H$12=\"\",\"-\",Participants!$H$12)","v":"-"}]
["E-UD1-f","Element","UsingData","UD 1","f","State provides data and support to local programs related to use of data for program improvement.",{"$f":"IFERROR(IFERROR(IFERROR(IFERROR(IFERROR(IFERROR(VLOOKUP($A99,Purpose!$B:$N,11,FALSE),VLOOKUP($A99,DataCollection!$B:$N,11,FALSE)),VLOOKUP($A99,Analysis!$B:$N,11,FALSE)),VLOOKUP($A99,Reporting!$B:$N,11,FALSE)),VLOOKUP($A99,UsingData!$B:$N,11,FALSE)),VLOOKUP($A99,Evaluation!$B:$N,11,FALSE)),VLOOKUP($A99,CrossSystem!$B:$N,11,FALSE))","v":0},"-",{"$f":"IFERROR(IFERROR(IFERROR(IFERROR(IFERROR(IFERROR(VLOOKUP($A99,Purpose!$B:$N,13,FALSE),VLOOKUP($A99,DataCollection!$B:$N,13,FALSE)),VLOOKUP($A99,Analysis!$B:$N,13,FALSE)),VLOOKUP($A99,Reporting!$B:$N,13,FALSE)),VLOOKUP($A99,UsingData!$B:$N,13,FALSE)),VLOOKUP($A99,Evaluation!$B:$N,13,FALSE)),VLOOKUP($A99,CrossSystem!$B:$N,13,FALSE))","v":0},{"$f":"IF(Participants!$H$12=\"\",\"-\",Participants!$H$12)","v":"-"}]
["E-UD1-g","Element","UsingData","UD 1","g","State has policy or guidance that addresses local program responsibilities with regard to use of data for program improvement.",{"$f":"IFERROR(IFERROR(IFERROR(IFERROR(IFERROR(IFERROR(VLOOKUP($A100,Purpose!$B:$N,11,FALSE),VLOOKUP($A100,DataCollection!$B:$N,11,FALSE)),VLOOKUP($A100,Analysis!$B:$N,11,FALSE)),VLOOKUP($A100,Reporting!$B:$N,11,FALSE)),VLOOKUP($A100,UsingData!$B:$N,11,FALSE)),VLOOKUP($A100,Evaluation!$B:$N,11,FALSE)),VLOOKUP($A100,CrossSystem!$B:$N,11,FALSE))","v":0},"-",{"$f":"IFERROR(IFERROR(IFERROR(IFERROR(IFERROR(IFERROR(VLOOKUP($A100,Purpose!$B:$N,13,FALSE),VLOOKUP($A100,DataCollection!$B:$N,13,FALSE)),VLOOKUP($A100,Analysis!$B:$N,13,FALSE)),VLOOKUP($A100,Reporting!$B:$N,13,FALSE)),VLOOKUP($A100,UsingData!$B:$N,13,FALSE)),VLOOKUP($A100,Evaluation!$B:$N,13,FALSE)),VLOOKUP($A100,CrossSystem!$B:$N,13,FALSE))","v":0},{"$f":"IF(Participants!$H$12=\"\",\"-\",Participants!$H$12)","v":"-"}]
["E-UD2-a","Element","UsingData","UD 2","a","Local programs regularly implement a stakeholder process that includes families for considering the implications of family experiences and outcomes data and other data.",{"$f":"IF(UsingData!K29=\"No\",\"-\",IFERROR(IFERROR(IFERROR(IFERROR(IFERROR(IFERROR(VLOOKUP($A101,Purpose!$B:$N,11,FALSE),VLOOKUP($A101,DataCollection!$B:$N,11,FALSE)),VLOOKUP($A101,Analysis!$B:$N,11,FALSE)),VLOOKUP($A101,Reporting!$B:$N,11,FALSE)),VLOOKUP($A101,UsingData!$B:$N,11,FALSE)),VLOOKUP($A101,Evaluation!$B:$N,11,FALSE)),VLOOKUP($A101,CrossSystem!$B:$N,11,FALSE)))","v":0},"-",{"$f":"IF(UsingData!K29=\"No\",\"-\",IFERROR(IFERROR(IFERROR(IFERROR(IFERROR(IFERROR(VLOOKUP($A101,Purpose!$B:$N,13,FALSE),VLOOKUP($A101,DataCollection!$B:$N,13,FALSE)),VLOOKUP($A101,Analysis!$B:$N,13,FALSE)),VLOOKUP($A101,Reporting!$B:$N,13,FALSE)),VLOOKUP($A101,UsingData!$B:$N,13,FALSE)),VLOOKUP($A101,Evaluation!$B:$N,13,FALSE)),VLOOKUP($A101,CrossSystem!$B:$N,13,FALSE)))","v":0},{"$f":"IF(Participants!$H$12=\"\",\"-\",Participants!$H$12)","v":"-"},"G101 and I101 formulas different"]
["E-UD2-b","Element","UsingData","UD 2","b","Local programs use data to develop a comprehensive plan for program improvement.",{"$f":"IF(UsingData!K29=\"No\",\"-\",IFERROR(IFERROR(IFERROR(IFERROR(IFERROR(IFERROR(VLOOKUP($A102,Purpose!$B:$N,11,FALSE),VLOOKUP($A102,DataCollection!$B:$N,11,FALSE)),VLOOKUP($A102,Analysis!$B:$N,11,FALSE)),VLOOKUP($A102,Reporting!$B:$N,11,FALSE)),VLOOKUP($A102,UsingData!$B:$N,11,FALSE)),VLOOKUP($A102,Evaluation!$B:$N,11,FALSE)),VLOOKUP($A102,CrossSystem!$B:$N,11,FALSE)))","v":0},"-",{"$f":"IF(UsingData!K29=\"No\",\"-\",IFERROR(IFERROR(IFERROR(IFERROR(IFERROR(IFERROR(VLOOKUP($A102,Purpose!$B:$N,13,FALSE),VLOOKUP($A102,DataCollection!$B:$N,13,FALSE)),VLOOKUP($A102,Analysis!$B:$N,13,FALSE)),VLOOKUP($A102,Reporting!$B:$N,13,FALSE)),VLOOKUP($A102,UsingData!$B:$N,13,FALSE)),VLOOKUP($A102,Evaluation!$B:$N,13,FALSE)),VLOOKUP($A102,CrossSystem!$B:$N,13,FALSE)))","v":0},{"$f":"IF(Participants!$H$12=\"\",\"-\",Participants!$H$12)","v":"-"},"G102 and I102 formulas different"]
["E-UD2-c","Element","UsingData","UD 2","c","Local programs implement and evaluate program improvement activities on a regular cycle.",{"$f":"IF(UsingData!K29=\"No\",\"-\",IFERROR(IFERROR(IFERROR(IFERROR(IFERROR(IFERROR(VLOOKUP($A103,Purpose!$B:$N,11,FALSE),VLOOKUP($A103,DataCollection!$B:$N,11,FALSE)),VLOOKUP($A103,Analysis!$B:$N,11,FALSE)),VLOOKUP($A103,Reporting!$B:$N,11,FALSE)),VLOOKUP($A103,UsingData!$B:$N,11,FALSE)),VLOOKUP($A103,Evaluation!$B:$N,11,FALSE)),VLOOKUP($A103,CrossSystem!$B:$N,11,FALSE)))","v":0},"-",{"$f":"IF(UsingData!K29=\"No\",\"-\",IFERROR(IFERROR(IFERROR(IFERROR(IFERROR(IFERROR(VLOOKUP($A103,Purpose!$B:$N,13,FALSE),VLOOKUP($A103,DataCollection!$B:$N,13,FALSE)),VLOOKUP($A103,Analysis!$B:$N,13,FALSE)),VLOOKUP($A103,Reporting!$B:$N,13,FALSE)),VLOOKUP($A103,UsingData!$B:$N,13,FALSE)),VLOOKUP($A103,Evaluation!$B:$N,13,FALSE)),VLOOKUP($A103,CrossSystem!$B:$N,13,FALSE)))","v":0},{"$f":"IF(Participants!$H$12=\"\",\"-\",Participants!$H$12)","v":"-"},"G103 and I103 formulas different"]
["E-EV1-a","Element","Evaluation","EV 1","a","State regularly develops/updates an evaluation plan addressing whether the individual components of the family experiences and outcomes measurement system are being implemented as planned/with fidelity, each component is producing its intended result(s), and the outcomes system as a whole is accomplishing its intended purpose(s).",{"$f":"IFERROR(IFERROR(IFERROR(IFERROR(IFERROR(IFERROR(VLOOKUP($A104,Purpose!$B:$N,11,FALSE),VLOOKUP($A104,DataCollection!$B:$N,11,FALSE)),VLOOKUP($A104,Analysis!$B:$N,11,FALSE)),VLOOKUP($A104,Reporting!$B:$N,11,FALSE)),VLOOKUP($A104,UsingData!$B:$N,11,FALSE)),VLOOKUP($A104,Evaluation!$B:$N,11,FALSE)),VLOOKUP($A104,CrossSystem!$B:$N,11,FALSE))","v":0},"-",{"$f":"IFERROR(IFERROR(IFERROR(IFERROR(IFERROR(IFERROR(VLOOKUP($A104,Purpose!$B:$N,13,FALSE),VLOOKUP($A104,DataCollection!$B:$N,13,FALSE)),VLOOKUP($A104,Analysis!$B:$N,13,FALSE)),VLOOKUP($A104,Reporting!$B:$N,13,FALSE)),VLOOKUP($A104,UsingData!$B:$N,13,FALSE)),VLOOKUP($A104,Evaluation!$B:$N,13,FALSE)),VLOOKUP($A104,CrossSystem!$B:$N,13,FALSE))","v":0},{"$f":"IF(Participants!$I$12=\"\",\"-\",Participants!$I$12)","v":"-"}]
["E-EV1-b","Element","Evaluation","EV 1","b","State implements its evaluation strategies according to plan.",{"$f":"IFERROR(IFERROR(IFERROR(IFERROR(IFERROR(IFERROR(VLOOKUP($A105,Purpose!$B:$N,11,FALSE),VLOOKUP($A105,DataCollection!$B:$N,11,FALSE)),VLOOKUP($A105,Analysis!$B:$N,11,FALSE)),VLOOKUP($A105,Reporting!$B:$N,11,FALSE)),VLOOKUP($A105,UsingData!$B:$N,11,FALSE)),VLOOKUP($A105,Evaluation!$B:$N,11,FALSE)),VLOOKUP($A105,CrossSystem!$B:$N,11,FALSE))","v":0},"-",{"$f":"IFERROR(IFERROR(IFERROR(IFERROR(IFERROR(IFERROR(VLOOKUP($A105,Purpose!$B:$N,13,FALSE),VLOOKUP($A105,DataCollection!$B:$N,13,FALSE)),VLOOKUP($A105,Analysis!$B:$N,13,FALSE)),VLOOKUP($A105,Reporting!$B:$N,13,FALSE)),VLOOKUP($A105,UsingData!$B:$N,13,FALSE)),VLOOKUP($A105,Evaluation!$B:$N,13,FALSE)),VLOOKUP($A105,CrossSystem!$B:$N,13,FALSE))","v":0},{"$f":"IF(Participants!$I$12=\"\",\"-\",Participants!$I$12)","v":"-"}]
["E-EV1-c","Element","Evaluation","EV 1","c","State regularly uses evaluation results to improve the measurement system components, to improve the effectiveness of the measurement system, and to revise the evaluation plan.",{"$f":"IFERROR(IFERROR(IFERROR(IFERROR(IFERROR(IFERROR(VLOOKUP($A106,Purpose!$B:$N,11,FALSE),VLOOKUP($A106,DataCollection!$B:$N,11,FALSE)),VLOOKUP($A106,Analysis!$B:$N,11,FALSE)),VLOOKUP($A106,Reporting!$B:$N,11,FALSE)),VLOOKUP($A106,UsingData!$B:$N,11,FALSE)),VLOOKUP($A106,Evaluation!$B:$N,11,FALSE)),VLOOKUP($A106,CrossSystem!$B:$N,11,FALSE))","v":0},"-",{"$f":"IFERROR(IFERROR(IFERROR(IFERROR(IFERROR(IFERROR(VLOOKUP($A106,Purpose!$B:$N,13,FALSE),VLOOKUP($A106,DataCollection!$B:$N,13,FALSE)),VLOOKUP($A106,Analysis!$B:$N,13,FALSE)),VLOOKUP($A106,Reporting!$B:$N,13,FALSE)),VLOOKUP($A106,UsingData!$B:$N,13,FALSE)),VLOOKUP($A106,Evaluation!$B:$N,13,FALSE)),VLOOKUP($A106,CrossSystem!$B:$N,13,FALSE))","v":0},{"$f":"IF(Participants!$I$12=\"\",\"-\",Participants!$I$12)","v":"-"}]
["E-CC1-a","Element","CrossSystem","CC 1","a","Part C and Part B 619 programs use a coordinated approach for measuring family experiences and outcomes so that a common core of data is available to improve programs.",{"$f":"IFERROR(IFERROR(IFERROR(IFERROR(IFERROR(IFERROR(VLOOKUP($A107,Purpose!$B:$N,11,FALSE),VLOOKUP($A107,DataCollection!$B:$N,11,FALSE)),VLOOKUP($A107,Analysis!$B:$N,11,FALSE)),VLOOKUP($A107,Reporting!$B:$N,11,FALSE)),VLOOKUP($A107,UsingData!$B:$N,11,FALSE)),VLOOKUP($A107,Evaluation!$B:$N,11,FALSE)),VLOOKUP($A107,CrossSystem!$B:$N,11,FALSE))","v":0},"-",{"$f":"IFERROR(IFERROR(IFERROR(IFERROR(IFERROR(IFERROR(VLOOKUP($A107,Purpose!$B:$N,13,FALSE),VLOOKUP($A107,DataCollection!$B:$N,13,FALSE)),VLOOKUP($A107,Analysis!$B:$N,13,FALSE)),VLOOKUP($A107,Reporting!$B:$N,13,FALSE)),VLOOKUP($A107,UsingData!$B:$N,13,FALSE)),VLOOKUP($A107,Evaluation!$B:$N,13,FALSE)),VLOOKUP($A107,CrossSystem!$B:$N,13,FALSE))","v":0},{"$f":"IF(Participants!$J$12=\"\",\"-\",Participants!$J$12)","v":"-"}]
["E-CC1-b","Element","CrossSystem","CC 1","b","Part C and Part B 619 programs routinely coordinate family experiences and outcomes data analysis and reporting.",{"$f":"IFERROR(IFERROR(IFERROR(IFERROR(IFERROR(IFERROR(VLOOKUP($A108,Purpose!$B:$N,11,FALSE),VLOOKUP($A108,DataCollection!$B:$N,11,FALSE)),VLOOKUP($A108,Analysis!$B:$N,11,FALSE)),VLOOKUP($A108,Reporting!$B:$N,11,FALSE)),VLOOKUP($A108,UsingData!$B:$N,11,FALSE)),VLOOKUP($A108,Evaluation!$B:$N,11,FALSE)),VLOOKUP($A108,CrossSystem!$B:$N,11,FALSE))","v":0},"-",{"$f":"IFERROR(IFERROR(IFERROR(IFERROR(IFERROR(IFERROR(VLOOKUP($A108,Purpose!$B:$N,13,FALSE),VLOOKUP($A108,DataCollection!$B:$N,13,FALSE)),VLOOKUP($A108,Analysis!$B:$N,13,FALSE)),VLOOKUP($A108,Reporting!$B:$N,13,FALSE)),VLOOKUP($A108,UsingData!$B:$N,13,FALSE)),VLOOKUP($A108,Evaluation!$B:$N,13,FALSE)),VLOOKUP($A108,CrossSystem!$B:$N,13,FALSE))","v":0},{"$f":"IF(Participants!$J$12=\"\",\"-\",Participants!$J$12)","v":"-"}]
["E-CC1-c","Element","CrossSystem","CC 1","c","Part C and Part B 619 state and local programs work together to use the family data to assure that families uniformly experience quality programs and benefit from services across the early childhood years.",{"$f":"IFERROR(IFERROR(IFERROR(IFERROR(IFERROR(IFERROR(VLOOKUP($A109,Purpose!$B:$N,11,FALSE),VLOOKUP($A109,DataCollection!$B:$N,11,FALSE)),VLOOKUP($A109,Analysis!$B:$N,11,FALSE)),VLOOKUP($A109,Reporting!$B:$N,11,FALSE)),VLOOKUP($A109,UsingData!$B:$N,11,FALSE)),VLOOKUP($A109,Evaluation!$B:$N,11,FALSE)),VLOOKUP($A109,CrossSystem!$B:$N,11,FALSE))","v":0},"-",{"$f":"IFERROR(IFERROR(IFERROR(IFERROR(IFERROR(IFERROR(VLOOKUP($A109,Purpose!$B:$N,13,FALSE),VLOOKUP($A109,DataCollection!$B:$N,13,FALSE)),VLOOKUP($A109,Analysis!$B:$N,13,FALSE)),VLOOKUP($A109,Reporting!$B:$N,13,FALSE)),VLOOKUP($A109,UsingData!$B:$N,13,FALSE)),VLOOKUP($A109,Evaluation!$B:$N,13,FALSE)),VLOOKUP($A109,CrossSystem!$B:$N,13,FALSE))","v":0},{"$f":"IF(Participants!$J$12=\"\",\"-\",Participants!$J$12)","v":"-"}]
["E-CC2-a","Element","CrossSystem","CC 2","a","EC programs use a coordinated data collection approach for measuring family experiences and outcomes to minimize the need for families to complete multiple surveys and so that a common core of data is available to improve programs.",{"$f":"IFERROR(IFERROR(IFERROR(IFERROR(IFERROR(IFERROR(VLOOKUP($A110,Purpose!$B:$N,11,FALSE),VLOOKUP($A110,DataCollection!$B:$N,11,FALSE)),VLOOKUP($A110,Analysis!$B:$N,11,FALSE)),VLOOKUP($A110,Reporting!$B:$N,11,FALSE)),VLOOKUP($A110,UsingData!$B:$N,11,FALSE)),VLOOKUP($A110,Evaluation!$B:$N,11,FALSE)),VLOOKUP($A110,CrossSystem!$B:$N,11,FALSE))","v":0},"-",{"$f":"IFERROR(IFERROR(IFERROR(IFERROR(IFERROR(IFERROR(VLOOKUP($A110,Purpose!$B:$N,13,FALSE),VLOOKUP($A110,DataCollection!$B:$N,13,FALSE)),VLOOKUP($A110,Analysis!$B:$N,13,FALSE)),VLOOKUP($A110,Reporting!$B:$N,13,FALSE)),VLOOKUP($A110,UsingData!$B:$N,13,FALSE)),VLOOKUP($A110,Evaluation!$B:$N,13,FALSE)),VLOOKUP($A110,CrossSystem!$B:$N,13,FALSE))","v":0},{"$f":"IF(Participants!$J$12=\"\",\"-\",Participants!$J$12)","v":"-"}]
["E-CC2-b","Element","CrossSystem","CC 2","b","EC programs use common data standards so that data can be linked across programs.",{"$f":"IFERROR(IFERROR(IFERROR(IFERROR(IFERROR(IFERROR(VLOOKUP($A111,Purpose!$B:$N,11,FALSE),VLOOKUP($A111,DataCollection!$B:$N,11,FALSE)),VLOOKUP($A111,Analysis!$B:$N,11,FALSE)),VLOOKUP($A111,Reporting!$B:$N,11,FALSE)),VLOOKUP($A111,UsingData!$B:$N,11,FALSE)),VLOOKUP($A111,Evaluation!$B:$N,11,FALSE)),VLOOKUP($A111,CrossSystem!$B:$N,11,FALSE))","v":0},"-",{"$f":"IFERROR(IFERROR(IFERROR(IFERROR(IFERROR(IFERROR(VLOOKUP($A111,Purpose!$B:$N,13,FALSE),VLOOKUP($A111,DataCollection!$B:$N,13,FALSE)),VLOOKUP($A111,Analysis!$B:$N,13,FALSE)),VLOOKUP($A111,Reporting!$B:$N,13,FALSE)),VLOOKUP($A111,UsingData!$B:$N,13,FALSE)),VLOOKUP($A111,Evaluation!$B:$N,13,FALSE)),VLOOKUP($A111,CrossSystem!$B:$N,13,FALSE))","v":0},{"$f":"IF(Participants!$J$12=\"\",\"-\",Participants!$J$12)","v":"-"}]
["E-CC2-c","Element","CrossSystem","CC 2","c","EC programs routinely coordinate family experiences and outcomes data analysis and reporting.",{"$f":"IFERROR(IFERROR(IFERROR(IFERROR(IFERROR(IFERROR(VLOOKUP($A112,Purpose!$B:$N,11,FALSE),VLOOKUP($A112,DataCollection!$B:$N,11,FALSE)),VLOOKUP($A112,Analysis!$B:$N,11,FALSE)),VLOOKUP($A112,Reporting!$B:$N,11,FALSE)),VLOOKUP($A112,UsingData!$B:$N,11,FALSE)),VLOOKUP($A112,Evaluation!$B:$N,11,FALSE)),VLOOKUP($A112,CrossSystem!$B:$N,11,FALSE))","v":0},"-",{"$f":"IFERROR(IFERROR(IFERROR(IFERROR(IFERROR(IFERROR(VLOOKUP($A112,Purpose!$B:$N,13,FALSE),VLOOKUP($A112,DataCollection!$B:$N,13,FALSE)),VLOOKUP($A112,Analysis!$B:$N,13,FALSE)),VLOOKUP($A112,Reporting!$B:$N,13,FALSE)),VLOOKUP($A112,UsingData!$B:$N,13,FALSE)),VLOOKUP($A112,Evaluation!$B:$N,13,FALSE)),VLOOKUP($A112,CrossSystem!$B:$N,13,FALSE))","v":0},{"$f":"IF(Participants!$J$12=\"\",\"-\",Participants!$J$12)","v":"-"}]
["E-CC2-d","Element","CrossSystem","CC 2","d","With appropriate safeguards, stakeholders have access to a common core of de-identified data to allow a coordinated examination of issues related to family experiences and outcomes over time and across programs.",{"$f":"IFERROR(IFERROR(IFERROR(IFERROR(IFERROR(IFERROR(VLOOKUP($A113,Purpose!$B:$N,11,FALSE),VLOOKUP($A113,DataCollection!$B:$N,11,FALSE)),VLOOKUP($A113,Analysis!$B:$N,11,FALSE)),VLOOKUP($A113,Reporting!$B:$N,11,FALSE)),VLOOKUP($A113,UsingData!$B:$N,11,FALSE)),VLOOKUP($A113,Evaluation!$B:$N,11,FALSE)),VLOOKUP($A113,CrossSystem!$B:$N,11,FALSE))","v":0},"-",{"$f":"IFERROR(IFERROR(IFERROR(IFERROR(IFERROR(IFERROR(VLOOKUP($A113,Purpose!$B:$N,13,FALSE),VLOOKUP($A113,DataCollection!$B:$N,13,FALSE)),VLOOKUP($A113,Analysis!$B:$N,13,FALSE)),VLOOKUP($A113,Reporting!$B:$N,13,FALSE)),VLOOKUP($A113,UsingData!$B:$N,13,FALSE)),VLOOKUP($A113,Evaluation!$B:$N,13,FALSE)),VLOOKUP($A113,CrossSystem!$B:$N,13,FALSE))","v":0},{"$f":"IF(Participants!$J$12=\"\",\"-\",Participants!$J$12)","v":"-"}]
["E-CC2-e","Element","CrossSystem","CC 2","e","EC state and local early childhood programs work together to use the family data to assure that families uniformly experience quality programs and benefit from them.",{"$f":"IFERROR(IFERROR(IFERROR(IFERROR(IFERROR(IFERROR(VLOOKUP($A114,Purpose!$B:$N,11,FALSE),VLOOKUP($A114,DataCollection!$B:$N,11,FALSE)),VLOOKUP($A114,Analysis!$B:$N,11,FALSE)),VLOOKUP($A114,Reporting!$B:$N,11,FALSE)),VLOOKUP($A114,UsingData!$B:$N,11,FALSE)),VLOOKUP($A114,Evaluation!$B:$N,11,FALSE)),VLOOKUP($A114,CrossSystem!$B:$N,11,FALSE))","v":0},"-",{"$f":"IFERROR(IFERROR(IFERROR(IFERROR(IFERROR(IFERROR(VLOOKUP($A114,Purpose!$B:$N,13,FALSE),VLOOKUP($A114,DataCollection!$B:$N,13,FALSE)),VLOOKUP($A114,Analysis!$B:$N,13,FALSE)),VLOOKUP($A114,Reporting!$B:$N,13,FALSE)),VLOOKUP($A114,UsingData!$B:$N,13,FALSE)),VLOOKUP($A114,Evaluation!$B:$N,13,FALSE)),VLOOKUP($A114,CrossSystem!$B:$N,13,FALSE))","v":0},{"$f":"IF(Participants!$J$12=\"\",\"-\",Participants!$J$12)","v":"-"}]

{"sheet":"QIRatingLookup","index":13,"n_rows":4846,"n_cols":16,"rows_kept":4846,"cut":false,"hidden":true,"merged":[]}
["Index","Rating",null,"Total","Number of 1s","Number of 2s","Number of 3s","Number of 4s","TEXT Number of 1s","TEXT Number of 2s","TEXT Number of 3s","TEXT Number of 4s"]
["INCOMPLETE",{"$f":"\"-\"","v":"-"}]
[{"$f":"I3&\"-\"&J3&\"-\"&K3&\"-\"&L3","v":"00-00-00-01"},7,null,1,0,0,0,1,{"$f":"IF(LEN(E3)=1,0&E3,IF(LEN(E3)=0,\"00\",RIGHT(E3,2)))","v":"00"},"00","00","01"]
[{"$f":"I4&\"-\"&J4&\"-\"&K4&\"-\"&L4","v":"00-00-01-00"},4,null,1,0,0,1,0,"00","00","01","00"]
[{"$f":"I5&\"-\"&J5&\"-\"&K5&\"-\"&L5","v":"00-01-00-00"},2,null,1,0,1,0,0,"00","01","00","00",null,null,null,"01-00-00-00"]
[{"$f":"I6&\"-\"&J6&\"-\"&K6&\"-\"&L6","v":"01-00-00-00"},1,null,1,1,0,0,0,"01","00","00","00"]
[{"$f":"I7&\"-\"&J7&\"-\"&K7&\"-\"&L7","v":"00-00-00-02"},7,null,2,0,0,0,2,"00","00","00","02"]
["00-00-01-01",6,null,2,0,0,1,1,{"$f":"IF(LEN(E8)=1,0&E8,IF(LEN(E8)=0,\"00\",RIGHT(E8,2)))","v":"00"},{"$f":"IF(LEN(F8)=1,0&F8,IF(LEN(F8)=0,\"00\",RIGHT(F8,2)))","v":"00"},{"$f":"IF(LEN(G8)=1,0&G8,IF(LEN(G8)=0,\"00\",RIGHT(G8,2)))","v":"01"},{"$f":"IF(LEN(H8)=1,0&H8,IF(LEN(H8)=0,\"00\",RIGHT(H8,2)))","v":"01"}]
["00-00-02-00",4,null,2,0,0,2,0,"00","00","02","00"]
["00-01-00-01",5,null,2,0,1,0,1,"00","01","00","01"]
["00-01-01-00",4,null,2,0,1,1,0,"00","01","01","00"]
["00-02-00-00",2,null,2,0,2,0,0,"00","02","00","00"]
["01-00-00-01",4,null,2,1,0,0,1,"01","00","00","01"]
["01-00-01-00",3,null,2,1,0,1,0,"01","00","01","00"]
["01-01-00-00",2,null,2,1,1,0,0,"01","01","00","00"]
["02-00-00-00",1,null,2,2,0,0,0,"02","00","00","00"]
["00-00-00-03",7,null,3,0,0,0,3,"00","00","00","03"]
["00-00-01-02",6,null,3,0,0,1,2,"00","00","01","02"]
["00-00-02-01",5,null,3,0,0,2,1,"00","00","02","01"]
["00-00-03-00",4,null,3,0,0,3,0,"00","00","03","00"]
["00-01-00-02",5,null,3,0,1,0,2,"00","01","00","02"]
["00-01-01-01",5,null,3,0,1,1,1,"00","01","01","01"]
["00-01-02-00",4,null,3,0,1,2,0,"00","01","02","00"]
["00-02-00-01",3,null,3,0,2,0,1,"00","02","00","01"]
["00-02-01-00",3,null,3,0,2,1,0,"00","02","01","00"]
["00-03-00-00",2,null,3,0,3,0,0,"00","03","00","00"]
["01-00-00-02",4,null,3,1,0,0,2,"01","00","00","02"]
["01-00-01-01",4,null,3,1,0,1,1,"01","00","01","01"]
["01-00-02-00",4,null,3,1,0,2,0,"01","00","02","00"]
["01-01-00-01",3,null,3,1,1,0,1,"01","01","00","01"]
["01-01-01-00",3,null,3,1,1,1,0,"01","01","01","00"]
["01-02-00-00",2,null,3,1,2,0,0,"01","02","00","00"]
["02-00-00-01",3,null,3,2,0,0,1,"02","00","00","01"]
["02-00-01-00",3,null,3,2,0,1,0,"02","00","01","00"]
["02-01-00-00",2,null,3,2,1,0,0,"02","01","00","00"]
["03-00-00-00",1,null,3,3,0,0,0,"03","00","00","00"]
["00-00-00-04",7,null,4,0,0,0,4,"00","00","00","04"]
["00-00-01-03",6,null,4,0,0,1,3,"00","00","01","03"]
["00-00-02-02",6,null,4,0,0,2,2,"00","00","02","02"]
["00-00-03-01",5,null,4,0,0,3,1,"00","00","03","01"]
["00-00-04-00",4,null,4,0,0,4,0,"00","00","04","00"]
["00-01-00-03",5,null,4,0,1,0,3,"00","01","00","03"]
["00-01-01-02",5,null,4,0,1,1,2,"00","01","01","02"]
["00-01-02-01",5,null,4,0,1,2,1,"00","01","02","01"]
["00-01-03-00",4,null,4,0,1,3,0,"00","01","03","00"]
["00-02-00-02",4,null,4,0,2,0,2,"00","02","00","02"]
["00-02-01-01",4,null,4,0,2,1,1,"00","02","01","01"]
["00-02-02-00",4,null,4,0,2,2,0,"00","02","02","00"]
["00-03-00-01",3,null,4,0,3,0,1,"00","03","00","01"]
["00-03-01-00",3,null,4,0,3,1,0,"00","03","01","00"]
["00-04-00-00",2,null,4,0,4,0,0,"00","04","00","00"]
["01-00-00-03",5,null,4,1,0,0,3,"01","00","00","03"]
["01-00-01-02",4,null,4,1,0,1,2,"01","00","01","02"]
["01-00-02-01",4,null,4,1,0,2,1,"01","00","02","01"]
["01-00-03-00",4,null,4,1,0,3,0,"01","00","03","00"]
["01-01-00-02",4,null,4,1,1,0,2,"01","01","00","02"]
["01-01-01-01",4,null,4,1,1,1,1,"01","01","01","01"]
["01-01-02-00",4,null,4,1,1,2,0,"01","01","02","00"]
["01-02-00-01",3,null,4,1,2,0,1,"01","02","00","01"]
["01-02-01-00",2,null,4,1,2,1,0,"01","02","01","00"]
["01-03-00-00",2,null,4,1,3,0,0,"01","03","00","00"]
["02-00-00-02",4,null,4,2,0,0,2,"02","00","00","02"]
["02-00-01-01",3,null,4,2,0,1,1,"02","00","01","01"]
["02-00-02-00",3,null,4,2,0,2,0,"02","00","02","00"]
["02-01-00-01",3,null,4,2,1,0,1,"02","01","00","01"]
["02-01-01-00",2,null,4,2,1,1,0,"02","01","01","00"]
["02-02-00-00",2,null,4,2,2,0,0,"02","02","00","00"]
["03-00-00-01",3,null,4,3,0,0,1,"03","00","00","01"]
["03-00-01-00",2,null,4,3,0,1,0,"03","00","01","00"]
["03-01-00-00",2,null,4,3,1,0,0,"03","01","00","00"]
[{"$f":"I71&\"-\"&J71&\"-\"&K71&\"-\"&L71","v":"04-00-00-00"},1,null,4,4,0,0,0,"04","00","00","00"]
["00-00-00-05",7,null,5,0,0,0,5,{"$f":"IF(LEN(E72)=1,0&E72,IF(LEN(E72)=0,\"00\",RIGHT(E72,2)))","v":"00"},{"$f":"IF(LEN(F72)=1,0&F72,IF(LEN(F72)=0,\"00\",RIGHT(F72,2)))","v":"00"},{"$f":"IF(LEN(G72)=1,0&G72,IF(LEN(G72)=0,\"00\",RIGHT(G72,2)))","v":"00"},{"$f":"IF(LEN(H72)=1,0&H72,IF(LEN(H72)=0,\"00\",RIGHT(H72,2)))","v":"05"}]
["00-00-01-04",6,null,5,0,0,1,4,"00","00","01","04"]
["00-00-02-03",6,null,5,0,0,2,3,"00","00","02","03"]
["00-00-03-02",5,null,5,0,0,3,2,"00","00","03","02"]
["00-00-04-01",5,null,5,0,0,4,1,"00","00","04","01"]
["00-00-05-00",4,null,5,0,0,5,0,"00","00","05","00"]
["00-01-01-03",5,null,5,0,1,1,3,"00","01","01","03"]
["00-01-02-02",5,null,5,0,1,2,2,"00","01","02","02"]
["00-01-03-01",5,null,5,0,1,3,1,"00","01","03","01"]
["00-01-04-00",4,null,5,0,1,4,0,"00","01","04","00"]
["00-01-00-04",5,null,5,0,1,null,4,"00","01","00","04"]
["00-02-00-03",5,null,5,0,2,0,3,"00","02","00","03"]
["00-02-01-02",5,null,5,0,2,1,2,"00","02","01","02"]
["00-02-02-01",4,null,5,0,2,2,1,"00","02","02","01"]
["00-02-03-00",4,null,5,0,2,3,0,"00","02","03","00"]
["00-03-00-02",3,null,5,0,3,0,2,"00","03","00","02"]
["00-03-01-01",3,null,5,0,3,1,1,"00","03","01","01"]
["00-03-02-00",3,null,5,0,3,2,0,"00","03","02","00"]
["00-04-00-01",3,null,5,0,4,0,1,"00","04","00","01"]
["00-04-01-00",3,null,5,0,4,1,0,"00","04","01","00"]
["00-05-00-00",2,null,5,0,5,0,0,"00","05","00","00"]
["01-00-00-04",5,null,5,1,0,0,4,"01","00","00","04"]
["01-00-01-03",5,null,5,1,0,1,3,"01","00","01","03"]
["01-00-02-02",5,null,5,1,0,2,2,"01","00","02","02"]
["01-00-03-01",4,null,5,1,0,3,1,"01","00","03","01"]
["01-00-04-00",4,null,5,1,0,4,0,"01","00","04","00"]
["01-01-00-03",4,null,5,1,1,0,3,"01","01","00","03"]
["01-01-01-02",4,null,5,1,1,1,2,"01","01","01","02"]
["01-01-02-01",4,null,5,1,1,2,1,"01","01","02","01"]
["01-01-03-00",4,null,5,1,1,3,0,"01","01","03","00"]
["01-02-00-02",3,null,5,1,2,0,2,"01","02","00","02"]
["01-02-01-01",3,null,5,1,2,1,1,"01","02","01","01"]
["01-02-02-00",3,null,5,1,2,2,0,"01","02","02","00"]
["01-03-00-01",3,null,5,1,3,0,1,"01","03","00","01"]
["01-03-01-00",2,null,5,1,3,1,0,"01","03","01","00"]
["01-04-00-00",2,null,5,1,4,0,0,"01","04","00","00"]
["02-00-00-03",4,null,5,2,0,0,3,"02","00","00","03"]
["02-00-01-02",4,null,5,2,0,1,2,"02","00","01","02"]
["02-00-02-01",4,null,5,2,0,2,1,"02","00","02","01"]
["02-00-03-00",4,null,5,2,0,3,0,"02","00","03","00"]
["02-01-00-02",3,null,5,2,1,0,2,"02","01","00","02"]
["02-01-01-01",3,null,5,2,1,1,1,"02","01","01","01"]
["02-01-02-00",3,null,5,2,1,2,0,"02","01","02","00"]
["02-02-00-01",3,null,5,2,2,0,1,"02","02","00","01"]
["02-02-01-00",2,null,5,2,2,1,0,"02","02","01","00"]
["02-03-00-00",2,null,5,2,3,0,0,"02","03","00","00"]
["03-00-00-02",3,null,5,3,0,0,2,"03","00","00","02"]
["03-00-01-01",3,null,5,3,0,1,1,"03","00","01","01"]
["03-00-02-00",3,null,5,3,0,2,0,"03","00","02","00"]
["03-01-00-01",3,null,5,3,1,0,1,"03","01","00","01"]
["03-01-01-00",2,null,5,3,1,1,0,"03","01","01","00"]
["03-02-00-00",2,null,5,3,2,0,0,"03","02","00","00"]
["04-00-00-01",3,null,5,4,0,0,1,"04","00","00","01"]
["04-00-01-00",2,null,5,4,0,1,0,"04","00","01","00"]
["04-01-00-00",2,null,5,4,1,0,0,"04","01","00","00"]
["05-00-00-00",1,null,5,5,0,0,0,"05","00","00","00"]
["00-00-00-06",7,null,6,0,0,0,6,"00","00","00","06"]
["00-00-01-05",6,null,6,0,0,1,5,"00","00","01","05"]
["00-00-02-04",6,null,6,0,0,2,4,"00","00","02","04"]
["00-00-03-03",6,null,6,0,0,3,3,"00","00","03","03"]
["00-00-04-02",5,null,6,0,0,4,2,"00","00","04","02"]
["00-00-05-01",4,null,6,0,0,5,1,"00","00","05","01"]
["00-00-06-00",4,null,6,0,0,6,0,"00","00","06","00"]
[{"$f":"I135&\"-\"&J135&\"-\"&K135&\"-\"&L135","v":"00-01-00-05"},5,null,6,0,1,0,5,"00","01","00","05"]
["00-01-01-04",5,null,6,0,1,1,4,{"$f":"IF(LEN(E136)=1,0&E136,IF(LEN(E136)=0,\"00\",RIGHT(E136,2)))","v":"00"},{"$f":"IF(LEN(F136)=1,0&F136,IF(LEN(F136)=0,\"00\",RIGHT(F136,2)))","v":"01"},{"$f":"IF(LEN(G136)=1,0&G136,IF(LEN(G136)=0,\"00\",RIGHT(G136,2)))","v":"01"},{"$f":"IF(LEN(H136)=1,0&H136,IF(LEN(H136)=0,\"00\",RIGHT(H136,2)))","v":"04"}]
["00-01-02-03",5,null,6,0,1,2,3,"00","01","02","03"]
["00-01-03-02",5,null,6,0,1,3,2,"00","01","03","02"]
["00-01-04-01",4,null,6,0,1,4,1,"00","01","04","01"]
["00-01-05-00",4,null,6,0,1,5,0,"00","01","05","00"]
["00-02-00-04",5,null,6,0,2,0,4,"00","02","00","04"]
["00-02-01-03",5,null,6,0,2,1,3,"00","02","01","03"]
["00-02-02-02",5,null,6,0,2,2,2,"00","02","02","02"]
["00-02-03-01",4,null,6,0,2,3,1,"00","02","03","01"]
["00-02-04-00",4,null,6,0,2,4,0,"00","02","04","00"]
["00-03-00-03",4,null,6,0,3,0,3,"00","03","00","03"]
["00-03-01-02",4,null,6,0,3,1,2,"00","03","01","02"]
["00-03-02-01",4,null,6,0,3,2,1,"00","03","02","01"]
["00-03-03-00",4,null,6,0,3,3,0,"00","03","03","00"]
["00-04-00-02",3,null,6,0,4,0,2,"00","04","00","02"]
["00-04-01-01",3,null,6,0,4,1,1,"00","04","01","01"]
["00-04-02-00",3,null,6,0,4,2,0,"00","04","02","00"]
["00-05-00-01",3,null,6,0,5,0,1,"00","05","00","01"]
["00-05-01-00",2,null,6,0,5,1,0,"00","05","01","00"]
["00-06-00-00",2,null,6,0,6,0,0,"00","06","00","00"]
["01-00-00-05",5,null,6,1,0,0,5,"01","00","00","05"]
["01-00-01-04",5,null,6,1,0,1,4,"01","00","01","04"]
["01-00-02-03",5,null,6,1,0,2,3,"01","00","02","03"]
["01-00-03-02",5,null,6,1,0,3,2,"01","00","03","02"]
["01-00-04-01",4,null,6,1,0,4,1,"01","00","04","01"]
["01-00-05-00",4,null,6,1,0,5,0,"01","00","05","00"]
["01-01-00-04",5,null,6,1,1,0,4,"01","01","00","04"]
["01-01-01-03",4,null,6,1,1,1,3,"01","01","01","03"]
["01-01-02-02",4,null,6,1,1,2,2,"01","01","02","02"]
["01-01-03-01",4,null,6,1,1,3,1,"01","01","03","01"]
["01-01-04-00",4,null,6,1,1,4,0,"01","01","04","00"]
["01-02-00-03",4,null,6,1,2,0,3,"01","02","00","03"]
["01-02-01-02",4,null,6,1,2,1,2,"01","02","01","02"]
["01-02-02-01",4,null,6,1,2,2,1,"01","02","02","01"]
["01-02-03-00",4,null,6,1,2,3,0,"01","02","03","00"]
["01-03-00-02",3,null,6,1,3,0,2,"01","03","00","02"]
["01-03-01-01",3,null,6,1,3,1,1,"01","03","01","01"]
["01-03-02-00",3,null,6,1,3,2,0,"01","03","02","00"]
["01-04-00-01",2,null,6,1,4,0,1,"01","04","00","01"]
["01-04-01-00",2,null,6,1,4,1,0,"01","04","01","00"]
["01-05-00-00",2,null,6,1,5,0,0,"01","05","00","00"]
["02-00-00-04",4,null,6,2,0,0,4,"02","00","00","04"]
["02-00-01-03",4,null,6,2,0,1,3,"02","00","01","03"]
["02-00-02-02",4,null,6,2,0,2,2,"02","00","02","02"]
["02-00-03-01",4,null,6,2,0,3,1,"02","00","03","01"]
["02-00-04-00",4,null,6,2,0,4,0,"02","00","04","00"]
["02-01-00-03",4,null,6,2,1,0,3,"02","01","00","03"]
["02-01-01-02",4,null,6,2,1,1,2,"02","01","01","02"]
["02-01-02-01",4,null,6,2,1,2,1,"02","01","02","01"]
["02-01-03-00",3,null,6,2,1,3,0,"02","01","03","00"]
["02-02-00-02",3,null,6,2,2,0,2,"02","02","00","02"]
["02-02-01-01",3,null,6,2,2,1,1,"02","02","01","01"]
["02-02-02-00",3,null,6,2,2,2,0,"02","02","02","00"]
["02-03-00-01",2,null,6,2,3,0,1,"02","03","00","01"]
["02-03-01-00",2,null,6,2,3,1,0,"02","03","01","00"]
["02-04-00-00",2,null,6,2,4,0,0,"02","04","00","00"]
["03-00-00-03",4,null,6,3,0,0,3,"03","00","00","03"]
["03-00-01-02",4,null,6,3,0,1,2,"03","00","01","02"]
["03-00-02-01",3,null,6,3,0,2,1,"03","00","02","01"]
["03-00-03-00",3,null,6,3,0,3,0,"03","00","03","00"]
["03-01-00-02",3,null,6,3,1,0,2,"03","01","00","02"]
["03-01-01-01",3,null,6,3,1,1,1,"03","01","01","01"]
["03-01-02-00",3,null,6,3,1,2,0,"03","01","02","00"]
[{"$f":"I199&\"-\"&J199&\"-\"&K199&\"-\"&L199","v":"03-02-00-01"},2,null,6,3,2,0,1,"03","02","00","01"]
["03-02-01-00",2,null,6,3,2,1,0,{"$f":"IF(LEN(E200)=1,0&E200,IF(LEN(E200)=0,\"00\",RIGHT(E200,2)))","v":"03"},{"$f":"IF(LEN(F200)=1,0&F200,IF(LEN(F200)=0,\"00\",RIGHT(F200,2)))","v":"02"},{"$f":"IF(LEN(G200)=1,0&G200,IF(LEN(G200)=0,\"00\",RIGHT(G200,2)))","v":"01"},{"$f":"IF(LEN(H200)=1,0&H200,IF(LEN(H200)=0,\"00\",RIGHT(H200,2)))","v":"00"}]
["03-03-00-00",2,null,6,3,3,0,0,"03","03","00","00"]
["04-00-00-02",3,null,6,4,0,0,2,"04","00","00","02"]
["04-00-01-01",3,null,6,4,0,1,1,"04","00","01","01"]
["04-00-02-00",3,null,6,4,0,2,0,"04","00","02","00"]
["04-01-00-01",2,null,6,4,1,0,1,"04","01","00","01"]
["04-01-01-00",2,null,6,4,1,1,0,"04","01","01","00"]
["04-02-00-00",2,null,6,4,2,0,0,"04","02","00","00"]
["05-00-00-01",2,null,6,5,0,0,1,"05","00","00","01"]
["05-00-01-00",2,null,6,5,0,1,0,"05","00","01","00"]
["05-01-00-00",2,null,6,5,1,0,0,"05","01","00","00"]
["06-00-00-00",1,null,6,6,0,0,0,"06","00","00","00"]
["00-00-00-07",7,null,7,0,0,0,7,"00","00","00","07"]
["00-00-01-06",6,null,7,0,0,1,6,"00","00","01","06"]
["00-00-02-05",6,null,7,0,0,2,5,"00","00","02","05"]
["00-00-03-04",6,null,7,0,0,3,4,"00","00","03","04"]
["00-00-04-03",5,null,7,0,0,4,3,"00","00","04","03"]
["00-00-05-02",5,null,7,0,0,5,2,"00","00","05","02"]
["00-00-06-01",4,null,7,0,0,6,1,"00","00","06","01"]
["00-00-07-00",4,null,7,0,0,7,0,"00","00","07","00"]
["00-01-00-06",5,null,7,0,1,0,6,"00","01","00","06"]
["00-01-01-05",5,null,7,0,1,1,5,"00","01","01","05"]
["00-01-02-04",5,null,7,0,1,2,4,"00","01","02","04"]
["00-01-03-03",5,null,7,0,1,3,3,"00","01","03","03"]
["00-01-04-02",5,null,7,0,1,4,2,"00","01","04","02"]
["00-01-05-01",4,null,7,0,1,5,1,"00","01","05","01"]
["00-01-06-00",4,null,7,0,1,6,0,"00","01","06","00"]
["00-02-00-05",5,null,7,0,2,0,5,"00","02","00","05"]
["00-02-01-04",5,null,7,0,2,1,4,"00","02","01","04"]
["00-02-02-03",5,null,7,0,2,2,3,"00","02","02","03"]
["00-02-03-02",5,null,7,0,2,3,2,"00","02","03","02"]
["00-02-04-01",4,null,7,0,2,4,1,"00","02","04","01"]
["00-02-05-00",4,null,7,0,2,5,0,"00","02","05","00"]
["00-03-00-04",5,null,7,0,3,0,4,"00","03","00","04"]
["00-03-01-03",5,null,7,0,3,1,3,"00","03","01","03"]
["00-03-02-02",4,null,7,0,3,2,2,"00","03","02","02"]
["00-03-03-01",4,null,7,0,3,3,1,"00","03","03","01"]
["00-03-04-00",4,null,7,0,3,4,0,"00","03","04","00"]
["00-04-00-03",3,null,7,0,4,0,3,"00","04","00","03"]
["00-04-01-02",3,null,7,0,4,1,2,"00","04","01","02"]
["00-04-02-01",3,null,7,0,4,2,1,"00","04","02","01"]
["00-04-03-00",3,null,7,0,4,3,0,"00","04","03","00"]
["00-05-00-02",3,null,7,0,5,0,2,"00","05","00","02"]
["00-05-01-01",3,null,7,0,5,1,1,"00","05","01","01"]
["00-05-02-00",3,null,7,0,5,2,0,"00","05","02","00"]
["00-06-00-01",3,null,7,0,6,0,1,"00","06","00","01"]
["00-06-01-00",2,null,7,0,6,1,0,"00","06","01","00"]
["00-07-00-00",2,null,7,0,7,0,0,"00","07","00","00"]
["01-00-00-06",5,null,7,1,0,0,6,"01","00","00","06"]
["01-00-01-05",5,null,7,1,0,1,5,"01","00","01","05"]
["01-00-02-04",5,null,7,1,0,2,4,"01","00","02","04"]
["01-00-03-03",5,null,7,1,0,3,3,"01","00","03","03"]
["01-00-04-02",5,null,7,1,0,4,2,"01","00","04","02"]
["01-00-05-01",4,null,7,1,0,5,1,"01","00","05","01"]
["01-00-06-00",4,null,7,1,0,6,0,"01","00","06","00"]
["01-01-00-05",5,null,7,1,1,0,5,"01","01","00","05"]
["01-01-01-04",5,null,7,1,1,1,4,"01","01","01","04"]
["01-01-02-03",5,null,7,1,1,2,3,"01","01","02","03"]
["01-01-03-02",4,null,7,1,1,3,2,"01","01","03","02"]
["01-01-04-01",4,null,7,1,1,4,1,"01","01","04","01"]
["01-01-05-00",4,null,7,1,1,5,0,"01","01","05","00"]
["01-02-00-04",4,null,7,1,2,0,4,"01","02","00","04"]
["01-02-01-03",4,null,7,1,2,1,3,"01","02","01","03"]
[{"$f":"I263&\"-\"&J263&\"-\"&K263&\"-\"&L263","v":"01-02-02-02"},4,null,7,1,2,2,2,"01","02","02","02"]
["01-02-03-01",4,null,7,1,2,3,1,{"$f":"IF(LEN(E264)=1,0&E264,IF(LEN(E264)=0,\"00\",RIGHT(E264,2)))","v":"01"},{"$f":"IF(LEN(F264)=1,0&F264,IF(LEN(F264)=0,\"00\",RIGHT(F264,2)))","v":"02"},{"$f":"IF(LEN(G264)=1,0&G264,IF(LEN(G264)=0,\"00\",RIGHT(G264,2)))","v":"03"},{"$f":"IF(LEN(H264)=1,0&H264,IF(LEN(H264)=0,\"00\",RIGHT(H264,2)))","v":"01"}]
["01-02-04-00",4,null,7,1,2,4,0,"01","02","04","00"]
["01-03-00-03",3,null,7,1,3,0,3,"01","03","00","03"]
["01-03-01-02",3,null,7,1,3,1,2,"01","03","01","02"]
["01-03-02-01",3,null,7,1,3,2,1,"01","03","02","01"]
["01-03-03-00",3,null,7,1,3,3,0,"01","03","03","00"]
["01-04-00-02",3,null,7,1,4,0,2,"01","04","00","02"]
["01-04-01-01",3,null,7,1,4,1,1,"01","04","01","01"]
["01-04-02-00",3,null,7,1,4,2,0,"01","04","02","00"]
["01-05-00-01",2,null,7,1,5,0,1,"01","05","00","01"]
["01-05-01-00",2,null,7,1,5,1,0,"01","05","01","00"]
["01-06-00-00",2,null,7,1,6,0,0,"01","06","00","00"]
["02-00-00-05",5,null,7,2,0,0,5,"02","00","00","05"]
["02-00-01-04",4,null,7,2,0,1,4,"02","00","01","04"]
["02-00-02-03",4,null,7,2,0,2,3,"02","00","02","03"]
["02-00-03-02",4,null,7,2,0,3,2,"02","00","03","02"]
["02-00-04-01",4,null,7,2,0,4,1,"02","00","04","01"]
["02-00-05-00",4,null,7,2,0,5,0,"02","00","05","00"]
["02-01-00-04",4,null,7,2,1,0,4,"02","01","00","04"]
["02-01-01-03",4,null,7,2,1,1,3,"02","01","01","03"]
["02-01-02-02",4,null,7,2,1,2,2,"02","01","02","02"]
["02-01-03-01",4,null,7,2,1,3,1,"02","01","03","01"]
["02-01-04-00",4,null,7,2,1,4,0,"02","01","04","00"]
["02-02-00-03",3,null,7,2,2,0,3,"02","02","00","03"]
["02-02-01-02",3,null,7,2,2,1,2,"02","02","01","02"]
["02-02-02-01",3,null,7,2,2,2,1,"02","02","02","01"]
["02-02-03-00",3,null,7,2,2,3,0,"02","02","03","00"]
["02-03-00-02",3,null,7,2,3,0,2,"02","03","00","02"]
["02-03-01-01",3,null,7,2,3,1,1,"02","03","01","01"]
["02-03-02-00",3,null,7,2,3,2,0,"02","03","02","00"]
["02-04-00-01",2,null,7,2,4,0,1,"02","04","00","01"]
["02-04-01-00",2,null,7,2,4,1,0,"02","04","01","00"]
["02-05-00-00",2,null,7,2,5,0,0,"02","05","00","00"]
["03-00-00-04",4,null,7,3,0,0,4,"03","00","00","04"]
["03-00-01-03",4,null,7,3,0,1,3,"03","00","01","03"]
["03-00-02-02",4,null,7,3,0,2,2,"03","00","02","02"]
["03-00-03-01",4,null,7,3,0,3,1,"03","00","03","01"]
["03-00-04-00",3,null,7,3,0,4,0,"03","00","04","00"]
["03-01-00-03",3,null,7,3,1,0,3,"03","01","00","03"]
["03-01-01-02",3,null,7,3,1,1,2,"03","01","01","02"]
["03-01-02-01",3,null,7,3,1,2,1,"03","01","02","01"]
["03-01-03-00",3,null,7,3,1,3,0,"03","01","03","00"]
["03-02-00-02",3,null,7,3,2,0,2,"03","02","00","02"]
["03-02-01-01",3,null,7,3,2,1,1,"03","02","01","01"]
["03-02-02-00",3,null,7,3,2,2,0,"03","02","02","00"]
["03-03-00-01",2,null,7,3,3,0,1,"03","03","00","01"]
["03-03-01-00",2,null,7,3,3,1,0,"03","03","01","00"]
["03-04-00-00",2,null,7,3,4,0,0,"03","04","00","00"]
["04-00-00-03",3,null,7,4,0,0,3,"04","00","00","03"]
["04-00-01-02",3,null,7,4,0,1,2,"04","00","01","02"]
["04-00-02-01",3,null,7,4,0,2,1,"04","00","02","01"]
["04-00-03-00",3,null,7,4,0,3,0,"04","00","03","00"]
["04-01-00-02",3,null,7,4,1,0,2,"04","01","00","02"]
["04-01-01-01",3,null,7,4,1,1,1,"04","01","01","01"]
["04-01-02-00",3,null,7,4,1,2,0,"04","01","02","00"]
["04-02-00-01",2,null,7,4,2,0,1,"04","02","00","01"]
["04-02-01-00",2,null,7,4,2,1,0,"04","02","01","00"]
["04-03-00-00",2,null,7,4,3,0,0,"04","03","00","00"]
["05-00-00-02",3,null,7,5,0,0,2,"05","00","00","02"]
["05-00-01-01",3,null,7,5,0,1,1,"05","00","01","01"]
["05-00-02-00",3,null,7,5,0,2,0,"05","00","02","00"]
["05-01-00-01",2,null,7,5,1,0,1,"05","01","00","01"]
["05-01-01-00",2,null,7,5,1,1,0,"05","01","01","00"]
[{"$f":"I327&\"-\"&J327&\"-\"&K327&\"-\"&L327","v":"05-02-00-00"},2,null,7,5,2,0,0,"05","02","00","00"]
["06-00-00-01",2,null,7,6,0,0,1,{"$f":"IF(LEN(E328)=1,0&E328,IF(LEN(E328)=0,\"00\",RIGHT(E328,2)))","v":"06"},{"$f":"IF(LEN(F328)=1,0&F328,IF(LEN(F328)=0,\"00\",RIGHT(F328,2)))","v":"00"},{"$f":"IF(LEN(G328)=1,0&G328,IF(LEN(G328)=0,\"00\",RIGHT(G328,2)))","v":"00"},{"$f":"IF(LEN(H328)=1,0&H328,IF(LEN(H328)=0,\"00\",RIGHT(H328,2)))","v":"01"}]
["06-00-01-00",2,null,7,6,0,1,0,"06","00","01","00"]
["06-01-00-00",2,null,7,6,1,0,0,"06","01","00","00"]
["07-00-00-00",1,null,7,7,0,0,0,"07","00","00","00"]
["00-00-00-08",7,null,8,0,0,0,8,"00","00","00","08"]
["00-00-01-07",6,null,8,0,0,1,7,"00","00","01","07"]
["00-00-02-06",6,null,8,0,0,2,6,"00","00","02","06"]
["00-00-03-05",6,null,8,0,0,3,5,"00","00","03","05"]
["00-00-04-04",6,null,8,0,0,4,4,"00","00","04","04"]
["00-00-05-03",5,null,8,0,0,5,3,"00","00","05","03"]
["00-00-06-02",5,null,8,0,0,6,2,"00","00","06","02"]
["00-00-07-01",4,null,8,0,0,7,1,"00","00","07","01"]
["00-00-08-00",4,null,8,0,0,8,0,"00","00","08","00"]
["00-01-00-07",5,null,8,0,1,0,7,"00","01","00","07"]
["00-01-01-06",5,null,8,0,1,1,6,"00","01","01","06"]
["00-01-02-05",5,null,8,0,1,2,5,"00","01","02","05"]
["00-01-03-04",5,null,8,0,1,3,4,"00","01","03","04"]
["00-01-04-03",5,null,8,0,1,4,3,"00","01","04","03"]
["00-01-05-02",5,null,8,0,1,5,2,"00","01","05","02"]
["00-01-06-01",4,null,8,0,1,6,1,"00","01","06","01"]
["00-01-07-00",4,null,8,0,1,7,0,"00","01","07","00"]
["00-02-00-06",5,null,8,0,2,0,6,"00","02","00","06"]
["00-02-01-05",5,null,8,0,2,1,5,"00","02","01","05"]
["00-02-02-04",5,null,8,0,2,2,4,"00","02","02","04"]
["00-02-03-03",5,null,8,0,2,3,3,"00","02","03","03"]
["00-02-04-02",5,null,8,0,2,4,2,"00","02","04","02"]
["00-02-05-01",4,null,8,0,2,5,1,"00","02","05","01"]
["00-02-06-00",4,null,8,0,2,6,0,"00","02","06","00"]
["00-03-00-05",5,null,8,0,3,0,5,"00","03","00","05"]
["00-03-01-04",5,null,8,0,3,1,4,"00","03","01","04"]
["00-03-02-03",5,null,8,0,3,2,3,"00","03","02","03"]
["00-03-03-02",4,null,8,0,3,3,2,"00","03","03","02"]
["00-03-04-01",4,null,8,0,3,4,1,"00","03","04","01"]
["00-03-05-00",4,null,8,0,3,5,0,"00","03","05","00"]
["00-04-00-04",4,null,8,0,4,0,4,"00","04","00","04"]
["00-04-01-03",4,null,8,0,4,1,3,"00","04","01","03"]
["00-04-02-02",4,null,8,0,4,2,2,"00","04","02","02"]
["00-04-03-01",4,null,8,0,4,3,1,"00","04","03","01"]
["00-04-04-00",4,null,8,0,4,4,0,"00","04","04","00"]
["00-05-00-03",3,null,8,0,5,0,3,"00","05","00","03"]
["00-05-01-02",3,null,8,0,5,1,2,"00","05","01","02"]
["00-05-02-01",3,null,8,0,5,2,1,"00","05","02","01"]
["00-05-03-00",3,null,8,0,5,3,0,"00","05","03","00"]
["00-06-00-02",3,null,8,0,6,0,2,"00","06","00","02"]
["00-06-01-01",3,null,8,0,6,1,1,"00","06","01","01"]
["00-06-02-00",3,null,8,0,6,2,0,"00","06","02","00"]
["00-07-00-01",3,null,8,0,7,0,1,"00","07","00","01"]
["00-07-01-00",2,null,8,0,7,1,0,"00","07","01","00"]
["00-08-00-00",2,null,8,0,8,0,0,"00","08","00","00"]
["01-00-00-07",5,null,8,1,0,0,7,"01","00","00","07"]
["01-00-01-06",5,null,8,1,0,1,6,"01","00","01","06"]
["01-00-02-05",5,null,8,1,0,2,5,"01","00","02","05"]
["01-00-03-04",5,null,8,1,0,3,4,"01","00","03","04"]
["01-00-04-03",5,null,8,1,0,4,3,"01","00","04","03"]
["01-00-05-02",5,null,8,1,0,5,2,"01","00","05","02"]
["01-00-06-01",4,null,8,1,0,6,1,"01","00","06","01"]
["01-00-07-00",4,null,8,1,0,7,0,"01","00","07","00"]
["01-01-00-06",5,null,8,1,1,0,6,"01","01","00","06"]
["01-01-01-05",5,null,8,1,1,1,5,"01","01","01","05"]
["01-01-02-04",5,null,8,1,1,2,4,"01","01","02","04"]
["01-01-03-03",5,null,8,1,1,3,3,"01","01","03","03"]
["01-01-04-02",4,null,8,1,1,4,2,"01","01","04","02"]
["01-01-05-01",4,null,8,1,1,5,1,"01","01","05","01"]
[{"$f":"I391&\"-\"&J391&\"-\"&K391&\"-\"&L391","v":"01-01-06-00"},4,null,8,1,1,6,0,"01","01","06","00"]
["01-02-00-05",5,null,8,1,2,0,5,{"$f":"IF(LEN(E392)=1,0&E392,IF(LEN(E392)=0,\"00\",RIGHT(E392,2)))","v":"01"},{"$f":"IF(LEN(F392)=1,0&F392,IF(LEN(F392)=0,\"00\",RIGHT(F392,2)))","v":"02"},{"$f":"IF(LEN(G392)=1,0&G392,IF(LEN(G392)=0,\"00\",RIGHT(G392,2)))","v":"00"},{"$f":"IF(LEN(H392)=1,0&H392,IF(LEN(H392)=0,\"00\",RIGHT(H392,2)))","v":"05"}]
["01-02-01-04",4,null,8,1,2,1,4,"01","02","01","04"]
["01-02-02-03",4,null,8,1,2,2,3,"01","02","02","03"]
["01-02-03-02",4,null,8,1,2,3,2,"01","02","03","02"]
["01-02-04-01",4,null,8,1,2,4,1,"01","02","04","01"]
["01-02-05-00",4,null,8,1,2,5,0,"01","02","05","00"]
["01-03-00-04",4,null,8,1,3,0,4,"01","03","00","04"]
["01-03-01-03",4,null,8,1,3,1,3,"01","03","01","03"]
["01-03-02-02",4,null,8,1,3,2,2,"01","03","02","02"]
["01-03-03-01",4,null,8,1,3,3,1,"01","03","03","01"]
["01-03-04-00",4,null,8,1,3,4,0,"01","03","04","00"]
["01-04-00-03",3,null,8,1,4,0,3,"01","04","00","03"]
["01-04-01-02",3,null,8,1,4,1,2,"01","04","01","02"]
["01-04-02-01",3,null,8,1,4,2,1,"01","04","02","01"]
["01-04-03-00",3,null,8,1,4,3,0,"01","04","03","00"]
["01-05-00-02",3,null,8,1,5,0,2,"01","05","00","02"]
["01-05-01-01",3,null,8,1,5,1,1,"01","05","01","01"]
["01-05-02-00",2,null,8,1,5,2,0,"01","05","02","00"]
["01-06-00-01",2,null,8,1,6,0,1,"01","06","00","01"]
["01-06-01-00",2,null,8,1,6,1,0,"01","06","01","00"]
["01-07-00-00",2,null,8,1,7,0,0,"01","07","00","00"]
["02-00-00-06",5,null,8,2,0,0,6,"02","00","00","06"]
["02-00-01-05",5,null,8,2,0,1,5,"02","00","01","05"]
["02-00-02-04",4,null,8,2,0,2,4,"02","00","02","04"]
["02-00-03-03",4,null,8,2,0,3,3,"02","00","03","03"]
["02-00-04-02",4,null,8,2,0,4,2,"02","00","04","02"]
["02-00-05-01",4,null,8,2,0,5,1,"02","00","05","01"]
["02-00-06-00",4,null,8,2,0,6,0,"02","00","06","00"]
["02-01-00-05",4,null,8,2,1,0,5,"02","01","00","05"]
["02-01-01-04",4,null,8,2,1,1,4,"02","01","01","04"]
["02-01-02-03",4,null,8,2,1,2,3,"02","01","02","03"]
["02-01-03-02",4,null,8,2,1,3,2,"02","01","03","02"]
["02-01-04-01",4,null,8,2,1,4,1,"02","01","04","01"]
["02-01-05-00",4,null,8,2,1,5,0,"02","01","05","00"]
["02-02-00-04",4,null,8,2,2,0,4,"02","02","00","04"]
["02-02-01-03",4,null,8,2,2,1,3,"02","02","01","03"]
["02-02-02-02",4,null,8,2,2,2,2,"02","02","02","02"]
["02-02-03-01",4,null,8,2,2,3,1,"02","02","03","01"]
["02-02-04-00",4,null,8,2,2,4,0,"02","02","04","00"]
["02-03-00-03",3,null,8,2,3,0,3,"02","03","00","03"]
["02-03-01-02",3,null,8,2,3,1,2,"02","03","01","02"]
["02-03-02-01",3,null,8,2,3,2,1,"02","03","02","01"]
["02-03-03-00",3,null,8,2,3,3,0,"02","03","03","00"]
["02-04-00-02",3,null,8,2,4,0,2,"02","04","00","02"]
["02-04-01-01",3,null,8,2,4,1,1,"02","04","01","01"]
["02-04-02-00",2,null,8,2,4,2,0,"02","04","02","00"]
["02-05-00-01",2,null,8,2,5,0,1,"02","05","00","01"]
["02-05-01-00",2,null,8,2,5,1,0,"02","05","01","00"]
["02-06-00-00",2,null,8,2,6,0,0,"02","06","00","00"]
["03-00-00-05",4,null,8,3,0,0,5,"03","00","00","05"]
["03-00-01-04",4,null,8,3,0,1,4,"03","00","01","04"]
["03-00-02-03",4,null,8,3,0,2,3,"03","00","02","03"]
["03-00-03-02",4,null,8,3,0,3,2,"03","00","03","02"]
["03-00-04-01",4,null,8,3,0,4,1,"03","00","04","01"]
["03-00-05-00",4,null,8,3,0,5,0,"03","00","05","00"]
["03-01-00-04",4,null,8,3,1,0,4,"03","01","00","04"]
["03-01-01-03",4,null,8,3,1,1,3,"03","01","01","03"]
["03-01-02-02",4,null,8,3,1,2,2,"03","01","02","02"]
["03-01-03-01",4,null,8,3,1,3,1,"03","01","03","01"]
["03-01-04-00",3,null,8,3,1,4,0,"03","01","04","00"]
["03-02-00-03",3,null,8,3,2,0,3,"03","02","00","03"]
["03-02-01-02",3,null,8,3,2,1,2,"03","02","01","02"]
["03-02-02-01",3,null,8,3,2,2,1,"03","02","02","01"]
[{"$f":"I455&\"-\"&J455&\"-\"&K455&\"-\"&L455","v":"03-02-03-00"},3,null,8,3,2,3,0,"03","02","03","00"]
["03-03-00-02",3,null,8,3,3,0,2,{"$f":"IF(LEN(E456)=1,0&E456,IF(LEN(E456)=0,\"00\",RIGHT(E456,2)))","v":"03"},{"$f":"IF(LEN(F456)=1,0&F456,IF(LEN(F456)=0,\"00\",RIGHT(F456,2)))","v":"03"},{"$f":"IF(LEN(G456)=1,0&G456,IF(LEN(G456)=0,\"00\",RIGHT(G456,2)))","v":"00"},{"$f":"IF(LEN(H456)=1,0&H456,IF(LEN(H456)=0,\"00\",RIGHT(H456,2)))","v":"02"}]
["03-03-01-01",2,null,8,3,3,1,1,"03","03","01","01"]
["03-03-02-00",2,null,8,3,3,2,0,"03","03","02","00"]
["03-04-00-01",2,null,8,3,4,0,1,"03","04","00","01"]
["03-04-01-00",2,null,8,3,4,1,0,"03","04","01","00"]
["03-05-00-00",2,null,8,3,5,0,0,"03","05","00","00"]
["04-00-00-04",4,null,8,4,0,0,4,"04","00","00","04"]
["04-00-01-03",4,null,8,4,0,1,3,"04","00","01","03"]
["04-00-02-02",3,null,8,4,0,2,2,"04","00","02","02"]
["04-00-03-01",3,null,8,4,0,3,1,"04","00","03","01"]
["04-00-04-00",3,null,8,4,0,4,0,"04","00","04","00"]
["04-01-00-03",3,null,8,4,1,0,3,"04","01","00","03"]
["04-01-01-02",3,null,8,4,1,1,2,"04","01","01","02"]
["04-01-02-01",3,null,8,4,1,2,1,"04","01","02","01"]
["04-01-03-00",3,null,8,4,1,3,0,"04","01","03","00"]
["04-02-00-02",3,null,8,4,2,0,2,"04","02","00","02"]
["04-02-01-01",2,null,8,4,2,1,1,"04","02","01","01"]
["04-02-02-00",2,null,8,4,2,2,0,"04","02","02","00"]
["04-03-00-01",2,null,8,4,3,0,1,"04","03","00","01"]
["04-03-01-00",2,null,8,4,3,1,0,"04","03","01","00"]
["04-04-00-00",2,null,8,4,4,0,0,"04","04","00","00"]
["05-00-00-03",3,null,8,5,0,0,3,"05","00","00","03"]
["05-00-01-02",3,null,8,5,0,1,2,"05","00","01","02"]
["05-00-02-01",3,null,8,5,0,2,1,"05","00","02","01"]
["05-00-03-00",3,null,8,5,0,3,0,"05","00","03","00"]
["05-01-00-02",3,null,8,5,1,0,2,"05","01","00","02"]
["05-01-01-01",2,null,8,5,1,1,1,"05","01","01","01"]
["05-01-02-00",2,null,8,5,1,2,0,"05","01","02","00"]
["05-02-00-01",2,null,8,5,2,0,1,"05","02","00","01"]
["05-02-01-00",2,null,8,5,2,1,0,"05","02","01","00"]
["05-03-00-00",2,null,8,5,3,0,0,"05","03","00","00"]
["06-00-00-02",3,null,8,6,0,0,2,"06","00","00","02"]
["06-00-01-01",2,null,8,6,0,1,1,"06","00","01","01"]
["06-00-02-00",2,null,8,6,0,2,0,"06","00","02","00"]
["06-01-00-01",2,null,8,6,1,0,1,"06","01","00","01"]
["06-01-01-00",2,null,8,6,1,1,0,"06","01","01","00"]
["06-02-00-00",2,null,8,6,2,0,0,"06","02","00","00"]
["07-00-00-01",2,null,8,7,0,0,1,"07","00","00","01"]
["07-00-01-00",2,null,8,7,0,1,0,"07","00","01","00"]
["07-01-00-00",2,null,8,7,1,0,0,"07","01","00","00"]
["08-00-00-00",1,null,8,8,0,0,0,"08","00","00","00"]
["00-00-00-09",7,null,9,0,0,0,9,"00","00","00","09"]
["00-00-01-08",6,null,9,0,0,1,8,"00","00","01","08"]
["00-00-02-07",6,null,9,0,0,2,7,"00","00","02","07"]
["00-00-03-06",6,null,9,0,0,3,6,"00","00","03","06"]
["00-00-04-05",6,null,9,0,0,4,5,"00","00","04","05"]
["00-00-05-04",5,null,9,0,0,5,4,"00","00","05","04"]
["00-00-06-03",5,null,9,0,0,6,3,"00","00","06","03"]
["00-00-07-02",5,null,9,0,0,7,2,"00","00","07","02"]
["00-00-08-01",4,null,9,0,0,8,1,"00","00","08","01"]
["00-00-09-00",4,null,9,0,0,9,0,"00","00","09","00"]
["00-01-00-08",5,null,9,0,1,0,8,"00","01","00","08"]
["00-01-01-07",5,null,9,0,1,1,7,"00","01","01","07"]
["00-01-02-06",5,null,9,0,1,2,6,"00","01","02","06"]
["00-01-03-05",5,null,9,0,1,3,5,"00","01","03","05"]
["00-01-04-04",5,null,9,0,1,4,4,"00","01","04","04"]
["00-01-05-03",5,null,9,0,1,5,3,"00","01","05","03"]
["00-01-06-02",5,null,9,0,1,6,2,"00","01","06","02"]
["00-01-07-01",4,null,9,0,1,7,1,"00","01","07","01"]
["00-01-08-00",4,null,9,0,1,8,0,"00","01","08","00"]
["00-02-00-07",5,null,9,0,2,0,7,"00","02","00","07"]
["00-02-01-06",5,null,9,0,2,1,6,"00","02","01","06"]
["00-02-02-05",5,null,9,0,2,2,5,"00","02","02","05"]
[{"$f":"I519&\"-\"&J519&\"-\"&K519&\"-\"&L519","v":"00-02-03-04"},5,null,9,0,2,3,4,"00","02","03","04"]
["00-02-04-03",5,null,9,0,2,4,3,{"$f":"IF(LEN(E520)=1,0&E520,IF(LEN(E520)=0,\"00\",RIGHT(E520,2)))","v":"00"},{"$f":"IF(LEN(F520)=1,0&F520,IF(LEN(F520)=0,\"00\",RIGHT(F520,2)))","v":"02"},{"$f":"IF(LEN(G520)=1,0&G520,IF(LEN(G520)=0,\"00\",RIGHT(G520,2)))","v":"04"},{"$f":"IF(LEN(H520)=1,0&H520,IF(LEN(H520)=0,\"00\",RIGHT(H520,2)))","v":"03"}]
["00-02-05-02",5,null,9,0,2,5,2,"00","02","05","02"]
["00-02-06-01",4,null,9,0,2,6,1,"00","02","06","01"]
["00-02-07-00",4,null,9,0,2,7,0,"00","02","07","00"]
["00-03-00-06",5,null,9,0,3,0,6,"00","03","00","06"]
["00-03-01-05",5,null,9,0,3,1,5,"00","03","01","05"]
["00-03-02-04",5,null,9,0,3,2,4,"00","03","02","04"]
["00-03-03-03",5,null,9,0,3,3,3,"00","03","03","03"]
["00-03-04-02",4,null,9,0,3,4,2,"00","03","04","02"]
["00-03-05-01",4,null,9,0,3,5,1,"00","03","05","01"]
["00-03-06-00",4,null,9,0,3,6,0,"00","03","06","00"]
["00-04-00-05",5,null,9,0,4,0,5,"00","04","00","05"]
["00-04-01-04",4,null,9,0,4,1,4,"00","04","01","04"]
["00-04-02-03",4,null,9,0,4,2,3,"00","04","02","03"]
["00-04-03-02",4,null,9,0,4,3,2,"00","04","03","02"]
["00-04-04-01",4,null,9,0,4,4,1,"00","04","04","01"]
["00-04-05-00",4,null,9,0,4,5,0,"00","04","05","00"]
["00-05-00-04",3,null,9,0,5,0,4,"00","05","00","04"]
["00-05-01-03",3,null,9,0,5,1,3,"00","05","01","03"]
["00-05-02-02",3,null,9,0,5,2,2,"00","05","02","02"]
["00-05-03-01",3,null,9,0,5,3,1,"00","05","03","01"]
["00-05-04-00",3,null,9,0,5,4,0,"00","05","04","00"]
["00-06-00-03",3,null,9,0,6,0,3,"00","06","00","03"]
["00-06-01-02",3,null,9,0,6,1,2,"00","06","01","02"]
["00-06-02-01",3,null,9,0,6,2,1,"00","06","02","01"]
["00-06-03-00",3,null,9,0,6,3,0,"00","06","03","00"]
["00-07-00-02",3,null,9,0,7,0,2,"00","07","00","02"]
["00-07-01-01",3,null,9,0,7,1,1,"00","07","01","01"]
["00-07-02-00",3,null,9,0,7,2,0,"00","07","02","00"]
["00-08-00-01",2,null,9,0,8,0,1,"00","08","00","01"]
["00-08-01-00",2,null,9,0,8,1,0,"00","08","01","00"]
["00-09-00-00",2,null,9,0,9,0,0,"00","09","00","00"]
["01-00-00-08",5,null,9,1,0,0,8,"01","00","00","08"]
["01-00-01-07",5,null,9,1,0,1,7,"01","00","01","07"]
["01-00-02-06",5,null,9,1,0,2,6,"01","00","02","06"]
["01-00-03-05",5,null,9,1,0,3,5,"01","00","03","05"]
["01-00-04-04",5,null,9,1,0,4,4,"01","00","04","04"]
["01-00-05-03",5,null,9,1,0,5,3,"01","00","05","03"]
["01-00-06-02",5,null,9,1,0,6,2,"01","00","06","02"]
["01-00-07-01",4,null,9,1,0,7,1,"01","00","07","01"]
["01-00-08-00",4,null,9,1,0,8,0,"01","00","08","00"]
["01-01-00-07",5,null,9,1,1,0,7,"01","01","00","07"]
["01-01-01-06",5,null,9,1,1,1,6,"01","01","01","06"]
["01-01-02-05",5,null,9,1,1,2,5,"01","01","02","05"]
["01-01-03-04",5,null,9,1,1,3,4,"01","01","03","04"]
["01-01-04-03",5,null,9,1,1,4,3,"01","01","04","03"]
["01-01-05-02",4,null,9,1,1,5,2,"01","01","05","02"]
["01-01-06-01",4,null,9,1,1,6,1,"01","01","06","01"]
["01-01-07-00",4,null,9,1,1,7,0,"01","01","07","00"]
["01-02-00-06",5,null,9,1,2,0,6,"01","02","00","06"]
["01-02-01-05",5,null,9,1,2,1,5,"01","02","01","05"]
["01-02-02-04",4,null,9,1,2,2,4,"01","02","02","04"]
["01-02-03-03",4,null,9,1,2,3,3,"01","02","03","03"]
["01-02-04-02",4,null,9,1,2,4,2,"01","02","04","02"]
["01-02-05-01",4,null,9,1,2,5,1,"01","02","05","01"]
["01-02-06-00",4,null,9,1,2,6,0,"01","02","06","00"]
["01-03-00-05",4,null,9,1,3,0,5,"01","03","00","05"]
["01-03-01-04",4,null,9,1,3,1,4,"01","03","01","04"]
["01-03-02-03",4,null,9,1,3,2,3,"01","03","02","03"]
["01-03-03-02",4,null,9,1,3,3,2,"01","03","03","02"]
["01-03-04-01",4,null,9,1,3,4,1,"01","03","04","01"]
["01-03-05-00",4,null,9,1,3,5,0,"01","03","05","00"]
["01-04-00-04",3,null,9,1,4,0,4,"01","04","00","04"]
[{"$f":"I583&\"-\"&J583&\"-\"&K583&\"-\"&L583","v":"01-04-01-03"},3,null,9,1,4,1,3,"01","04","01","03"]
["01-04-02-02",3,null,9,1,4,2,2,{"$f":"IF(LEN(E584)=1,0&E584,IF(LEN(E584)=0,\"00\",RIGHT(E584,2)))","v":"01"},{"$f":"IF(LEN(F584)=1,0&F584,IF(LEN(F584)=0,\"00\",RIGHT(F584,2)))","v":"04"},{"$f":"IF(LEN(G584)=1,0&G584,IF(LEN(G584)=0,\"00\",RIGHT(G584,2)))","v":"02"},{"$f":"IF(LEN(H584)=1,0&H584,IF(LEN(H584)=0,\"00\",RIGHT(H584,2)))","v":"02"}]
["01-04-03-01",3,null,9,1,4,3,1,"01","04","03","01"]
["01-04-04-00",3,null,9,1,4,4,0,"01","04","04","00"]
["01-05-00-03",3,null,9,1,5,0,3,"01","05","00","03"]
["01-05-01-02",3,null,9,1,5,1,2,"01","05","01","02"]
["01-05-02-01",3,null,9,1,5,2,1,"01","05","02","01"]
["01-05-03-00",3,null,9,1,5,3,0,"01","05","03","00"]
["01-06-00-02",3,null,9,1,6,0,2,"01","06","00","02"]
["01-06-01-01",2,null,9,1,6,1,1,"01","06","01","01"]
["01-06-02-00",2,null,9,1,6,2,0,"01","06","02","00"]
["01-07-00-01",2,null,9,1,7,0,1,"01","07","00","01"]
["01-07-01-00",2,null,9,1,7,1,0,"01","07","01","00"]
["01-08-00-00",2,null,9,1,8,0,0,"01","08","00","00"]
["02-00-00-07",5,null,9,2,0,0,7,"02","00","00","07"]
["02-00-01-06",5,null,9,2,0,1,6,"02","00","01","06"]
["02-00-02-05",5,null,9,2,0,2,5,"02","00","02","05"]
["02-00-03-04",4,null,9,2,0,3,4,"02","00","03","04"]
["02-00-04-03",4,null,9,2,0,4,3,"02","00","04","03"]
["02-00-05-02",4,null,9,2,0,5,2,"02","00","05","02"]
["02-00-06-01",4,null,9,2,0,6,1,"02","00","06","01"]
["02-00-07-00",4,null,9,2,0,7,0,"02","00","07","00"]
["02-01-00-06",5,null,9,2,1,0,6,"02","01","00","06"]
["02-01-01-05",4,null,9,2,1,1,5,"02","01","01","05"]
["02-01-02-04",4,null,9,2,1,2,4,"02","01","02","04"]
["02-01-03-03",4,null,9,2,1,3,3,"02","01","03","03"]
["02-01-04-02",4,null,9,2,1,4,2,"02","01","04","02"]
["02-01-05-01",4,null,9,2,1,5,1,"02","01","05","01"]
["02-01-06-00",4,null,9,2,1,6,0,"02","01","06","00"]
["02-02-00-05",4,null,9,2,2,0,5,"02","02","00","05"]
["02-02-01-04",4,null,9,2,2,1,4,"02","02","01","04"]
["02-02-02-03",4,null,9,2,2,2,3,"02","02","02","03"]
["02-02-03-02",4,null,9,2,2,3,2,"02","02","03","02"]
["02-02-04-01",4,null,9,2,2,4,1,"02","02","04","01"]
["02-02-05-00",4,null,9,2,2,5,0,"02","02","05","00"]
["02-03-00-04",3,null,9,2,3,0,4,"02","03","00","04"]
["02-03-01-03",3,null,9,2,3,1,3,"02","03","01","03"]
["02-03-02-02",3,null,9,2,3,2,2,"02","03","02","02"]
["02-03-03-01",3,null,9,2,3,3,1,"02","03","03","01"]
["02-03-04-00",3,null,9,2,3,4,0,"02","03","04","00"]
["02-04-00-03",3,null,9,2,4,0,3,"02","04","00","03"]
["02-04-01-02",3,null,9,2,4,1,2,"02","04","01","02"]
["02-04-02-01",3,null,9,2,4,2,1,"02","04","02","01"]
["02-04-03-00",3,null,9,2,4,3,0,"02","04","03","00"]
["02-05-00-02",3,null,9,2,5,0,2,"02","05","00","02"]
["02-05-01-01",2,null,9,2,5,1,1,"02","05","01","01"]
["02-05-02-00",2,null,9,2,5,2,0,"02","05","02","00"]
["02-06-00-01",2,null,9,2,6,0,1,"02","06","00","01"]
["02-06-01-00",2,null,9,2,6,1,0,"02","06","01","00"]
["02-07-00-00",2,null,9,2,7,0,0,"02","07","00","00"]
["03-00-00-06",4,null,9,3,0,0,6,"03","00","00","06"]
["03-00-01-05",4,null,9,3,0,1,5,"03","00","01","05"]
["03-00-02-04",4,null,9,3,0,2,4,"03","00","02","04"]
["03-00-03-03",4,null,9,3,0,3,3,"03","00","03","03"]
["03-00-04-02",4,null,9,3,0,4,2,"03","00","04","02"]
["03-00-05-01",4,null,9,3,0,5,1,"03","00","05","01"]
["03-00-06-00",4,null,9,3,0,6,0,"03","00","06","00"]
["03-01-00-05",4,null,9,3,1,0,5,"03","01","00","05"]
["03-01-01-04",4,null,9,3,1,1,4,"03","01","01","04"]
["03-01-02-03",4,null,9,3,1,2,3,"03","01","02","03"]
["03-01-03-02",4,null,9,3,1,3,2,"03","01","03","02"]
["03-01-04-01",4,null,9,3,1,4,1,"03","01","04","01"]
["03-01-05-00",4,null,9,3,1,5,0,"03","01","05","00"]
["03-02-00-04",3,null,9,3,2,0,4,"03","02","00","04"]
[{"$f":"I647&\"-\"&J647&\"-\"&K647&\"-\"&L647","v":"03-02-01-03"},3,null,9,3,2,1,3,"03","02","01","03"]
["03-02-02-02",3,null,9,3,2,2,2,{"$f":"IF(LEN(E648)=1,0&E648,IF(LEN(E648)=0,\"00\",RIGHT(E648,2)))","v":"03"},{"$f":"IF(LEN(F648)=1,0&F648,IF(LEN(F648)=0,\"00\",RIGHT(F648,2)))","v":"02"},{"$f":"IF(LEN(G648)=1,0&G648,IF(LEN(G648)=0,\"00\",RIGHT(G648,2)))","v":"02"},{"$f":"IF(LEN(H648)=1,0&H648,IF(LEN(H648)=0,\"00\",RIGHT(H648,2)))","v":"02"}]
["03-02-03-01",3,null,9,3,2,3,1,"03","02","03","01"]
["03-02-04-00",3,null,9,3,2,4,0,"03","02","04","00"]
["03-03-00-03",3,null,9,3,3,0,3,"03","03","00","03"]
["03-03-01-02",3,null,9,3,3,1,2,"03","03","01","02"]
["03-03-02-01",3,null,9,3,3,2,1,"03","03","02","01"]
["03-03-03-00",3,null,9,3,3,3,0,"03","03","03","00"]
["03-04-00-02",3,null,9,3,4,0,2,"03","04","00","02"]
["03-04-01-01",2,null,9,3,4,1,1,"03","04","01","01"]
["03-04-02-00",2,null,9,3,4,2,0,"03","04","02","00"]
["03-05-00-01",2,null,9,3,5,0,1,"03","05","00","01"]
["03-05-01-00",2,null,9,3,5,1,0,"03","05","01","00"]
["03-06-00-00",2,null,9,3,6,0,0,"03","06","00","00"]
["04-00-00-05",4,null,9,4,0,0,5,"04","00","00","05"]
["04-00-01-04",4,null,9,4,0,1,4,"04","00","01","04"]
["04-00-02-03",4,null,9,4,0,2,3,"04","00","02","03"]
["04-00-03-02",4,null,9,4,0,3,2,"04","00","03","02"]
["04-00-04-01",3,null,9,4,0,4,1,"04","00","04","01"]
["04-00-05-00",3,null,9,4,0,5,0,"04","00","05","00"]
["04-01-00-04",3,null,9,4,1,0,4,"04","01","00","04"]
["04-01-01-03",3,null,9,4,1,1,3,"04","01","01","03"]
["04-01-02-02",3,null,9,4,1,2,2,"04","01","02","02"]
["04-01-03-01",3,null,9,4,1,3,1,"04","01","03","01"]
["04-01-04-00",3,null,9,4,1,4,0,"04","01","04","00"]
["04-02-00-03",3,null,9,4,2,0,3,"04","02","00","03"]
["04-02-01-02",3,null,9,4,2,1,2,"04","02","01","02"]
["04-02-02-01",3,null,9,4,2,2,1,"04","02","02","01"]
["04-02-03-00",3,null,9,4,2,3,0,"04","02","03","00"]
["04-03-00-02",3,null,9,4,3,0,2,"04","03","00","02"]
["04-03-01-01",2,null,9,4,3,1,1,"04","03","01","01"]
["04-03-02-00",2,null,9,4,3,2,0,"04","03","02","00"]
["04-04-00-01",2,null,9,4,4,0,1,"04","04","00","01"]
["04-04-01-00",2,null,9,4,4,1,0,"04","04","01","00"]
["04-05-00-00",2,null,9,4,5,0,0,"04","05","00","00"]
["05-00-00-04",3,null,9,5,0,0,4,"05","00","00","04"]
["05-00-01-03",3,null,9,5,0,1,3,"05","00","01","03"]
["05-00-02-02",3,null,9,5,0,2,2,"05","00","02","02"]
["05-00-03-01",3,null,9,5,0,3,1,"05","00","03","01"]
["05-00-04-00",3,null,9,5,0,4,0,"05","00","04","00"]
["05-01-00-03",3,null,9,5,1,0,3,"05","01","00","03"]
["05-01-01-02",3,null,9,5,1,1,2,"05","01","01","02"]
["05-01-02-01",3,null,9,5,1,2,1,"05","01","02","01"]
["05-01-03-00",3,null,9,5,1,3,0,"05","01","03","00"]
["05-02-00-02",3,null,9,5,2,0,2,"05","02","00","02"]
["05-02-01-01",2,null,9,5,2,1,1,"05","02","01","01"]
["05-02-02-00",2,null,9,5,2,2,0,"05","02","02","00"]
["05-03-00-01",2,null,9,5,3,0,1,"05","03","00","01"]
["05-03-01-00",2,null,9,5,3,1,0,"05","03","01","00"]
["05-04-00-00",2,null,9,5,4,0,0,"05","04","00","00"]
["06-00-00-03",3,null,9,6,0,0,3,"06","00","00","03"]
["06-00-01-02",3,null,9,6,0,1,2,"06","00","01","02"]
["06-00-02-01",3,null,9,6,0,2,1,"06","00","02","01"]
["06-00-03-00",3,null,9,6,0,3,0,"06","00","03","00"]
["06-01-00-02",3,null,9,6,1,0,2,"06","01","00","02"]
["06-01-01-01",2,null,9,6,1,1,1,"06","01","01","01"]
["06-01-02-00",2,null,9,6,1,2,0,"06","01","02","00"]
["06-02-00-01",2,null,9,6,2,0,1,"06","02","00","01"]
["06-02-01-00",2,null,9,6,2,1,0,"06","02","01","00"]
["06-03-00-00",2,null,9,6,3,0,0,"06","03","00","00"]
["07-00-00-02",3,null,9,7,0,0,2,"07","00","00","02"]
["07-00-01-01",2,null,9,7,0,1,1,"07","00","01","01"]
["07-00-02-00",2,null,9,7,0,2,0,"07","00","02","00"]
["07-01-00-01",2,null,9,7,1,0,1,"07","01","00","01"]
[{"$f":"I711&\"-\"&J711&\"-\"&K711&\"-\"&L711","v":"07-01-01-00"},2,null,9,7,1,1,0,"07","01","01","00"]
["07-02-00-00",2,null,9,7,2,0,0,{"$f":"IF(LEN(E712)=1,0&E712,IF(LEN(E712)=0,\"00\",RIGHT(E712,2)))","v":"07"},{"$f":"IF(LEN(F712)=1,0&F712,IF(LEN(F712)=0,\"00\",RIGHT(F712,2)))","v":"02"},{"$f":"IF(LEN(G712)=1,0&G712,IF(LEN(G712)=0,\"00\",RIGHT(G712,2)))","v":"00"},{"$f":"IF(LEN(H712)=1,0&H712,IF(LEN(H712)=0,\"00\",RIGHT(H712,2)))","v":"00"}]
["08-00-00-01",2,null,9,8,0,0,1,"08","00","00","01"]
["08-00-01-00",2,null,9,8,0,1,0,"08","00","01","00"]
["08-01-00-00",2,null,9,8,1,0,0,"08","01","00","00"]
["09-00-00-00",1,null,9,9,0,0,0,"09","00","00","00"]
["00-00-00-10",7,null,10,0,0,0,10,"00","00","00","10"]
["00-00-01-09",6,null,10,0,0,1,9,"00","00","01","09"]
["00-00-02-08",6,null,10,0,0,2,8,"00","00","02","08"]
["00-00-03-07",6,null,10,0,0,3,7,"00","00","03","07"]
["00-00-04-06",6,null,10,0,0,4,6,"00","00","04","06"]
["00-00-05-05",6,null,10,0,0,5,5,"00","00","05","05"]
["00-00-06-04",5,null,10,0,0,6,4,"00","00","06","04"]
["00-00-07-03",5,null,10,0,0,7,3,"00","00","07","03"]
["00-00-08-02",5,null,10,0,0,8,2,"00","00","08","02"]
["00-00-09-01",4,null,10,0,0,9,1,"00","00","09","01"]
["00-00-10-00",4,null,10,0,0,10,0,"00","00","10","00"]
["00-01-00-09",5,null,10,0,1,0,9,"00","01","00","09"]
["00-01-01-08",5,null,10,0,1,1,8,"00","01","01","08"]
["00-01-02-07",5,null,10,0,1,2,7,"00","01","02","07"]
["00-01-03-06",5,null,10,0,1,3,6,"00","01","03","06"]
["00-01-04-05",5,null,10,0,1,4,5,"00","01","04","05"]
["00-01-05-04",5,null,10,0,1,5,4,"00","01","05","04"]
["00-01-06-03",5,null,10,0,1,6,3,"00","01","06","03"]
["00-01-07-02",5,null,10,0,1,7,2,"00","01","07","02"]
["00-01-08-01",4,null,10,0,1,8,1,"00","01","08","01"]
["00-01-09-00",4,null,10,0,1,9,0,"00","01","09","00"]
["00-02-00-08",5,null,10,0,2,0,8,"00","02","00","08"]
["00-02-01-07",5,null,10,0,2,1,7,"00","02","01","07"]
["00-02-02-06",5,null,10,0,2,2,6,"00","02","02","06"]
["00-02-03-05",5,null,10,0,2,3,5,"00","02","03","05"]
["00-02-04-04",5,null,10,0,2,4,4,"00","02","04","04"]
["00-02-05-03",5,null,10,0,2,5,3,"00","02","05","03"]
["00-02-06-02",5,null,10,0,2,6,2,"00","02","06","02"]
["00-02-07-01",4,null,10,0,2,7,1,"00","02","07","01"]
["00-02-08-00",4,null,10,0,2,8,0,"00","02","08","00"]
["00-03-00-07",5,null,10,0,3,0,7,"00","03","00","07"]
["00-03-01-06",5,null,10,0,3,1,6,"00","03","01","06"]
["00-03-02-05",5,null,10,0,3,2,5,"00","03","02","05"]
["00-03-03-04",5,null,10,0,3,3,4,"00","03","03","04"]
["00-03-04-03",5,null,10,0,3,4,3,"00","03","04","03"]
["00-03-05-02",4,null,10,0,3,5,2,"00","03","05","02"]
["00-03-06-01",4,null,10,0,3,6,1,"00","03","06","01"]
["00-03-07-00",4,null,10,0,3,7,0,"00","03","07","00"]
["00-04-00-06",5,null,10,0,4,0,6,"00","04","00","06"]
["00-04-01-05",5,null,10,0,4,1,5,"00","04","01","05"]
["00-04-02-04",5,null,10,0,4,2,4,"00","04","02","04"]
["00-04-03-03",4,null,10,0,4,3,3,"00","04","03","03"]
["00-04-04-02",4,null,10,0,4,4,2,"00","04","04","02"]
["00-04-05-01",4,null,10,0,4,5,1,"00","04","05","01"]
["00-04-06-00",4,null,10,0,4,6,0,"00","04","06","00"]
["00-05-00-05",4,null,10,0,5,0,5,"00","05","00","05"]
["00-05-01-04",4,null,10,0,5,1,4,"00","05","01","04"]
["00-05-02-03",4,null,10,0,5,2,3,"00","05","02","03"]
["00-05-03-02",4,null,10,0,5,3,2,"00","05","03","02"]
["00-05-04-01",4,null,10,0,5,4,1,"00","05","04","01"]
["00-05-05-00",4,null,10,0,5,5,0,"00","05","05","00"]
["00-06-00-04",3,null,10,0,6,0,4,"00","06","00","04"]
["00-06-01-03",3,null,10,0,6,1,3,"00","06","01","03"]
["00-06-02-02",3,null,10,0,6,2,2,"00","06","02","02"]
["00-06-03-01",3,null,10,0,6,3,1,"00","06","03","01"]
["00-06-04-00",3,null,10,0,6,4,0,"00","06","04","00"]
["00-07-00-03",3,null,10,0,7,0,3,"00","07","00","03"]
["00-07-01-02",3,null,10,0,7,1,2,"00","07","01","02"]
[{"$f":"I775&\"-\"&J775&\"-\"&K775&\"-\"&L775","v":"00-07-02-01"},3,null,10,0,7,2,1,"00","07","02","01"]
["00-07-03-00",3,null,10,0,7,3,0,{"$f":"IF(LEN(E776)=1,0&E776,IF(LEN(E776)=0,\"00\",RIGHT(E776,2)))","v":"00"},{"$f":"IF(LEN(F776)=1,0&F776,IF(LEN(F776)=0,\"00\",RIGHT(F776,2)))","v":"07"},{"$f":"IF(LEN(G776)=1,0&G776,IF(LEN(G776)=0,\"00\",RIGHT(G776,2)))","v":"03"},{"$f":"IF(LEN(H776)=1,0&H776,IF(LEN(H776)=0,\"00\",RIGHT(H776,2)))","v":"00"}]
["00-08-00-02",3,null,10,0,8,0,2,"00","08","00","02"]
["00-08-01-01",3,null,10,0,8,1,1,"00","08","01","01"]
["00-08-02-00",3,null,10,0,8,2,0,"00","08","02","00"]
["00-09-00-01",2,null,10,0,9,0,1,"00","09","00","01"]
["00-09-01-00",2,null,10,0,9,1,0,"00","09","01","00"]
["00-10-00-00",2,null,10,0,10,0,0,"00","10","00","00"]
["01-00-00-09",5,null,10,1,0,0,9,"01","00","00","09"]
["01-00-01-08",5,null,10,1,0,1,8,"01","00","01","08"]
["01-00-02-07",5,null,10,1,0,2,7,"01","00","02","07"]
["01-00-03-06",5,null,10,1,0,3,6,"01","00","03","06"]
["01-00-04-05",5,null,10,1,0,4,5,"01","00","04","05"]
["01-00-05-04",5,null,10,1,0,5,4,"01","00","05","04"]
["01-00-06-03",5,null,10,1,0,6,3,"01","00","06","03"]
["01-00-07-02",5,null,10,1,0,7,2,"01","00","07","02"]
["01-00-08-01",4,null,10,1,0,8,1,"01","00","08","01"]
["01-00-09-00",4,null,10,1,0,9,0,"01","00","09","00"]
["01-01-00-08",5,null,10,1,1,0,8,"01","01","00","08"]
["01-01-01-07",5,null,10,1,1,1,7,"01","01","01","07"]
["01-01-02-06",5,null,10,1,1,2,6,"01","01","02","06"]
["01-01-03-05",5,null,10,1,1,3,5,"01","01","03","05"]
["01-01-04-04",5,null,10,1,1,4,4,"01","01","04","04"]
["01-01-05-03",5,null,10,1,1,5,3,"01","01","05","03"]
["01-01-06-02",4,null,10,1,1,6,2,"01","01","06","02"]
["01-01-07-01",4,null,10,1,1,7,1,"01","01","07","01"]
["01-01-08-00",4,null,10,1,1,8,0,"01","01","08","00"]
["01-02-00-07",5,null,10,1,2,0,7,"01","02","00","07"]
["01-02-01-06",5,null,10,1,2,1,6,"01","02","01","06"]
["01-02-02-05",5,null,10,1,2,2,5,"01","02","02","05"]
["01-02-03-04",5,null,10,1,2,3,4,"01","02","03","04"]
["01-02-04-03",4,null,10,1,2,4,3,"01","02","04","03"]
["01-02-05-02",4,null,10,1,2,5,2,"01","02","05","02"]
["01-02-06-01",4,null,10,1,2,6,1,"01","02","06","01"]
["01-02-07-00",4,null,10,1,2,7,0,"01","02","07","00"]
["01-03-00-06",5,null,10,1,3,0,6,"01","03","00","06"]
["01-03-01-05",4,null,10,1,3,1,5,"01","03","01","05"]
["01-03-02-04",4,null,10,1,3,2,4,"01","03","02","04"]
["01-03-03-03",4,null,10,1,3,3,3,"01","03","03","03"]
["01-03-04-02",4,null,10,1,3,4,2,"01","03","04","02"]
["01-03-05-01",4,null,10,1,3,5,1,"01","03","05","01"]
["01-03-06-00",4,null,10,1,3,6,0,"01","03","06","00"]
["01-04-00-05",4,null,10,1,4,0,5,"01","04","00","05"]
["01-04-01-04",4,null,10,1,4,1,4,"01","04","01","04"]
["01-04-02-03",4,null,10,1,4,2,3,"01","04","02","03"]
["01-04-03-02",4,null,10,1,4,3,2,"01","04","03","02"]
["01-04-04-01",4,null,10,1,4,4,1,"01","04","04","01"]
["01-04-05-00",4,null,10,1,4,5,0,"01","04","05","00"]
["01-05-00-04",3,null,10,1,5,0,4,"01","05","00","04"]
["01-05-01-03",3,null,10,1,5,1,3,"01","05","01","03"]
["01-05-02-02",3,null,10,1,5,2,2,"01","05","02","02"]
["01-05-03-01",3,null,10,1,5,3,1,"01","05","03","01"]
["01-05-04-00",3,null,10,1,5,4,0,"01","05","04","00"]
["01-06-00-03",3,null,10,1,6,0,3,"01","06","00","03"]
["01-06-01-02",3,null,10,1,6,1,2,"01","06","01","02"]
["01-06-02-01",3,null,10,1,6,2,1,"01","06","02","01"]
["01-06-03-00",3,null,10,1,6,3,0,"01","06","03","00"]
["01-07-00-02",3,null,10,1,7,0,2,"01","07","00","02"]
["01-07-01-01",2,null,10,1,7,1,1,"01","07","01","01"]
["01-07-02-00",2,null,10,1,7,2,0,"01","07","02","00"]
["01-08-00-01",2,null,10,1,8,0,1,"01","08","00","01"]
["01-08-01-00",2,null,10,1,8,1,0,"01","08","01","00"]
["01-09-00-00",2,null,10,1,9,0,0,"01","09","00","00"]
["02-00-00-08",5,null,10,2,0,0,8,"02","00","00","08"]
[{"$f":"I839&\"-\"&J839&\"-\"&K839&\"-\"&L839","v":"02-00-01-07"},5,null,10,2,0,1,7,"02","00","01","07"]
["02-00-02-06",5,null,10,2,0,2,6,{"$f":"IF(LEN(E840)=1,0&E840,IF(LEN(E840)=0,\"00\",RIGHT(E840,2)))","v":"02"},{"$f":"IF(LEN(F840)=1,0&F840,IF(LEN(F840)=0,\"00\",RIGHT(F840,2)))","v":"00"},{"$f":"IF(LEN(G840)=1,0&G840,IF(LEN(G840)=0,\"00\",RIGHT(G840,2)))","v":"02"},{"$f":"IF(LEN(H840)=1,0&H840,IF(LEN(H840)=0,\"00\",RIGHT(H840,2)))","v":"06"}]
["02-00-03-05",5,null,10,2,0,3,5,"02","00","03","05"]
["02-00-04-04",5,null,10,2,0,4,4,"02","00","04","04"]
["02-00-05-03",4,null,10,2,0,5,3,"02","00","05","03"]
["02-00-06-02",4,null,10,2,0,6,2,"02","00","06","02"]
["02-00-07-01",4,null,10,2,0,7,1,"02","00","07","01"]
["02-00-08-00",4,null,10,2,0,8,0,"02","00","08","00"]
["02-01-00-07",5,null,10,2,1,0,7,"02","01","00","07"]
["02-01-01-06",5,null,10,2,1,1,6,"02","01","01","06"]
["02-01-02-05",4,null,10,2,1,2,5,"02","01","02","05"]
["02-01-03-04",4,null,10,2,1,3,4,"02","01","03","04"]
["02-01-04-03",4,null,10,2,1,4,3,"02","01","04","03"]
["02-01-05-02",4,null,10,2,1,5,2,"02","01","05","02"]
["02-01-06-01",4,null,10,2,1,6,1,"02","01","06","01"]
["02-01-07-00",4,null,10,2,1,7,0,"02","01","07","00"]
["02-02-00-06",4,null,10,2,2,0,6,"02","02","00","06"]
["02-02-01-05",4,null,10,2,2,1,5,"02","02","01","05"]
["02-02-02-04",4,null,10,2,2,2,4,"02","02","02","04"]
["02-02-03-03",4,null,10,2,2,3,3,"02","02","03","03"]
["02-02-04-02",4,null,10,2,2,4,2,"02","02","04","02"]
["02-02-05-01",4,null,10,2,2,5,1,"02","02","05","01"]
["02-02-06-00",4,null,10,2,2,6,0,"02","02","06","00"]
["02-03-00-05",4,null,10,2,3,0,5,"02","03","00","05"]
["02-03-01-04",4,null,10,2,3,1,4,"02","03","01","04"]
["02-03-02-03",4,null,10,2,3,2,3,"02","03","02","03"]
["02-03-03-02",4,null,10,2,3,3,2,"02","03","03","02"]
["02-03-04-01",4,null,10,2,3,4,1,"02","03","04","01"]
["02-03-05-00",4,null,10,2,3,5,0,"02","03","05","00"]
["02-04-00-04",3,null,10,2,4,0,4,"02","04","00","04"]
["02-04-01-03",3,null,10,2,4,1,3,"02","04","01","03"]
["02-04-02-02",3,null,10,2,4,2,2,"02","04","02","02"]
["02-04-03-01",3,null,10,2,4,3,1,"02","04","03","01"]
["02-04-04-00",3,null,10,2,4,4,0,"02","04","04","00"]
["02-05-00-03",3,null,10,2,5,0,3,"02","05","00","03"]
["02-05-01-02",3,null,10,2,5,1,2,"02","05","01","02"]
["02-05-02-01",3,null,10,2,5,2,1,"02","05","02","01"]
["02-05-03-00",3,null,10,2,5,3,0,"02","05","03","00"]
["02-06-00-02",3,null,10,2,6,0,2,"02","06","00","02"]
["02-06-01-01",2,null,10,2,6,1,1,"02","06","01","01"]
["02-06-02-00",2,null,10,2,6,2,0,"02","06","02","00"]
["02-07-00-01",2,null,10,2,7,0,1,"02","07","00","01"]
["02-07-01-00",2,null,10,2,7,1,0,"02","07","01","00"]
["02-08-00-00",2,null,10,2,8,0,0,"02","08","00","00"]
["03-00-00-07",5,null,10,3,0,0,7,"03","00","00","07"]
["03-00-01-06",4,null,10,3,0,1,6,"03","00","01","06"]
["03-00-02-05",4,null,10,3,0,2,5,"03","00","02","05"]
["03-00-03-04",4,null,10,3,0,3,4,"03","00","03","04"]
["03-00-04-03",4,null,10,3,0,4,3,"03","00","04","03"]
["03-00-05-02",4,null,10,3,0,5,2,"03","00","05","02"]
["03-00-06-01",4,null,10,3,0,6,1,"03","00","06","01"]
["03-00-07-00",4,null,10,3,0,7,0,"03","00","07","00"]
["03-01-00-06",4,null,10,3,1,0,6,"03","01","00","06"]
["03-01-01-05",4,null,10,3,1,1,5,"03","01","01","05"]
["03-01-02-04",4,null,10,3,1,2,4,"03","01","02","04"]
["03-01-03-03",4,null,10,3,1,3,3,"03","01","03","03"]
["03-01-04-02",4,null,10,3,1,4,2,"03","01","04","02"]
["03-01-05-01",4,null,10,3,1,5,1,"03","01","05","01"]
["03-01-06-00",4,null,10,3,1,6,0,"03","01","06","00"]
["03-02-00-05",4,null,10,3,2,0,5,"03","02","00","05"]
["03-02-01-04",4,null,10,3,2,1,4,"03","02","01","04"]
["03-02-02-03",4,null,10,3,2,2,3,"03","02","02","03"]
["03-02-03-02",4,null,10,3,2,3,2,"03","02","03","02"]
["03-02-04-01",4,null,10,3,2,4,1,"03","02","04","01"]
[{"$f":"I903&\"-\"&J903&\"-\"&K903&\"-\"&L903","v":"03-02-05-00"},4,null,10,3,2,5,0,"03","02","05","00"]
["03-03-00-04",3,null,10,3,3,0,4,{"$f":"IF(LEN(E904)=1,0&E904,IF(LEN(E904)=0,\"00\",RIGHT(E904,2)))","v":"03"},{"$f":"IF(LEN(F904)=1,0&F904,IF(LEN(F904)=0,\"00\",RIGHT(F904,2)))","v":"03"},{"$f":"IF(LEN(G904)=1,0&G904,IF(LEN(G904)=0,\"00\",RIGHT(G904,2)))","v":"00"},{"$f":"IF(LEN(H904)=1,0&H904,IF(LEN(H904)=0,\"00\",RIGHT(H904,2)))","v":"04"}]
["03-03-01-03",3,null,10,3,3,1,3,"03","03","01","03"]
["03-03-02-02",3,null,10,3,3,2,2,"03","03","02","02"]
["03-03-03-01",3,null,10,3,3,3,1,"03","03","03","01"]
["03-03-04-00",3,null,10,3,3,4,0,"03","03","04","00"]
["03-04-00-03",3,null,10,3,4,0,3,"03","04","00","03"]
["03-04-01-02",3,null,10,3,4,1,2,"03","04","01","02"]
["03-04-02-01",3,null,10,3,4,2,1,"03","04","02","01"]
["03-04-03-00",3,null,10,3,4,3,0,"03","04","03","00"]
["03-05-00-02",3,null,10,3,5,0,2,"03","05","00","02"]
["03-05-01-01",2,null,10,3,5,1,1,"03","05","01","01"]
["03-05-02-00",2,null,10,3,5,2,0,"03","05","02","00"]
["03-06-00-01",2,null,10,3,6,0,1,"03","06","00","01"]
["03-06-01-00",2,null,10,3,6,1,0,"03","06","01","00"]
["03-07-00-00",2,null,10,3,7,0,0,"03","07","00","00"]
["04-00-00-06",4,null,10,4,0,0,6,"04","00","00","06"]
["04-00-01-05",4,null,10,4,0,1,5,"04","00","01","05"]
["04-00-02-04",4,null,10,4,0,2,4,"04","00","02","04"]
["04-00-03-03",4,null,10,4,0,3,3,"04","00","03","03"]
["04-00-04-02",4,null,10,4,0,4,2,"04","00","04","02"]
["04-00-05-01",4,null,10,4,0,5,1,"04","00","05","01"]
["04-00-06-00",4,null,10,4,0,6,0,"04","00","06","00"]
["04-01-00-05",4,null,10,4,1,0,5,"04","01","00","05"]
["04-01-01-04",4,null,10,4,1,1,4,"04","01","01","04"]
["04-01-02-03",4,null,10,4,1,2,3,"04","01","02","03"]
["04-01-03-02",4,null,10,4,1,3,2,"04","01","03","02"]
["04-01-04-01",3,null,10,4,1,4,1,"04","01","04","01"]
["04-01-05-00",3,null,10,4,1,5,0,"04","01","05","00"]
["04-02-00-04",3,null,10,4,2,0,4,"04","02","00","04"]
["04-02-01-03",3,null,10,4,2,1,3,"04","02","01","03"]
["04-02-02-02",3,null,10,4,2,2,2,"04","02","02","02"]
["04-02-03-01",3,null,10,4,2,3,1,"04","02","03","01"]
["04-02-04-00",3,null,10,4,2,4,0,"04","02","04","00"]
["04-03-00-03",3,null,10,4,3,0,3,"04","03","00","03"]
["04-03-01-02",3,null,10,4,3,1,2,"04","03","01","02"]
["04-03-02-01",3,null,10,4,3,2,1,"04","03","02","01"]
["04-03-03-00",3,null,10,4,3,3,0,"04","03","03","00"]
["04-04-00-02",3,null,10,4,4,0,2,"04","04","00","02"]
["04-04-01-01",2,null,10,4,4,1,1,"04","04","01","01"]
["04-04-02-00",2,null,10,4,4,2,0,"04","04","02","00"]
["04-05-00-01",2,null,10,4,5,0,1,"04","05","00","01"]
["04-05-01-00",2,null,10,4,5,1,0,"04","05","01","00"]
["04-06-00-00",2,null,10,4,6,0,0,"04","06","00","00"]
["05-00-00-05",4,null,10,5,0,0,5,"05","00","00","05"]
["05-00-01-04",4,null,10,5,0,1,4,"05","00","01","04"]
["05-00-02-03",4,null,10,5,0,2,3,"05","00","02","03"]
["05-00-03-02",3,null,10,5,0,3,2,"05","00","03","02"]
["05-00-04-01",3,null,10,5,0,4,1,"05","00","04","01"]
["05-00-05-00",3,null,10,5,0,5,0,"05","00","05","00"]
["05-01-00-04",3,null,10,5,1,0,4,"05","01","00","04"]
["05-01-01-03",3,null,10,5,1,1,3,"05","01","01","03"]
["05-01-02-02",3,null,10,5,1,2,2,"05","01","02","02"]
["05-01-03-01",3,null,10,5,1,3,1,"05","01","03","01"]
["05-01-04-00",3,null,10,5,1,4,0,"05","01","04","00"]
["05-02-00-03",3,null,10,5,2,0,3,"05","02","00","03"]
["05-02-01-02",3,null,10,5,2,1,2,"05","02","01","02"]
["05-02-02-01",3,null,10,5,2,2,1,"05","02","02","01"]
["05-02-03-00",3,null,10,5,2,3,0,"05","02","03","00"]
["05-03-00-02",3,null,10,5,3,0,2,"05","03","00","02"]
["05-03-01-01",2,null,10,5,3,1,1,"05","03","01","01"]
["05-03-02-00",2,null,10,5,3,2,0,"05","03","02","00"]
["05-04-00-01",2,null,10,5,4,0,1,"05","04","00","01"]
["05-04-01-00",2,null,10,5,4,1,0,"05","04","01","00"]
[{"$f":"I967&\"-\"&J967&\"-\"&K967&\"-\"&L967","v":"05-05-00-00"},2,null,10,5,5,0,0,"05","05","00","00"]
["06-00-00-04",3,null,10,6,0,0,4,{"$f":"IF(LEN(E968)=1,0&E968,IF(LEN(E968)=0,\"00\",RIGHT(E968,2)))","v":"06"},{"$f":"IF(LEN(F968)=1,0&F968,IF(LEN(F968)=0,\"00\",RIGHT(F968,2)))","v":"00"},{"$f":"IF(LEN(G968)=1,0&G968,IF(LEN(G968)=0,\"00\",RIGHT(G968,2)))","v":"00"},{"$f":"IF(LEN(H968)=1,0&H968,IF(LEN(H968)=0,\"00\",RIGHT(H968,2)))","v":"04"}]
["06-00-01-03",3,null,10,6,0,1,3,"06","00","01","03"]
["06-00-02-02",3,null,10,6,0,2,2,"06","00","02","02"]
["06-00-03-01",3,null,10,6,0,3,1,"06","00","03","01"]
["06-00-04-00",3,null,10,6,0,4,0,"06","00","04","00"]
["06-01-00-03",3,null,10,6,1,0,3,"06","01","00","03"]
["06-01-01-02",3,null,10,6,1,1,2,"06","01","01","02"]
["06-01-02-01",3,null,10,6,1,2,1,"06","01","02","01"]
["06-01-03-00",3,null,10,6,1,3,0,"06","01","03","00"]
["06-02-00-02",3,null,10,6,2,0,2,"06","02","00","02"]
["06-02-01-01",2,null,10,6,2,1,1,"06","02","01","01"]
["06-02-02-00",2,null,10,6,2,2,0,"06","02","02","00"]
["06-03-00-01",2,null,10,6,3,0,1,"06","03","00","01"]
["06-03-01-00",2,null,10,6,3,1,0,"06","03","01","00"]
["06-04-00-00",2,null,10,6,4,0,0,"06","04","00","00"]
["07-00-00-03",3,null,10,7,0,0,3,"07","00","00","03"]
["07-00-01-02",3,null,10,7,0,1,2,"07","00","01","02"]
["07-00-02-01",3,null,10,7,0,2,1,"07","00","02","01"]
["07-00-03-00",3,null,10,7,0,3,0,"07","00","03","00"]
["07-01-00-02",3,null,10,7,1,0,2,"07","01","00","02"]
["07-01-01-01",2,null,10,7,1,1,1,"07","01","01","01"]
["07-01-02-00",2,null,10,7,1,2,0,"07","01","02","00"]
["07-02-00-01",2,null,10,7,2,0,1,"07","02","00","01"]
["07-02-01-00",2,null,10,7,2,1,0,"07","02","01","00"]
["07-03-00-00",2,null,10,7,3,0,0,"07","03","00","00"]
["08-00-00-02",3,null,10,8,0,0,2,"08","00","00","02"]
["08-00-01-01",2,null,10,8,0,1,1,"08","00","01","01"]
["08-00-02-00",2,null,10,8,0,2,0,"08","00","02","00"]
["08-01-00-01",2,null,10,8,1,0,1,"08","01","00","01"]
["08-01-01-00",2,null,10,8,1,1,0,"08","01","01","00"]
["08-02-00-00",2,null,10,8,2,0,0,"08","02","00","00"]
["09-00-00-01",2,null,10,9,0,0,1,"09","00","00","01"]
["09-00-01-00",2,null,10,9,0,1,0,"09","00","01","00"]
["09-01-00-00",2,null,10,9,1,0,0,"09","01","00","00"]
["10-00-00-00",1,null,10,10,0,0,0,"10","00","00","00"]
["00-00-00-11",7,null,11,0,0,0,11,"00","00","00","11"]
["00-00-01-10",6,null,11,0,0,1,10,"00","00","01","10"]
["00-00-02-09",6,null,11,0,0,2,9,"00","00","02","09"]
["00-00-03-08",6,null,11,0,0,3,8,"00","00","03","08"]
["00-00-04-07",6,null,11,0,0,4,7,"00","00","04","07"]
["00-00-05-06",6,null,11,0,0,5,6,"00","00","05","06"]
["00-00-06-05",5,null,11,0,0,6,5,"00","00","06","05"]
["00-00-07-04",5,null,11,0,0,7,4,"00","00","07","04"]
["00-00-08-03",5,null,11,0,0,8,3,"00","00","08","03"]
["00-00-09-02",4,null,11,0,0,9,2,"00","00","09","02"]
["00-00-10-01",4,null,11,0,0,10,1,"00","00","10","01"]
["00-00-11-00",4,null,11,0,0,11,0,"00","00","11","00"]
["00-01-00-10",5,null,11,0,1,0,10,"00","01","00","10"]
["00-01-01-09",5,null,11,0,1,1,9,"00","01","01","09"]
["00-01-02-08",5,null,11,0,1,2,8,"00","01","02","08"]
["00-01-03-07",5,null,11,0,1,3,7,"00","01","03","07"]
["00-01-04-06",5,null,11,0,1,4,6,"00","01","04","06"]
["00-01-05-05",5,null,11,0,1,5,5,"00","01","05","05"]
["00-01-06-04",5,null,11,0,1,6,4,"00","01","06","04"]
["00-01-07-03",5,null,11,0,1,7,3,"00","01","07","03"]
["00-01-08-02",4,null,11,0,1,8,2,"00","01","08","02"]
["00-01-09-01",4,null,11,0,1,9,1,"00","01","09","01"]
["00-01-10-00",4,null,11,0,1,10,0,"00","01","10","00"]
["00-02-00-09",5,null,11,0,2,0,9,"00","02","00","09"]
["00-02-01-08",5,null,11,0,2,1,8,"00","02","01","08"]
["00-02-02-07",5,null,11,0,2,2,7,"00","02","02","07"]
["00-02-03-06",5,null,11,0,2,3,6,"00","02","03","06"]
["00-02-04-05",5,null,11,0,2,4,5,"00","02","04","05"]
[{"$f":"I1031&\"-\"&J1031&\"-\"&K1031&\"-\"&L1031","v":"00-02-05-04"},5,null,11,0,2,5,4,"00","02","05","04"]
["00-02-06-03",5,null,11,0,2,6,3,{"$f":"IF(LEN(E1032)=1,0&E1032,IF(LEN(E1032)=0,\"00\",RIGHT(E1032,2)))","v":"00"},{"$f":"IF(LEN(F1032)=1,0&F1032,IF(LEN(F1032)=0,\"00\",RIGHT(F1032,2)))","v":"02"},{"$f":"IF(LEN(G1032)=1,0&G1032,IF(LEN(G1032)=0,\"00\",RIGHT(G1032,2)))","v":"06"},{"$f":"IF(LEN(H1032)=1,0&H1032,IF(LEN(H1032)=0,\"00\",RIGHT(H1032,2)))","v":"03"}]
["00-02-07-02",4,null,11,0,2,7,2,"00","02","07","02"]
["00-02-08-01",4,null,11,0,2,8,1,"00","02","08","01"]
["00-02-09-00",4,null,11,0,2,9,0,"00","02","09","00"]
["00-03-00-08",5,null,11,0,3,0,8,"00","03","00","08"]
["00-03-01-07",5,null,11,0,3,1,7,"00","03","01","07"]
["00-03-02-06",5,null,11,0,3,2,6,"00","03","02","06"]
["00-03-03-05",5,null,11,0,3,3,5,"00","03","03","05"]
["00-03-04-04",5,null,11,0,3,4,4,"00","03","04","04"]
["00-03-05-03",5,null,11,0,3,5,3,"00","03","05","03"]
["00-03-06-02",4,null,11,0,3,6,2,"00","03","06","02"]
["00-03-07-01",4,null,11,0,3,7,1,"00","03","07","01"]
["00-03-08-00",4,null,11,0,3,8,0,"00","03","08","00"]
["00-04-00-07",5,null,11,0,4,0,7,"00","04","00","07"]
["00-04-01-06",5,null,11,0,4,1,6,"00","04","01","06"]
["00-04-02-05",5,null,11,0,4,2,5,"00","04","02","05"]
["00-04-03-04",5,null,11,0,4,3,4,"00","04","03","04"]
["00-04-04-03",4,null,11,0,4,4,3,"00","04","04","03"]
["00-04-05-02",4,null,11,0,4,5,2,"00","04","05","02"]
["00-04-06-01",4,null,11,0,4,6,1,"00","04","06","01"]
["00-04-07-00",4,null,11,0,4,7,0,"00","04","07","00"]
["00-05-00-06",5,null,11,0,5,0,6,"00","05","00","06"]
["00-05-01-05",4,null,11,0,5,1,5,"00","05","01","05"]
["00-05-02-04",4,null,11,0,5,2,4,"00","05","02","04"]
["00-05-03-03",4,null,11,0,5,3,3,"00","05","03","03"]
["00-05-04-02",4,null,11,0,5,4,2,"00","05","04","02"]
["00-05-05-01",4,null,11,0,5,5,1,"00","05","05","01"]
["00-05-06-00",4,null,11,0,5,6,0,"00","05","06","00"]
["00-06-00-05",3,null,11,0,6,0,5,"00","06","00","05"]
["00-06-01-04",3,null,11,0,6,1,4,"00","06","01","04"]
["00-06-02-03",3,null,11,0,6,2,3,"00","06","02","03"]
["00-06-03-02",3,null,11,0,6,3,2,"00","06","03","02"]
["00-06-04-01",3,null,11,0,6,4,1,"00","06","04","01"]
["00-06-05-00",3,null,11,0,6,5,0,"00","06","05","00"]
["00-07-00-04",3,null,11,0,7,0,4,"00","07","00","04"]
["00-07-01-03",3,null,11,0,7,1,3,"00","07","01","03"]
["00-07-02-02",3,null,11,0,7,2,2,"00","07","02","02"]
["00-07-03-01",3,null,11,0,7,3,1,"00","07","03","01"]
["00-07-04-00",3,null,11,0,7,4,0,"00","07","04","00"]
["00-08-00-03",3,null,11,0,8,0,3,"00","08","00","03"]
["00-08-01-02",3,null,11,0,8,1,2,"00","08","01","02"]
["00-08-02-01",3,null,11,0,8,2,1,"00","08","02","01"]
["00-08-03-00",3,null,11,0,8,3,0,"00","08","03","00"]
["00-09-00-02",3,null,11,0,9,0,2,"00","09","00","02"]
["00-09-01-01",3,null,11,0,9,1,1,"00","09","01","01"]
["00-09-02-00",2,null,11,0,9,2,0,"00","09","02","00"]
["00-10-00-01",2,null,11,0,10,0,1,"00","10","00","01"]
["00-10-01-00",2,null,11,0,10,1,0,"00","10","01","00"]
["00-11-00-00",2,null,11,0,11,0,0,"00","11","00","00"]
["01-00-00-10",5,null,11,1,0,0,10,"01","00","00","10"]
["01-00-01-09",5,null,11,1,0,1,9,"01","00","01","09"]
["01-00-02-08",5,null,11,1,0,2,8,"01","00","02","08"]
["01-00-03-07",5,null,11,1,0,3,7,"01","00","03","07"]
["01-00-04-06",5,null,11,1,0,4,6,"01","00","04","06"]
["01-00-05-05",5,null,11,1,0,5,5,"01","00","05","05"]
["01-00-06-04",5,null,11,1,0,6,4,"01","00","06","04"]
["01-00-07-03",5,null,11,1,0,7,3,"01","00","07","03"]
["01-00-08-02",4,null,11,1,0,8,2,"01","00","08","02"]
["01-00-09-01",4,null,11,1,0,9,1,"01","00","09","01"]
["01-00-10-00",4,null,11,1,0,10,0,"01","00","10","00"]
["01-01-00-09",5,null,11,1,1,0,9,"01","01","00","09"]
["01-01-01-08",5,null,11,1,1,1,8,"01","01","01","08"]
["01-01-02-07",5,null,11,1,1,2,7,"01","01","02","07"]
[{"$f":"I1095&\"-\"&J1095&\"-\"&K1095&\"-\"&L1095","v":"01-01-03-06"},5,null,11,1,1,3,6,"01","01","03","06"]
["01-01-04-05",5,null,11,1,1,4,5,{"$f":"IF(LEN(E1096)=1,0&E1096,IF(LEN(E1096)=0,\"00\",RIGHT(E1096,2)))","v":"01"},{"$f":"IF(LEN(F1096)=1,0&F1096,IF(LEN(F1096)=0,\"00\",RIGHT(F1096,2)))","v":"01"},{"$f":"IF(LEN(G1096)=1,0&G1096,IF(LEN(G1096)=0,\"00\",RIGHT(G1096,2)))","v":"04"},{"$f":"IF(LEN(H1096)=1,0&H1096,IF(LEN(H1096)=0,\"00\",RIGHT(H1096,2)))","v":"05"}]
["01-01-05-04",5,null,11,1,1,5,4,"01","01","05","04"]
["01-01-06-03",5,null,11,1,1,6,3,"01","01","06","03"]
["01-01-07-02",4,null,11,1,1,7,2,"01","01","07","02"]
["01-01-08-01",4,null,11,1,1,8,1,"01","01","08","01"]
["01-01-09-00",4,null,11,1,1,9,0,"01","01","09","00"]
["01-02-00-08",5,null,11,1,2,0,8,"01","02","00","08"]
["01-02-01-07",5,null,11,1,2,1,7,"01","02","01","07"]
["01-02-02-06",5,null,11,1,2,2,6,"01","02","02","06"]
["01-02-03-05",5,null,11,1,2,3,5,"01","02","03","05"]
["01-02-04-04",5,null,11,1,2,4,4,"01","02","04","04"]
["01-02-05-03",4,null,11,1,2,5,3,"01","02","05","03"]
["01-02-06-02",4,null,11,1,2,6,2,"01","02","06","02"]
["01-02-07-01",4,null,11,1,2,7,1,"01","02","07","01"]
["01-02-08-00",4,null,11,1,2,8,0,"01","02","08","00"]
["01-03-00-07",5,null,11,1,3,0,7,"01","03","00","07"]
["01-03-01-06",5,null,11,1,3,1,6,"01","03","01","06"]
["01-03-02-05",4,null,11,1,3,2,5,"01","03","02","05"]
["01-03-03-04",4,null,11,1,3,3,4,"01","03","03","04"]
["01-03-04-03",4,null,11,1,3,4,3,"01","03","04","03"]
["01-03-05-02",4,null,11,1,3,5,2,"01","03","05","02"]
["01-03-06-01",4,null,11,1,3,6,1,"01","03","06","01"]
["01-03-07-00",4,null,11,1,3,7,0,"01","03","07","00"]
["01-04-00-06",4,null,11,1,4,0,6,"01","04","00","06"]
["01-04-01-05",4,null,11,1,4,1,5,"01","04","01","05"]
["01-04-02-04",4,null,11,1,4,2,4,"01","04","02","04"]
["01-04-03-03",4,null,11,1,4,3,3,"01","04","03","03"]
["01-04-04-02",4,null,11,1,4,4,2,"01","04","04","02"]
["01-04-05-01",4,null,11,1,4,5,1,"01","04","05","01"]
["01-04-06-00",4,null,11,1,4,6,0,"01","04","06","00"]
["01-05-00-05",3,null,11,1,5,0,5,"01","05","00","05"]
["01-05-01-04",3,null,11,1,5,1,4,"01","05","01","04"]
["01-05-02-03",3,null,11,1,5,2,3,"01","05","02","03"]
["01-05-03-02",3,null,11,1,5,3,2,"01","05","03","02"]
["01-05-04-01",3,null,11,1,5,4,1,"01","05","04","01"]
["01-05-05-00",3,null,11,1,5,5,0,"01","05","05","00"]
["01-06-00-04",3,null,11,1,6,0,4,"01","06","00","04"]
["01-06-01-03",3,null,11,1,6,1,3,"01","06","01","03"]
["01-06-02-02",3,null,11,1,6,2,2,"01","06","02","02"]
["01-06-03-01",3,null,11,1,6,3,1,"01","06","03","01"]
["01-06-04-00",3,null,11,1,6,4,0,"01","06","04","00"]
["01-07-00-03",3,null,11,1,7,0,3,"01","07","00","03"]
["01-07-01-02",3,null,11,1,7,1,2,"01","07","01","02"]
["01-07-02-01",3,null,11,1,7,2,1,"01","07","02","01"]
["01-07-03-00",3,null,11,1,7,3,0,"01","07","03","00"]
["01-08-00-02",3,null,11,1,8,0,2,"01","08","00","02"]
["01-08-01-01",2,null,11,1,8,1,1,"01","08","01","01"]
["01-08-02-00",2,null,11,1,8,2,0,"01","08","02","00"]
["01-09-00-01",2,null,11,1,9,0,1,"01","09","00","01"]
["01-09-01-00",2,null,11,1,9,1,0,"01","09","01","00"]
["01-10-00-00",2,null,11,1,10,0,0,"01","10","00","00"]
["02-00-00-09",5,null,11,2,0,0,9,"02","00","00","09"]
["02-00-01-08",5,null,11,2,0,1,8,"02","00","01","08"]
["02-00-02-07",5,null,11,2,0,2,7,"02","00","02","07"]
["02-00-03-06",5,null,11,2,0,3,6,"02","00","03","06"]
["02-00-04-05",5,null,11,2,0,4,5,"02","00","04","05"]
["02-00-05-04",5,null,11,2,0,5,4,"02","00","05","04"]
["02-00-06-03",4,null,11,2,0,6,3,"02","00","06","03"]
["02-00-07-02",4,null,11,2,0,7,2,"02","00","07","02"]
["02-00-08-01",4,null,11,2,0,8,1,"02","00","08","01"]
["02-00-09-00",4,null,11,2,0,9,0,"02","00","09","00"]
["02-01-00-08",5,null,11,2,1,0,8,"02","01","00","08"]
["02-01-01-07",5,null,11,2,1,1,7,"02","01","01","07"]
[{"$f":"I1159&\"-\"&J1159&\"-\"&K1159&\"-\"&L1159","v":"02-01-02-06"},5,null,11,2,1,2,6,"02","01","02","06"]
["02-01-03-05",4,null,11,2,1,3,5,{"$f":"IF(LEN(E1160)=1,0&E1160,IF(LEN(E1160)=0,\"00\",RIGHT(E1160,2)))","v":"02"},{"$f":"IF(LEN(F1160)=1,0&F1160,IF(LEN(F1160)=0,\"00\",RIGHT(F1160,2)))","v":"01"},{"$f":"IF(LEN(G1160)=1,0&G1160,IF(LEN(G1160)=0,\"00\",RIGHT(G1160,2)))","v":"03"},{"$f":"IF(LEN(H1160)=1,0&H1160,IF(LEN(H1160)=0,\"00\",RIGHT(H1160,2)))","v":"05"}]
["02-01-04-04",4,null,11,2,1,4,4,"02","01","04","04"]
["02-01-05-03",4,null,11,2,1,5,3,"02","01","05","03"]
["02-01-06-02",4,null,11,2,1,6,2,"02","01","06","02"]
["02-01-07-01",4,null,11,2,1,7,1,"02","01","07","01"]
["02-01-08-00",4,null,11,2,1,8,0,"02","01","08","00"]
["02-02-00-07",5,null,11,2,2,0,7,"02","02","00","07"]
["02-02-01-06",4,null,11,2,2,1,6,"02","02","01","06"]
["02-02-02-05",4,null,11,2,2,2,5,"02","02","02","05"]
["02-02-03-04",4,null,11,2,2,3,4,"02","02","03","04"]
["02-02-04-03",4,null,11,2,2,4,3,"02","02","04","03"]
["02-02-05-02",4,null,11,2,2,5,2,"02","02","05","02"]
["02-02-06-01",4,null,11,2,2,6,1,"02","02","06","01"]
["02-02-07-00",4,null,11,2,2,7,0,"02","02","07","00"]
["02-03-00-06",4,null,11,2,3,0,6,"02","03","00","06"]
["02-03-01-05",4,null,11,2,3,1,5,"02","03","01","05"]
["02-03-02-04",4,null,11,2,3,2,4,"02","03","02","04"]
["02-03-03-03",4,null,11,2,3,3,3,"02","03","03","03"]
["02-03-04-02",4,null,11,2,3,4,2,"02","03","04","02"]
["02-03-05-01",4,null,11,2,3,5,1,"02","03","05","01"]
["02-03-06-00",4,null,11,2,3,6,0,"02","03","06","00"]
["02-04-00-05",3,null,11,2,4,0,5,"02","04","00","05"]
["02-04-01-04",3,null,11,2,4,1,4,"02","04","01","04"]
["02-04-02-03",3,null,11,2,4,2,3,"02","04","02","03"]
["02-04-03-02",3,null,11,2,4,3,2,"02","04","03","02"]
["02-04-04-01",3,null,11,2,4,4,1,"02","04","04","01"]
["02-04-05-00",3,null,11,2,4,5,0,"02","04","05","00"]
["02-05-00-04",3,null,11,2,5,0,4,"02","05","00","04"]
["02-05-01-03",3,null,11,2,5,1,3,"02","05","01","03"]
["02-05-02-02",3,null,11,2,5,2,2,"02","05","02","02"]
["02-05-03-01",3,null,11,2,5,3,1,"02","05","03","01"]
["02-05-04-00",3,null,11,2,5,4,0,"02","05","04","00"]
["02-06-00-03",3,null,11,2,6,0,3,"02","06","00","03"]
["02-06-01-02",3,null,11,2,6,1,2,"02","06","01","02"]
["02-06-02-01",3,null,11,2,6,2,1,"02","06","02","01"]
["02-06-03-00",3,null,11,2,6,3,0,"02","06","03","00"]
["02-07-00-02",2,null,11,2,7,0,2,"02","07","00","02"]
["02-07-01-01",2,null,11,2,7,1,1,"02","07","01","01"]
["02-07-02-00",2,null,11,2,7,2,0,"02","07","02","00"]
["02-08-00-01",2,null,11,2,8,0,1,"02","08","00","01"]
["02-08-01-00",2,null,11,2,8,1,0,"02","08","01","00"]
["02-09-00-00",2,null,11,2,9,0,0,"02","09","00","00"]
["03-00-00-08",5,null,11,3,0,0,8,"03","00","00","08"]
["03-00-01-07",5,null,11,3,0,1,7,"03","00","01","07"]
["03-00-02-06",4,null,11,3,0,2,6,"03","00","02","06"]
["03-00-03-05",4,null,11,3,0,3,5,"03","00","03","05"]
["03-00-04-04",4,null,11,3,0,4,4,"03","00","04","04"]
["03-00-05-03",4,null,11,3,0,5,3,"03","00","05","03"]
["03-00-06-02",4,null,11,3,0,6,2,"03","00","06","02"]
["03-00-07-01",4,null,11,3,0,7,1,"03","00","07","01"]
["03-00-08-00",4,null,11,3,0,8,0,"03","00","08","00"]
["03-01-00-07",4,null,11,3,1,0,7,"03","01","00","07"]
["03-01-01-06",4,null,11,3,1,1,6,"03","01","01","06"]
["03-01-02-05",4,null,11,3,1,2,5,"03","01","02","05"]
["03-01-03-04",4,null,11,3,1,3,4,"03","01","03","04"]
["03-01-04-03",4,null,11,3,1,4,3,"03","01","04","03"]
["03-01-05-02",4,null,11,3,1,5,2,"03","01","05","02"]
["03-01-06-01",4,null,11,3,1,6,1,"03","01","06","01"]
["03-01-07-00",4,null,11,3,1,7,0,"03","01","07","00"]
["03-02-00-06",4,null,11,3,2,0,6,"03","02","00","06"]
["03-02-01-05",4,null,11,3,2,1,5,"03","02","01","05"]
["03-02-02-04",4,null,11,3,2,2,4,"03","02","02","04"]
["03-02-03-03",4,null,11,3,2,3,3,"03","02","03","03"]
[{"$f":"I1223&\"-\"&J1223&\"-\"&K1223&\"-\"&L1223","v":"03-02-04-02"},4,null,11,3,2,4,2,"03","02","04","02"]
["03-02-05-01",4,null,11,3,2,5,1,{"$f":"IF(LEN(E1224)=1,0&E1224,IF(LEN(E1224)=0,\"00\",RIGHT(E1224,2)))","v":"03"},{"$f":"IF(LEN(F1224)=1,0&F1224,IF(LEN(F1224)=0,\"00\",RIGHT(F1224,2)))","v":"02"},{"$f":"IF(LEN(G1224)=1,0&G1224,IF(LEN(G1224)=0,\"00\",RIGHT(G1224,2)))","v":"05"},{"$f":"IF(LEN(H1224)=1,0&H1224,IF(LEN(H1224)=0,\"00\",RIGHT(H1224,2)))","v":"01"}]
["03-02-06-00",4,null,11,3,2,6,0,"03","02","06","00"]
["03-03-00-05",3,null,11,3,3,0,5,"03","03","00","05"]
["03-03-01-04",3,null,11,3,3,1,4,"03","03","01","04"]
["03-03-02-03",3,null,11,3,3,2,3,"03","03","02","03"]
["03-03-03-02",3,null,11,3,3,3,2,"03","03","03","02"]
["03-03-04-01",3,null,11,3,3,4,1,"03","03","04","01"]
["03-03-05-00",3,null,11,3,3,5,0,"03","03","05","00"]
["03-04-00-04",3,null,11,3,4,0,4,"03","04","00","04"]
["03-04-01-03",3,null,11,3,4,1,3,"03","04","01","03"]
["03-04-02-02",3,null,11,3,4,2,2,"03","04","02","02"]
["03-04-03-01",3,null,11,3,4,3,1,"03","04","03","01"]
["03-04-04-00",3,null,11,3,4,4,0,"03","04","04","00"]
["03-05-00-03",3,null,11,3,5,0,3,"03","05","00","03"]
["03-05-01-02",3,null,11,3,5,1,2,"03","05","01","02"]
["03-05-02-01",3,null,11,3,5,2,1,"03","05","02","01"]
["03-05-03-00",3,null,11,3,5,3,0,"03","05","03","00"]
["03-06-00-02",2,null,11,3,6,0,2,"03","06","00","02"]
["03-06-01-01",2,null,11,3,6,1,1,"03","06","01","01"]
["03-06-02-00",2,null,11,3,6,2,0,"03","06","02","00"]
["03-07-00-01",2,null,11,3,7,0,1,"03","07","00","01"]
["03-07-01-00",2,null,11,3,7,1,0,"03","07","01","00"]
["03-08-00-00",2,null,11,3,8,0,0,"03","08","00","00"]
["04-00-00-07",4,null,11,4,0,0,7,"04","00","00","07"]
["04-00-01-06",4,null,11,4,0,1,6,"04","00","01","06"]
["04-00-02-05",4,null,11,4,0,2,5,"04","00","02","05"]
["04-00-03-04",4,null,11,4,0,3,4,"04","00","03","04"]
["04-00-04-03",4,null,11,4,0,4,3,"04","00","04","03"]
["04-00-05-02",4,null,11,4,0,5,2,"04","00","05","02"]
["04-00-06-01",4,null,11,4,0,6,1,"04","00","06","01"]
["04-00-07-00",4,null,11,4,0,7,0,"04","00","07","00"]
["04-01-00-06",4,null,11,4,1,0,6,"04","01","00","06"]
["04-01-01-05",4,null,11,4,1,1,5,"04","01","01","05"]
["04-01-02-04",4,null,11,4,1,2,4,"04","01","02","04"]
["04-01-03-03",4,null,11,4,1,3,3,"04","01","03","03"]
["04-01-04-02",4,null,11,4,1,4,2,"04","01","04","02"]
["04-01-05-01",4,null,11,4,1,5,1,"04","01","05","01"]
["04-01-06-00",3,null,11,4,1,6,0,"04","01","06","00"]
["04-02-00-05",3,null,11,4,2,0,5,"04","02","00","05"]
["04-02-01-04",3,null,11,4,2,1,4,"04","02","01","04"]
["04-02-02-03",3,null,11,4,2,2,3,"04","02","02","03"]
["04-02-03-02",3,null,11,4,2,3,2,"04","02","03","02"]
["04-02-04-01",3,null,11,4,2,4,1,"04","02","04","01"]
["04-02-05-00",3,null,11,4,2,5,0,"04","02","05","00"]
["04-03-00-04",3,null,11,4,3,0,4,"04","03","00","04"]
["04-03-01-03",3,null,11,4,3,1,3,"04","03","01","03"]
["04-03-02-02",3,null,11,4,3,2,2,"04","03","02","02"]
["04-03-03-01",3,null,11,4,3,3,1,"04","03","03","01"]
["04-03-04-00",3,null,11,4,3,4,0,"04","03","04","00"]
["04-04-00-03",3,null,11,4,4,0,3,"04","04","00","03"]
["04-04-01-02",3,null,11,4,4,1,2,"04","04","01","02"]
["04-04-02-01",3,null,11,4,4,2,1,"04","04","02","01"]
["04-04-03-00",3,null,11,4,4,3,0,"04","04","03","00"]
["04-05-00-02",2,null,11,4,5,0,2,"04","05","00","02"]
["04-05-01-01",2,null,11,4,5,1,1,"04","05","01","01"]
["04-05-02-00",2,null,11,4,5,2,0,"04","05","02","00"]
["04-06-00-01",2,null,11,4,6,0,1,"04","06","00","01"]
["04-06-01-00",2,null,11,4,6,1,0,"04","06","01","00"]
["04-07-00-00",2,null,11,4,7,0,0,"04","07","00","00"]
["05-00-00-06",4,null,11,5,0,0,6,"05","00","00","06"]
["05-00-01-05",4,null,11,5,0,1,5,"05","00","01","05"]
["05-00-02-04",4,null,11,5,0,2,4,"05","00","02","04"]
["05-00-03-03",4,null,11,5,0,3,3,"05","00","03","03"]
[{"$f":"I1287&\"-\"&J1287&\"-\"&K1287&\"-\"&L1287","v":"05-00-04-02"},4,null,11,5,0,4,2,"05","00","04","02"]
["05-00-05-01",3,null,11,5,0,5,1,{"$f":"IF(LEN(E1288)=1,0&E1288,IF(LEN(E1288)=0,\"00\",RIGHT(E1288,2)))","v":"05"},{"$f":"IF(LEN(F1288)=1,0&F1288,IF(LEN(F1288)=0,\"00\",RIGHT(F1288,2)))","v":"00"},{"$f":"IF(LEN(G1288)=1,0&G1288,IF(LEN(G1288)=0,\"00\",RIGHT(G1288,2)))","v":"05"},{"$f":"IF(LEN(H1288)=1,0&H1288,IF(LEN(H1288)=0,\"00\",RIGHT(H1288,2)))","v":"01"}]
["05-00-06-00",3,null,11,5,0,6,0,"05","00","06","00"]
["05-01-00-05",3,null,11,5,1,0,5,"05","01","00","05"]
["05-01-01-04",3,null,11,5,1,1,4,"05","01","01","04"]
["05-01-02-03",3,null,11,5,1,2,3,"05","01","02","03"]
["05-01-03-02",3,null,11,5,1,3,2,"05","01","03","02"]
["05-01-04-01",3,null,11,5,1,4,1,"05","01","04","01"]
["05-01-05-00",3,null,11,5,1,5,0,"05","01","05","00"]
["05-02-00-04",3,null,11,5,2,0,4,"05","02","00","04"]
["05-02-01-03",3,null,11,5,2,1,3,"05","02","01","03"]
["05-02-02-02",3,null,11,5,2,2,2,"05","02","02","02"]
["05-02-03-01",3,null,11,5,2,3,1,"05","02","03","01"]
["05-02-04-00",3,null,11,5,2,4,0,"05","02","04","00"]
["05-03-00-03",3,null,11,5,3,0,3,"05","03","00","03"]
["05-03-01-02",3,null,11,5,3,1,2,"05","03","01","02"]
["05-03-02-01",3,null,11,5,3,2,1,"05","03","02","01"]
["05-03-03-00",3,null,11,5,3,3,0,"05","03","03","00"]
["05-04-00-02",2,null,11,5,4,0,2,"05","04","00","02"]
["05-04-01-01",2,null,11,5,4,1,1,"05","04","01","01"]
["05-04-02-00",2,null,11,5,4,2,0,"05","04","02","00"]
["05-05-00-01",2,null,11,5,5,0,1,"05","05","00","01"]
["05-05-01-00",2,null,11,5,5,1,0,"05","05","01","00"]
["05-06-00-00",2,null,11,5,6,0,0,"05","06","00","00"]
["06-00-00-05",3,null,11,6,0,0,5,"06","00","00","05"]
["06-00-01-04",3,null,11,6,0,1,4,"06","00","01","04"]
["06-00-02-03",3,null,11,6,0,2,3,"06","00","02","03"]
["06-00-03-02",3,null,11,6,0,3,2,"06","00","03","02"]
["06-00-04-01",3,null,11,6,0,4,1,"06","00","04","01"]
["06-00-05-00",3,null,11,6,0,5,0,"06","00","05","00"]
["06-01-00-04",3,null,11,6,1,0,4,"06","01","00","04"]
["06-01-01-03",3,null,11,6,1,1,3,"06","01","01","03"]
["06-01-02-02",3,null,11,6,1,2,2,"06","01","02","02"]
["06-01-03-01",3,null,11,6,1,3,1,"06","01","03","01"]
["06-01-04-00",3,null,11,6,1,4,0,"06","01","04","00"]
["06-02-00-03",3,null,11,6,2,0,3,"06","02","00","03"]
["06-02-01-02",3,null,11,6,2,1,2,"06","02","01","02"]
["06-02-02-01",3,null,11,6,2,2,1,"06","02","02","01"]
["06-02-03-00",3,null,11,6,2,3,0,"06","02","03","00"]
["06-03-00-02",2,null,11,6,3,0,2,"06","03","00","02"]
["06-03-01-01",2,null,11,6,3,1,1,"06","03","01","01"]
["06-03-02-00",2,null,11,6,3,2,0,"06","03","02","00"]
["06-04-00-01",2,null,11,6,4,0,1,"06","04","00","01"]
["06-04-01-00",2,null,11,6,4,1,0,"06","04","01","00"]
["06-05-00-00",2,null,11,6,5,0,0,"06","05","00","00"]
["07-00-00-04",3,null,11,7,0,0,4,"07","00","00","04"]
["07-00-01-03",3,null,11,7,0,1,3,"07","00","01","03"]
["07-00-02-02",3,null,11,7,0,2,2,"07","00","02","02"]
["07-00-03-01",3,null,11,7,0,3,1,"07","00","03","01"]
["07-00-04-00",3,null,11,7,0,4,0,"07","00","04","00"]
["07-01-00-03",3,null,11,7,1,0,3,"07","01","00","03"]
["07-01-01-02",3,null,11,7,1,1,2,"07","01","01","02"]
["07-01-02-01",3,null,11,7,1,2,1,"07","01","02","01"]
["07-01-03-00",3,null,11,7,1,3,0,"07","01","03","00"]
["07-02-00-02",2,null,11,7,2,0,2,"07","02","00","02"]
["07-02-01-01",2,null,11,7,2,1,1,"07","02","01","01"]
["07-02-02-00",2,null,11,7,2,2,0,"07","02","02","00"]
["07-03-00-01",2,null,11,7,3,0,1,"07","03","00","01"]
["07-03-01-00",2,null,11,7,3,1,0,"07","03","01","00"]
["07-04-00-00",2,null,11,7,4,0,0,"07","04","00","00"]
["08-00-00-03",3,null,11,8,0,0,3,"08","00","00","03"]
["08-00-01-02",3,null,11,8,0,1,2,"08","00","01","02"]
["08-00-02-01",3,null,11,8,0,2,1,"08","00","02","01"]
["08-00-03-00",3,null,11,8,0,3,0,"08","00","03","00"]
[{"$f":"I1351&\"-\"&J1351&\"-\"&K1351&\"-\"&L1351","v":"08-01-00-02"},2,null,11,8,1,0,2,"08","01","00","02"]
["08-01-01-01",2,null,11,8,1,1,1,{"$f":"IF(LEN(E1352)=1,0&E1352,IF(LEN(E1352)=0,\"00\",RIGHT(E1352,2)))","v":"08"},{"$f":"IF(LEN(F1352)=1,0&F1352,IF(LEN(F1352)=0,\"00\",RIGHT(F1352,2)))","v":"01"},{"$f":"IF(LEN(G1352)=1,0&G1352,IF(LEN(G1352)=0,\"00\",RIGHT(G1352,2)))","v":"01"},{"$f":"IF(LEN(H1352)=1,0&H1352,IF(LEN(H1352)=0,\"00\",RIGHT(H1352,2)))","v":"01"}]
["08-01-02-00",2,null,11,8,1,2,0,"08","01","02","00"]
["08-02-00-01",2,null,11,8,2,0,1,"08","02","00","01"]
["08-02-01-00",2,null,11,8,2,1,0,"08","02","01","00"]
["08-03-00-00",2,null,11,8,3,0,0,"08","03","00","00"]
["09-00-00-02",2,null,11,9,0,0,2,"09","00","00","02"]
["09-00-01-01",2,null,11,9,0,1,1,"09","00","01","01"]
["09-00-02-00",2,null,11,9,0,2,0,"09","00","02","00"]
["09-01-00-01",2,null,11,9,1,0,1,"09","01","00","01"]
["09-01-01-00",2,null,11,9,1,1,0,"09","01","01","00"]
["09-02-00-00",2,null,11,9,2,0,0,"09","02","00","00"]
["10-00-00-01",2,null,11,10,0,0,1,"10","00","00","01"]
["10-00-01-00",2,null,11,10,0,1,0,"10","00","01","00"]
["10-01-00-00",2,null,11,10,1,0,0,"10","01","00","00"]
["11-00-00-00",1,null,11,11,0,0,0,"11","00","00","00"]
["00-00-00-12",7,null,12,0,0,0,12,"00","00","00","12"]
["00-00-01-11",6,null,12,0,0,1,11,"00","00","01","11"]
["00-00-02-10",6,null,12,0,0,2,10,"00","00","02","10"]
["00-00-03-09",6,null,12,0,0,3,9,"00","00","03","09"]
["00-00-04-08",6,null,12,0,0,4,8,"00","00","04","08"]
["00-00-05-07",6,null,12,0,0,5,7,"00","00","05","07"]
["00-00-06-06",6,null,12,0,0,6,6,"00","00","06","06"]
["00-00-07-05",5,null,12,0,0,7,5,"00","00","07","05"]
["00-00-08-04",5,null,12,0,0,8,4,"00","00","08","04"]
["00-00-09-03",5,null,12,0,0,9,3,"00","00","09","03"]
["00-00-10-02",4,null,12,0,0,10,2,"00","00","10","02"]
["00-00-11-01",4,null,12,0,0,11,1,"00","00","11","01"]
["00-00-12-00",4,null,12,0,0,12,0,"00","00","12","00"]
["00-01-00-11",5,null,12,0,1,0,11,"00","01","00","11"]
["00-01-01-10",5,null,12,0,1,1,10,"00","01","01","10"]
["00-01-02-09",5,null,12,0,1,2,9,"00","01","02","09"]
["00-01-03-08",5,null,12,0,1,3,8,"00","01","03","08"]
["00-01-04-07",5,null,12,0,1,4,7,"00","01","04","07"]
["00-01-05-06",5,null,12,0,1,5,6,"00","01","05","06"]
["00-01-06-05",5,null,12,0,1,6,5,"00","01","06","05"]
["00-01-07-04",5,null,12,0,1,7,4,"00","01","07","04"]
["00-01-08-03",5,null,12,0,1,8,3,"00","01","08","03"]
["00-01-09-02",4,null,12,0,1,9,2,"00","01","09","02"]
["00-01-10-01",4,null,12,0,1,10,1,"00","01","10","01"]
["00-01-11-00",4,null,12,0,1,11,0,"00","01","11","00"]
["00-02-00-10",5,null,12,0,2,0,10,"00","02","00","10"]
["00-02-01-09",5,null,12,0,2,1,9,"00","02","01","09"]
["00-02-02-08",5,null,12,0,2,2,8,"00","02","02","08"]
["00-02-03-07",5,null,12,0,2,3,7,"00","02","03","07"]
["00-02-04-06",5,null,12,0,2,4,6,"00","02","04","06"]
["00-02-05-05",5,null,12,0,2,5,5,"00","02","05","05"]
["00-02-06-04",5,null,12,0,2,6,4,"00","02","06","04"]
["00-02-07-03",5,null,12,0,2,7,3,"00","02","07","03"]
["00-02-08-02",4,null,12,0,2,8,2,"00","02","08","02"]
["00-02-09-01",4,null,12,0,2,9,1,"00","02","09","01"]
["00-02-10-00",4,null,12,0,2,10,0,"00","02","10","00"]
["00-03-00-09",5,null,12,0,3,0,9,"00","03","00","09"]
["00-03-01-08",5,null,12,0,3,1,8,"00","03","01","08"]
["00-03-02-07",5,null,12,0,3,2,7,"00","03","02","07"]
["00-03-03-06",5,null,12,0,3,3,6,"00","03","03","06"]
["00-03-04-05",5,null,12,0,3,4,5,"00","03","04","05"]
["00-03-05-04",5,null,12,0,3,5,4,"00","03","05","04"]
["00-03-06-03",5,null,12,0,3,6,3,"00","03","06","03"]
["00-03-07-02",4,null,12,0,3,7,2,"00","03","07","02"]
["00-03-08-01",4,null,12,0,3,8,1,"00","03","08","01"]
["00-03-09-00",4,null,12,0,3,9,0,"00","03","09","00"]
["00-04-00-08",5,null,12,0,4,0,8,"00","04","00","08"]
["00-04-01-07",5,null,12,0,4,1,7,"00","04","01","07"]
[{"$f":"I1415&\"-\"&J1415&\"-\"&K1415&\"-\"&L1415","v":"00-04-02-06"},5,null,12,0,4,2,6,"00","04","02","06"]
["00-04-03-05",5,null,12,0,4,3,5,{"$f":"IF(LEN(E1416)=1,0&E1416,IF(LEN(E1416)=0,\"00\",RIGHT(E1416,2)))","v":"00"},{"$f":"IF(LEN(F1416)=1,0&F1416,IF(LEN(F1416)=0,\"00\",RIGHT(F1416,2)))","v":"04"},{"$f":"IF(LEN(G1416)=1,0&G1416,IF(LEN(G1416)=0,\"00\",RIGHT(G1416,2)))","v":"03"},{"$f":"IF(LEN(H1416)=1,0&H1416,IF(LEN(H1416)=0,\"00\",RIGHT(H1416,2)))","v":"05"}]
["00-04-04-04",5,null,12,0,4,4,4,"00","04","04","04"]
["00-04-05-03",4,null,12,0,4,5,3,"00","04","05","03"]
["00-04-06-02",4,null,12,0,4,6,2,"00","04","06","02"]
["00-04-07-01",4,null,12,0,4,7,1,"00","04","07","01"]
["00-04-08-00",4,null,12,0,4,8,0,"00","04","08","00"]
["00-05-00-07",5,null,12,0,5,0,7,"00","05","00","07"]
["00-05-01-06",5,null,12,0,5,1,6,"00","05","01","06"]
["00-05-02-05",5,null,12,0,5,2,5,"00","05","02","05"]
["00-05-03-04",4,null,12,0,5,3,4,"00","05","03","04"]
["00-05-04-03",4,null,12,0,5,4,3,"00","05","04","03"]
["00-05-05-02",4,null,12,0,5,5,2,"00","05","05","02"]
["00-05-06-01",4,null,12,0,5,6,1,"00","05","06","01"]
["00-05-07-00",4,null,12,0,5,7,0,"00","05","07","00"]
["00-06-00-06",4,null,12,0,6,0,6,"00","06","00","06"]
["00-06-01-05",4,null,12,0,6,1,5,"00","06","01","05"]
["00-06-02-04",4,null,12,0,6,2,4,"00","06","02","04"]
["00-06-03-03",4,null,12,0,6,3,3,"00","06","03","03"]
["00-06-04-02",4,null,12,0,6,4,2,"00","06","04","02"]
["00-06-05-01",4,null,12,0,6,5,1,"00","06","05","01"]
["00-06-06-00",4,null,12,0,6,6,0,"00","06","06","00"]
["00-07-00-05",3,null,12,0,7,0,5,"00","07","00","05"]
["00-07-01-04",3,null,12,0,7,1,4,"00","07","01","04"]
["00-07-02-03",3,null,12,0,7,2,3,"00","07","02","03"]
["00-07-03-02",3,null,12,0,7,3,2,"00","07","03","02"]
["00-07-04-01",3,null,12,0,7,4,1,"00","07","04","01"]
["00-07-05-00",3,null,12,0,7,5,0,"00","07","05","00"]
["00-08-00-04",3,null,12,0,8,0,4,"00","08","00","04"]
["00-08-01-03",3,null,12,0,8,1,3,"00","08","01","03"]
["00-08-02-02",3,null,12,0,8,2,2,"00","08","02","02"]
["00-08-03-01",3,null,12,0,8,3,1,"00","08","03","01"]
["00-08-04-00",3,null,12,0,8,4,0,"00","08","04","00"]
["00-09-00-03",3,null,12,0,9,0,3,"00","09","00","03"]
["00-09-01-02",3,null,12,0,9,1,2,"00","09","01","02"]
["00-09-02-01",3,null,12,0,9,2,1,"00","09","02","01"]
["00-09-03-00",3,null,12,0,9,3,0,"00","09","03","00"]
["00-10-00-02",3,null,12,0,10,0,2,"00","10","00","02"]
["00-10-01-01",3,null,12,0,10,1,1,"00","10","01","01"]
["00-10-02-00",2,null,12,0,10,2,0,"00","10","02","00"]
["00-11-00-01",2,null,12,0,11,0,1,"00","11","00","01"]
["00-11-01-00",2,null,12,0,11,1,0,"00","11","01","00"]
["00-12-00-00",2,null,12,0,12,0,0,"00","12","00","00"]
["01-00-00-11",5,null,12,1,0,0,11,"01","00","00","11"]
["01-00-01-10",5,null,12,1,0,1,10,"01","00","01","10"]
["01-00-02-09",5,null,12,1,0,2,9,"01","00","02","09"]
["01-00-03-08",5,null,12,1,0,3,8,"01","00","03","08"]
["01-00-04-07",5,null,12,1,0,4,7,"01","00","04","07"]
["01-00-05-06",5,null,12,1,0,5,6,"01","00","05","06"]
["01-00-06-05",5,null,12,1,0,6,5,"01","00","06","05"]
["01-00-07-04",5,null,12,1,0,7,4,"01","00","07","04"]
["01-00-08-03",5,null,12,1,0,8,3,"01","00","08","03"]
["01-00-09-02",4,null,12,1,0,9,2,"01","00","09","02"]
["01-00-10-01",4,null,12,1,0,10,1,"01","00","10","01"]
["01-00-11-00",4,null,12,1,0,11,0,"01","00","11","00"]
["01-01-00-10",5,null,12,1,1,0,10,"01","01","00","10"]
["01-01-01-09",5,null,12,1,1,1,9,"01","01","01","09"]
["01-01-02-08",5,null,12,1,1,2,8,"01","01","02","08"]
["01-01-03-07",5,null,12,1,1,3,7,"01","01","03","07"]
["01-01-04-06",5,null,12,1,1,4,6,"01","01","04","06"]
["01-01-05-05",5,null,12,1,1,5,5,"01","01","05","05"]
["01-01-06-04",5,null,12,1,1,6,4,"01","01","06","04"]
["01-01-07-03",5,null,12,1,1,7,3,"01","01","07","03"]
["01-01-08-02",4,null,12,1,1,8,2,"01","01","08","02"]
[{"$f":"I1479&\"-\"&J1479&\"-\"&K1479&\"-\"&L1479","v":"01-01-09-01"},4,null,12,1,1,9,1,"01","01","09","01"]
["01-01-10-00",4,null,12,1,1,10,0,{"$f":"IF(LEN(E1480)=1,0&E1480,IF(LEN(E1480)=0,\"00\",RIGHT(E1480,2)))","v":"01"},{"$f":"IF(LEN(F1480)=1,0&F1480,IF(LEN(F1480)=0,\"00\",RIGHT(F1480,2)))","v":"01"},{"$f":"IF(LEN(G1480)=1,0&G1480,IF(LEN(G1480)=0,\"00\",RIGHT(G1480,2)))","v":"10"},{"$f":"IF(LEN(H1480)=1,0&H1480,IF(LEN(H1480)=0,\"00\",RIGHT(H1480,2)))","v":"00"}]
["01-02-00-09",5,null,12,1,2,0,9,"01","02","00","09"]
["01-02-01-08",5,null,12,1,2,1,8,"01","02","01","08"]
["01-02-02-07",5,null,12,1,2,2,7,"01","02","02","07"]
["01-02-03-06",5,null,12,1,2,3,6,"01","02","03","06"]
["01-02-04-05",5,null,12,1,2,4,5,"01","02","04","05"]
["01-02-05-04",5,null,12,1,2,5,4,"01","02","05","04"]
["01-02-06-03",4,null,12,1,2,6,3,"01","02","06","03"]
["01-02-07-02",4,null,12,1,2,7,2,"01","02","07","02"]
["01-02-08-01",4,null,12,1,2,8,1,"01","02","08","01"]
["01-02-09-00",4,null,12,1,2,9,0,"01","02","09","00"]
["01-03-00-08",5,null,12,1,3,0,8,"01","03","00","08"]
["01-03-01-07",5,null,12,1,3,1,7,"01","03","01","07"]
["01-03-02-06",5,null,12,1,3,2,6,"01","03","02","06"]
["01-03-03-05",5,null,12,1,3,3,5,"01","03","03","05"]
["01-03-04-04",4,null,12,1,3,4,4,"01","03","04","04"]
["01-03-05-03",4,null,12,1,3,5,3,"01","03","05","03"]
["01-03-06-02",4,null,12,1,3,6,2,"01","03","06","02"]
["01-03-07-01",4,null,12,1,3,7,1,"01","03","07","01"]
["01-03-08-00",4,null,12,1,3,8,0,"01","03","08","00"]
["01-04-00-07",5,null,12,1,4,0,7,"01","04","00","07"]
["01-04-01-06",4,null,12,1,4,1,6,"01","04","01","06"]
["01-04-02-05",4,null,12,1,4,2,5,"01","04","02","05"]
["01-04-03-04",4,null,12,1,4,3,4,"01","04","03","04"]
["01-04-04-03",4,null,12,1,4,4,3,"01","04","04","03"]
["01-04-05-02",4,null,12,1,4,5,2,"01","04","05","02"]
["01-04-06-01",4,null,12,1,4,6,1,"01","04","06","01"]
["01-04-07-00",4,null,12,1,4,7,0,"01","04","07","00"]
["01-05-00-06",4,null,12,1,5,0,6,"01","05","00","06"]
["01-05-01-05",4,null,12,1,5,1,5,"01","05","01","05"]
["01-05-02-04",4,null,12,1,5,2,4,"01","05","02","04"]
["01-05-03-03",4,null,12,1,5,3,3,"01","05","03","03"]
["01-05-04-02",4,null,12,1,5,4,2,"01","05","04","02"]
["01-05-05-01",4,null,12,1,5,5,1,"01","05","05","01"]
["01-05-06-00",4,null,12,1,5,6,0,"01","05","06","00"]
["01-06-00-05",3,null,12,1,6,0,5,"01","06","00","05"]
["01-06-01-04",3,null,12,1,6,1,4,"01","06","01","04"]
["01-06-02-03",3,null,12,1,6,2,3,"01","06","02","03"]
["01-06-03-02",3,null,12,1,6,3,2,"01","06","03","02"]
["01-06-04-01",3,null,12,1,6,4,1,"01","06","04","01"]
["01-06-05-00",3,null,12,1,6,5,0,"01","06","05","00"]
["01-07-00-04",3,null,12,1,7,0,4,"01","07","00","04"]
["01-07-01-03",3,null,12,1,7,1,3,"01","07","01","03"]
["01-07-02-02",3,null,12,1,7,2,2,"01","07","02","02"]
["01-07-03-01",3,null,12,1,7,3,1,"01","07","03","01"]
["01-07-04-00",3,null,12,1,7,4,0,"01","07","04","00"]
["01-08-00-03",3,null,12,1,8,0,3,"01","08","00","03"]
["01-08-01-02",3,null,12,1,8,1,2,"01","08","01","02"]
["01-08-02-01",3,null,12,1,8,2,1,"01","08","02","01"]
["01-08-03-00",3,null,12,1,8,3,0,"01","08","03","00"]
["01-09-00-02",3,null,12,1,9,0,2,"01","09","00","02"]
["01-09-01-01",2,null,12,1,9,1,1,"01","09","01","01"]
["01-09-02-00",2,null,12,1,9,2,0,"01","09","02","00"]
["01-10-00-01",2,null,12,1,10,0,1,"01","10","00","01"]
["01-10-01-00",2,null,12,1,10,1,0,"01","10","01","00"]
["01-11-00-00",2,null,12,1,11,0,0,"01","11","00","00"]
["02-00-00-10",5,null,12,2,0,0,10,"02","00","00","10"]
["02-00-01-09",5,null,12,2,0,1,9,"02","00","01","09"]
["02-00-02-08",5,null,12,2,0,2,8,"02","00","02","08"]
["02-00-03-07",5,null,12,2,0,3,7,"02","00","03","07"]
["02-00-04-06",5,null,12,2,0,4,6,"02","00","04","06"]
["02-00-05-05",5,null,12,2,0,5,5,"02","00","05","05"]
["02-00-06-04",5,null,12,2,0,6,4,"02","00","06","04"]
[{"$f":"I1543&\"-\"&J1543&\"-\"&K1543&\"-\"&L1543","v":"02-00-07-03"},4,null,12,2,0,7,3,"02","00","07","03"]
["02-00-08-02",4,null,12,2,0,8,2,{"$f":"IF(LEN(E1544)=1,0&E1544,IF(LEN(E1544)=0,\"00\",RIGHT(E1544,2)))","v":"02"},{"$f":"IF(LEN(F1544)=1,0&F1544,IF(LEN(F1544)=0,\"00\",RIGHT(F1544,2)))","v":"00"},{"$f":"IF(LEN(G1544)=1,0&G1544,IF(LEN(G1544)=0,\"00\",RIGHT(G1544,2)))","v":"08"},{"$f":"IF(LEN(H1544)=1,0&H1544,IF(LEN(H1544)=0,\"00\",RIGHT(H1544,2)))","v":"02"}]
["02-00-09-01",4,null,12,2,0,9,1,"02","00","09","01"]
["02-00-10-00",4,null,12,2,0,10,0,"02","00","10","00"]
["02-01-00-09",5,null,12,2,1,0,9,"02","01","00","09"]
["02-01-01-08",5,null,12,2,1,1,8,"02","01","01","08"]
["02-01-02-07",5,null,12,2,1,2,7,"02","01","02","07"]
["02-01-03-06",5,null,12,2,1,3,6,"02","01","03","06"]
["02-01-04-05",5,null,12,2,1,4,5,"02","01","04","05"]
["02-01-05-04",4,null,12,2,1,5,4,"02","01","05","04"]
["02-01-06-03",4,null,12,2,1,6,3,"02","01","06","03"]
["02-01-07-02",4,null,12,2,1,7,2,"02","01","07","02"]
["02-01-08-01",4,null,12,2,1,8,1,"02","01","08","01"]
["02-01-09-00",4,null,12,2,1,9,0,"02","01","09","00"]
["02-02-00-08",5,null,12,2,2,0,8,"02","02","00","08"]
["02-02-01-07",5,null,12,2,2,1,7,"02","02","01","07"]
["02-02-02-06",4,null,12,2,2,2,6,"02","02","02","06"]
["02-02-03-05",4,null,12,2,2,3,5,"02","02","03","05"]
["02-02-04-04",4,null,12,2,2,4,4,"02","02","04","04"]
["02-02-05-03",4,null,12,2,2,5,3,"02","02","05","03"]
["02-02-06-02",4,null,12,2,2,6,2,"02","02","06","02"]
["02-02-07-01",4,null,12,2,2,7,1,"02","02","07","01"]
["02-02-08-00",4,null,12,2,2,8,0,"02","02","08","00"]
["02-03-00-07",4,null,12,2,3,0,7,"02","03","00","07"]
["02-03-01-06",4,null,12,2,3,1,6,"02","03","01","06"]
["02-03-02-05",4,null,12,2,3,2,5,"02","03","02","05"]
["02-03-03-04",4,null,12,2,3,3,4,"02","03","03","04"]
["02-03-04-03",4,null,12,2,3,4,3,"02","03","04","03"]
["02-03-05-02",4,null,12,2,3,5,2,"02","03","05","02"]
["02-03-06-01",4,null,12,2,3,6,1,"02","03","06","01"]
["02-03-07-00",4,null,12,2,3,7,0,"02","03","07","00"]
["02-04-00-06",4,null,12,2,4,0,6,"02","04","00","06"]
["02-04-01-05",4,null,12,2,4,1,5,"02","04","01","05"]
["02-04-02-04",4,null,12,2,4,2,4,"02","04","02","04"]
["02-04-03-03",4,null,12,2,4,3,3,"02","04","03","03"]
["02-04-04-02",4,null,12,2,4,4,2,"02","04","04","02"]
["02-04-05-01",4,null,12,2,4,5,1,"02","04","05","01"]
["02-04-06-00",4,null,12,2,4,6,0,"02","04","06","00"]
["02-05-00-05",3,null,12,2,5,0,5,"02","05","00","05"]
["02-05-01-04",3,null,12,2,5,1,4,"02","05","01","04"]
["02-05-02-03",3,null,12,2,5,2,3,"02","05","02","03"]
["02-05-03-02",3,null,12,2,5,3,2,"02","05","03","02"]
["02-05-04-01",3,null,12,2,5,4,1,"02","05","04","01"]
["02-05-05-00",3,null,12,2,5,5,0,"02","05","05","00"]
["02-06-00-04",3,null,12,2,6,0,4,"02","06","00","04"]
["02-06-01-03",3,null,12,2,6,1,3,"02","06","01","03"]
["02-06-02-02",3,null,12,2,6,2,2,"02","06","02","02"]
["02-06-03-01",3,null,12,2,6,3,1,"02","06","03","01"]
["02-06-04-00",3,null,12,2,6,4,0,"02","06","04","00"]
["02-07-00-03",3,null,12,2,7,0,3,"02","07","00","03"]
["02-07-01-02",3,null,12,2,7,1,2,"02","07","01","02"]
["02-07-02-01",2,null,12,2,7,2,1,"02","07","02","01"]
["02-07-03-00",2,null,12,2,7,3,0,"02","07","03","00"]
["02-08-00-02",2,null,12,2,8,0,2,"02","08","00","02"]
["02-08-01-01",2,null,12,2,8,1,1,"02","08","01","01"]
["02-08-02-00",2,null,12,2,8,2,0,"02","08","02","00"]
["02-09-00-01",2,null,12,2,9,0,1,"02","09","00","01"]
["02-09-01-00",2,null,12,2,9,1,0,"02","09","01","00"]
["02-10-00-00",2,null,12,2,10,0,0,"02","10","00","00"]
["03-00-00-09",5,null,12,3,0,0,9,"03","00","00","09"]
["03-00-01-08",5,null,12,3,0,1,8,"03","00","01","08"]
["03-00-02-07",5,null,12,3,0,2,7,"03","00","02","07"]
["03-00-03-06",4,null,12,3,0,3,6,"03","00","03","06"]
["03-00-04-05",4,null,12,3,0,4,5,"03","00","04","05"]
[{"$f":"I1607&\"-\"&J1607&\"-\"&K1607&\"-\"&L1607","v":"03-00-05-04"},4,null,12,3,0,5,4,"03","00","05","04"]
["03-00-06-03",4,null,12,3,0,6,3,{"$f":"IF(LEN(E1608)=1,0&E1608,IF(LEN(E1608)=0,\"00\",RIGHT(E1608,2)))","v":"03"},{"$f":"IF(LEN(F1608)=1,0&F1608,IF(LEN(F1608)=0,\"00\",RIGHT(F1608,2)))","v":"00"},{"$f":"IF(LEN(G1608)=1,0&G1608,IF(LEN(G1608)=0,\"00\",RIGHT(G1608,2)))","v":"06"},{"$f":"IF(LEN(H1608)=1,0&H1608,IF(LEN(H1608)=0,\"00\",RIGHT(H1608,2)))","v":"03"}]
["03-00-07-02",4,null,12,3,0,7,2,"03","00","07","02"]
["03-00-08-01",4,null,12,3,0,8,1,"03","00","08","01"]
["03-00-09-00",4,null,12,3,0,9,0,"03","00","09","00"]
["03-01-00-08",5,null,12,3,1,0,8,"03","01","00","08"]
["03-01-01-07",4,null,12,3,1,1,7,"03","01","01","07"]
["03-01-02-06",4,null,12,3,1,2,6,"03","01","02","06"]
["03-01-03-05",4,null,12,3,1,3,5,"03","01","03","05"]
["03-01-04-04",4,null,12,3,1,4,4,"03","01","04","04"]
["03-01-05-03",4,null,12,3,1,5,3,"03","01","05","03"]
["03-01-06-02",4,null,12,3,1,6,2,"03","01","06","02"]
["03-01-07-01",4,null,12,3,1,7,1,"03","01","07","01"]
["03-01-08-00",4,null,12,3,1,8,0,"03","01","08","00"]
["03-02-00-07",4,null,12,3,2,0,7,"03","02","00","07"]
["03-02-01-06",4,null,12,3,2,1,6,"03","02","01","06"]
["03-02-02-05",4,null,12,3,2,2,5,"03","02","02","05"]
["03-02-03-04",4,null,12,3,2,3,4,"03","02","03","04"]
["03-02-04-03",4,null,12,3,2,4,3,"03","02","04","03"]
["03-02-05-02",4,null,12,3,2,5,2,"03","02","05","02"]
["03-02-06-01",4,null,12,3,2,6,1,"03","02","06","01"]
["03-02-07-00",4,null,12,3,2,7,0,"03","02","07","00"]
["03-03-00-06",4,null,12,3,3,0,6,"03","03","00","06"]
["03-03-01-05",4,null,12,3,3,1,5,"03","03","01","05"]
["03-03-02-04",4,null,12,3,3,2,4,"03","03","02","04"]
["03-03-03-03",4,null,12,3,3,3,3,"03","03","03","03"]
["03-03-04-02",4,null,12,3,3,4,2,"03","03","04","02"]
["03-03-05-01",4,null,12,3,3,5,1,"03","03","05","01"]
["03-03-06-00",4,null,12,3,3,6,0,"03","03","06","00"]
["03-04-00-05",3,null,12,3,4,0,5,"03","04","00","05"]
["03-04-01-04",3,null,12,3,4,1,4,"03","04","01","04"]
["03-04-02-03",3,null,12,3,4,2,3,"03","04","02","03"]
["03-04-03-02",3,null,12,3,4,3,2,"03","04","03","02"]
["03-04-04-01",3,null,12,3,4,4,1,"03","04","04","01"]
["03-04-05-00",3,null,12,3,4,5,0,"03","04","05","00"]
["03-05-00-04",3,null,12,3,5,0,4,"03","05","00","04"]
["03-05-01-03",3,null,12,3,5,1,3,"03","05","01","03"]
["03-05-02-02",3,null,12,3,5,2,2,"03","05","02","02"]
["03-05-03-01",3,null,12,3,5,3,1,"03","05","03","01"]
["03-05-04-00",3,null,12,3,5,4,0,"03","05","04","00"]
["03-06-00-03",3,null,12,3,6,0,3,"03","06","00","03"]
["03-06-01-02",2,null,12,3,6,1,2,"03","06","01","02"]
["03-06-02-01",3,null,12,3,6,2,1,"03","06","02","01"]
["03-06-03-00",2,null,12,3,6,3,0,"03","06","03","00"]
["03-07-00-02",2,null,12,3,7,0,2,"03","07","00","02"]
["03-07-01-01",2,null,12,3,7,1,1,"03","07","01","01"]
["03-07-02-00",2,null,12,3,7,2,0,"03","07","02","00"]
["03-08-00-01",2,null,12,3,8,0,1,"03","08","00","01"]
["03-08-01-00",2,null,12,3,8,1,0,"03","08","01","00"]
["03-09-00-00",2,null,12,3,9,0,0,"03","09","00","00"]
["04-00-00-08",4,null,12,4,0,0,8,"04","00","00","08"]
["04-00-01-07",4,null,12,4,0,1,7,"04","00","01","07"]
["04-00-02-06",4,null,12,4,0,2,6,"04","00","02","06"]
["04-00-03-05",4,null,12,4,0,3,5,"04","00","03","05"]
["04-00-04-04",4,null,12,4,0,4,4,"04","00","04","04"]
["04-00-05-03",4,null,12,4,0,5,3,"04","00","05","03"]
["04-00-06-02",4,null,12,4,0,6,2,"04","00","06","02"]
["04-00-07-01",4,null,12,4,0,7,1,"04","00","07","01"]
["04-00-08-00",4,null,12,4,0,8,0,"04","00","08","00"]
["04-01-00-07",4,null,12,4,1,0,7,"04","01","00","07"]
["04-01-01-06",4,null,12,4,1,1,6,"04","01","01","06"]
["04-01-02-05",4,null,12,4,1,2,5,"04","01","02","05"]
["04-01-03-04",4,null,12,4,1,3,4,"04","01","03","04"]
["04-01-04-03",4,null,12,4,1,4,3,"04","01","04","03"]
[{"$f":"I1671&\"-\"&J1671&\"-\"&K1671&\"-\"&L1671","v":"04-01-05-02"},4,null,12,4,1,5,2,"04","01","05","02"]
["04-01-06-01",4,null,12,4,1,6,1,{"$f":"IF(LEN(E1672)=1,0&E1672,IF(LEN(E1672)=0,\"00\",RIGHT(E1672,2)))","v":"04"},{"$f":"IF(LEN(F1672)=1,0&F1672,IF(LEN(F1672)=0,\"00\",RIGHT(F1672,2)))","v":"01"},{"$f":"IF(LEN(G1672)=1,0&G1672,IF(LEN(G1672)=0,\"00\",RIGHT(G1672,2)))","v":"06"},{"$f":"IF(LEN(H1672)=1,0&H1672,IF(LEN(H1672)=0,\"00\",RIGHT(H1672,2)))","v":"01"}]
["04-01-07-00",4,null,12,4,1,7,0,"04","01","07","00"]
["04-02-00-06",4,null,12,4,2,0,6,"04","02","00","06"]
["04-02-01-05",4,null,12,4,2,1,5,"04","02","01","05"]
["04-02-02-04",4,null,12,4,2,2,4,"04","02","02","04"]
["04-02-03-03",4,null,12,4,2,3,3,"04","02","03","03"]
["04-02-04-02",4,null,12,4,2,4,2,"04","02","04","02"]
["04-02-05-01",4,null,12,4,2,5,1,"04","02","05","01"]
["04-02-06-00",3,null,12,4,2,6,0,"04","02","06","00"]
["04-03-00-05",3,null,12,4,3,0,5,"04","03","00","05"]
["04-03-01-04",3,null,12,4,3,1,4,"04","03","01","04"]
["04-03-02-03",3,null,12,4,3,2,3,"04","03","02","03"]
["04-03-03-02",3,null,12,4,3,3,2,"04","03","03","02"]
["04-03-04-01",3,null,12,4,3,4,1,"04","03","04","01"]
["04-03-05-00",3,null,12,4,3,5,0,"04","03","05","00"]
["04-04-00-04",3,null,12,4,4,0,4,"04","04","00","04"]
["04-04-01-03",3,null,12,4,4,1,3,"04","04","01","03"]
["04-04-02-02",3,null,12,4,4,2,2,"04","04","02","02"]
["04-04-03-01",3,null,12,4,4,3,1,"04","04","03","01"]
["04-04-04-00",3,null,12,4,4,4,0,"04","04","04","00"]
["04-05-00-03",3,null,12,4,5,0,3,"04","05","00","03"]
["04-05-01-02",2,null,12,4,5,1,2,"04","05","01","02"]
["04-05-02-01",2,null,12,4,5,2,1,"04","05","02","01"]
["04-05-03-00",2,null,12,4,5,3,0,"04","05","03","00"]
["04-06-00-02",2,null,12,4,6,0,2,"04","06","00","02"]
["04-06-01-01",2,null,12,4,6,1,1,"04","06","01","01"]
["04-06-02-00",2,null,12,4,6,2,0,"04","06","02","00"]
["04-07-00-01",2,null,12,4,7,0,1,"04","07","00","01"]
["04-07-01-00",2,null,12,4,7,1,0,"04","07","01","00"]
["04-08-00-00",2,null,12,4,8,0,0,"04","08","00","00"]
["05-00-00-07",4,null,12,5,0,0,7,"05","00","00","07"]
["05-00-01-06",4,null,12,5,0,1,6,"05","00","01","06"]
["05-00-02-05",4,null,12,5,0,2,5,"05","00","02","05"]
["05-00-03-04",4,null,12,5,0,3,4,"05","00","03","04"]
["05-00-04-03",4,null,12,5,0,4,3,"05","00","04","03"]
["05-00-05-02",4,null,12,5,0,5,2,"05","00","05","02"]
["05-00-06-01",4,null,12,5,0,6,1,"05","00","06","01"]
["05-00-07-00",3,null,12,5,0,7,0,"05","00","07","00"]
["05-01-00-06",4,null,12,5,1,0,6,"05","01","00","06"]
["05-01-01-05",4,null,12,5,1,1,5,"05","01","01","05"]
["05-01-02-04",4,null,12,5,1,2,4,"05","01","02","04"]
["05-01-03-03",4,null,12,5,1,3,3,"05","01","03","03"]
["05-01-04-02",4,null,12,5,1,4,2,"05","01","04","02"]
["05-01-05-01",3,null,12,5,1,5,1,"05","01","05","01"]
["05-01-06-00",3,null,12,5,1,6,0,"05","01","06","00"]
["05-02-00-05",3,null,12,5,2,0,5,"05","02","00","05"]
["05-02-01-04",3,null,12,5,2,1,4,"05","02","01","04"]
["05-02-02-03",3,null,12,5,2,2,3,"05","02","02","03"]
["05-02-03-02",3,null,12,5,2,3,2,"05","02","03","02"]
["05-02-04-01",3,null,12,5,2,4,1,"05","02","04","01"]
["05-02-05-00",3,null,12,5,2,5,0,"05","02","05","00"]
["05-03-00-04",3,null,12,5,3,0,4,"05","03","00","04"]
["05-03-01-03",3,null,12,5,3,1,3,"05","03","01","03"]
["05-03-02-02",3,null,12,5,3,2,2,"05","03","02","02"]
["05-03-03-01",3,null,12,5,3,3,1,"05","03","03","01"]
["05-03-04-00",3,null,12,5,3,4,0,"05","03","04","00"]
["05-04-00-03",3,null,12,5,4,0,3,"05","04","00","03"]
["05-04-01-02",2,null,12,5,4,1,2,"05","04","01","02"]
["05-04-02-01",2,null,12,5,4,2,1,"05","04","02","01"]
["05-04-03-00",2,null,12,5,4,3,0,"05","04","03","00"]
["05-05-00-02",2,null,12,5,5,0,2,"05","05","00","02"]
["05-05-01-01",2,null,12,5,5,1,1,"05","05","01","01"]
["05-05-02-00",2,null,12,5,5,2,0,"05","05","02","00"]
[{"$f":"I1735&\"-\"&J1735&\"-\"&K1735&\"-\"&L1735","v":"05-06-00-01"},2,null,12,5,6,0,1,"05","06","00","01"]
["05-06-01-00",2,null,12,5,6,1,0,{"$f":"IF(LEN(E1736)=1,0&E1736,IF(LEN(E1736)=0,\"00\",RIGHT(E1736,2)))","v":"05"},{"$f":"IF(LEN(F1736)=1,0&F1736,IF(LEN(F1736)=0,\"00\",RIGHT(F1736,2)))","v":"06"},{"$f":"IF(LEN(G1736)=1,0&G1736,IF(LEN(G1736)=0,\"00\",RIGHT(G1736,2)))","v":"01"},{"$f":"IF(LEN(H1736)=1,0&H1736,IF(LEN(H1736)=0,\"00\",RIGHT(H1736,2)))","v":"00"}]
["05-07-00-00",2,null,12,5,7,0,0,"05","07","00","00"]
["06-00-00-06",4,null,12,6,0,0,6,"06","00","00","06"]
["06-00-01-05",4,null,12,6,0,1,5,"06","00","01","05"]
["06-00-02-04",4,null,12,6,0,2,4,"06","00","02","04"]
["06-00-03-03",3,null,12,6,0,3,3,"06","00","03","03"]
["06-00-04-02",3,null,12,6,0,4,2,"06","00","04","02"]
["06-00-05-01",3,null,12,6,0,5,1,"06","00","05","01"]
["06-00-06-00",3,null,12,6,0,6,0,"06","00","06","00"]
["06-01-00-05",3,null,12,6,1,0,5,"06","01","00","05"]
["06-01-01-04",3,null,12,6,1,1,4,"06","01","01","04"]
["06-01-02-03",3,null,12,6,1,2,3,"06","01","02","03"]
["06-01-03-02",3,null,12,6,1,3,2,"06","01","03","02"]
["06-01-04-01",3,null,12,6,1,4,1,"06","01","04","01"]
["06-01-05-00",3,null,12,6,1,5,0,"06","01","05","00"]
["06-02-00-04",3,null,12,6,2,0,4,"06","02","00","04"]
["06-02-01-03",3,null,12,6,2,1,3,"06","02","01","03"]
["06-02-02-02",3,null,12,6,2,2,2,"06","02","02","02"]
["06-02-03-01",3,null,12,6,2,3,1,"06","02","03","01"]
["06-02-04-00",3,null,12,6,2,4,0,"06","02","04","00"]
["06-03-00-03",3,null,12,6,3,0,3,"06","03","00","03"]
["06-03-01-02",2,null,12,6,3,1,2,"06","03","01","02"]
["06-03-02-01",2,null,12,6,3,2,1,"06","03","02","01"]
["06-03-03-00",2,null,12,6,3,3,0,"06","03","03","00"]
["06-04-00-02",2,null,12,6,4,0,2,"06","04","00","02"]
["06-04-01-01",2,null,12,6,4,1,1,"06","04","01","01"]
["06-04-02-00",2,null,12,6,4,2,0,"06","04","02","00"]
["06-05-00-01",2,null,12,6,5,0,1,"06","05","00","01"]
["06-05-01-00",2,null,12,6,5,1,0,"06","05","01","00"]
["06-06-00-00",2,null,12,6,6,0,0,"06","06","00","00"]
["07-00-00-05",3,null,12,7,0,0,5,"07","00","00","05"]
["07-00-01-04",3,null,12,7,0,1,4,"07","00","01","04"]
["07-00-02-03",3,null,12,7,0,2,3,"07","00","02","03"]
["07-00-03-02",3,null,12,7,0,3,2,"07","00","03","02"]
["07-00-04-01",3,null,12,7,0,4,1,"07","00","04","01"]
["07-00-05-00",3,null,12,7,0,5,0,"07","00","05","00"]
["07-01-00-04",3,null,12,7,1,0,4,"07","01","00","04"]
["07-01-01-03",3,null,12,7,1,1,3,"07","01","01","03"]
["07-01-02-02",3,null,12,7,1,2,2,"07","01","02","02"]
["07-01-03-01",3,null,12,7,1,3,1,"07","01","03","01"]
["07-01-04-00",3,null,12,7,1,4,0,"07","01","04","00"]
["07-02-00-03",3,null,12,7,2,0,3,"07","02","00","03"]
["07-02-01-02",2,null,12,7,2,1,2,"07","02","01","02"]
["07-02-02-01",2,null,12,7,2,2,1,"07","02","02","01"]
["07-02-03-00",2,null,12,7,2,3,0,"07","02","03","00"]
["07-03-00-02",2,null,12,7,3,0,2,"07","03","00","02"]
["07-03-01-01",2,null,12,7,3,1,1,"07","03","01","01"]
["07-03-02-00",2,null,12,7,3,2,0,"07","03","02","00"]
["07-04-00-01",2,null,12,7,4,0,1,"07","04","00","01"]
["07-04-01-00",2,null,12,7,4,1,0,"07","04","01","00"]
["07-05-00-00",2,null,12,7,5,0,0,"07","05","00","00"]
["08-00-00-04",3,null,12,8,0,0,4,"08","00","00","04"]
["08-00-01-03",3,null,12,8,0,1,3,"08","00","01","03"]
["08-00-02-02",3,null,12,8,0,2,2,"08","00","02","02"]
["08-00-03-01",3,null,12,8,0,3,1,"08","00","03","01"]
["08-00-04-00",3,null,12,8,0,4,0,"08","00","04","00"]
["08-01-00-03",3,null,12,8,1,0,3,"08","01","00","03"]
["08-01-01-02",2,null,12,8,1,1,2,"08","01","01","02"]
["08-01-02-01",2,null,12,8,1,2,1,"08","01","02","01"]
["08-01-03-00",2,null,12,8,1,3,0,"08","01","03","00"]
["08-02-00-02",2,null,12,8,2,0,2,"08","02","00","02"]
["08-02-01-01",2,null,12,8,2,1,1,"08","02","01","01"]
["08-02-02-00",2,null,12,8,2,2,0,"08","02","02","00"]
[{"$f":"I1799&\"-\"&J1799&\"-\"&K1799&\"-\"&L1799","v":"08-03-00-01"},2,null,12,8,3,0,1,"08","03","00","01"]
["08-03-01-00",2,null,12,8,3,1,0,{"$f":"IF(LEN(E1800)=1,0&E1800,IF(LEN(E1800)=0,\"00\",RIGHT(E1800,2)))","v":"08"},{"$f":"IF(LEN(F1800)=1,0&F1800,IF(LEN(F1800)=0,\"00\",RIGHT(F1800,2)))","v":"03"},{"$f":"IF(LEN(G1800)=1,0&G1800,IF(LEN(G1800)=0,\"00\",RIGHT(G1800,2)))","v":"01"},{"$f":"IF(LEN(H1800)=1,0&H1800,IF(LEN(H1800)=0,\"00\",RIGHT(H1800,2)))","v":"00"}]
["08-04-00-00",2,null,12,8,4,0,0,"08","04","00","00"]
["09-00-00-03",3,null,12,9,0,0,3,"09","00","00","03"]
["09-00-01-02",2,null,12,9,0,1,2,"09","00","01","02"]
["09-00-02-01",2,null,12,9,0,2,1,"09","00","02","01"]
["09-00-03-00",2,null,12,9,0,3,0,"09","00","03","00"]
["09-01-00-02",2,null,12,9,1,0,2,"09","01","00","02"]
["09-01-01-01",2,null,12,9,1,1,1,"09","01","01","01"]
["09-01-02-00",2,null,12,9,1,2,0,"09","01","02","00"]
["09-02-00-01",2,null,12,9,2,0,1,"09","02","00","01"]
["09-02-01-00",2,null,12,9,2,1,0,"09","02","01","00"]
["09-03-00-00",2,null,12,9,3,0,0,"09","03","00","00"]
["10-00-00-02",2,null,12,10,0,0,2,"10","00","00","02"]
["10-00-01-01",2,null,12,10,0,1,1,"10","00","01","01"]
["10-00-02-00",2,null,12,10,0,2,0,"10","00","02","00"]
["10-01-00-01",2,null,12,10,1,0,1,"10","01","00","01"]
["10-01-01-00",2,null,12,10,1,1,0,"10","01","01","00"]
["10-02-00-00",2,null,12,10,2,0,0,"10","02","00","00"]
["11-00-00-01",2,null,12,11,0,0,1,"11","00","00","01"]
["11-00-01-00",2,null,12,11,0,1,0,"11","00","01","00"]
["11-01-00-00",2,null,12,11,1,0,0,"11","01","00","00"]
["12-00-00-00",1,null,12,12,0,0,0,"12","00","00","00"]
["00-00-00-13",7,null,13,0,0,0,13,"00","00","00","13"]
["00-00-01-12",6,null,13,0,0,1,12,"00","00","01","12"]
["00-00-02-11",6,null,13,0,0,2,11,"00","00","02","11"]
["00-00-03-10",6,null,13,0,0,3,10,"00","00","03","10"]
["00-00-04-09",6,null,13,0,0,4,9,"00","00","04","09"]
["00-00-05-08",6,null,13,0,0,5,8,"00","00","05","08"]
["00-00-06-07",6,null,13,0,0,6,7,"00","00","06","07"]
["00-00-07-06",5,null,13,0,0,7,6,"00","00","07","06"]
["00-00-08-05",5,null,13,0,0,8,5,"00","00","08","05"]
["00-00-09-04",5,null,13,0,0,9,4,"00","00","09","04"]
["00-00-10-03",5,null,13,0,0,10,3,"00","00","10","03"]
["00-00-11-02",4,null,13,0,0,11,2,"00","00","11","02"]
["00-00-12-01",4,null,13,0,0,12,1,"00","00","12","01"]
["00-00-13-00",4,null,13,0,0,13,0,"00","00","13","00"]
["00-01-00-12",5,null,13,0,1,0,12,"00","01","00","12"]
["00-01-01-11",5,null,13,0,1,1,11,"00","01","01","11"]
["00-01-02-10",5,null,13,0,1,2,10,"00","01","02","10"]
["00-01-03-09",5,null,13,0,1,3,9,"00","01","03","09"]
["00-01-04-08",5,null,13,0,1,4,8,"00","01","04","08"]
["00-01-05-07",5,null,13,0,1,5,7,"00","01","05","07"]
["00-01-06-06",5,null,13,0,1,6,6,"00","01","06","06"]
["00-01-07-05",5,null,13,0,1,7,5,"00","01","07","05"]
["00-01-08-04",5,null,13,0,1,8,4,"00","01","08","04"]
["00-01-09-03",5,null,13,0,1,9,3,"00","01","09","03"]
["00-01-10-02",4,null,13,0,1,10,2,"00","01","10","02"]
["00-01-11-01",4,null,13,0,1,11,1,"00","01","11","01"]
["00-01-12-00",4,null,13,0,1,12,0,"00","01","12","00"]
["00-02-00-11",5,null,13,0,2,0,11,"00","02","00","11"]
["00-02-01-10",5,null,13,0,2,1,10,"00","02","01","10"]
["00-02-02-09",5,null,13,0,2,2,9,"00","02","02","09"]
["00-02-03-08",5,null,13,0,2,3,8,"00","02","03","08"]
["00-02-04-07",5,null,13,0,2,4,7,"00","02","04","07"]
["00-02-05-06",5,null,13,0,2,5,6,"00","02","05","06"]
["00-02-06-05",5,null,13,0,2,6,5,"00","02","06","05"]
["00-02-07-04",5,null,13,0,2,7,4,"00","02","07","04"]
["00-02-08-03",5,null,13,0,2,8,3,"00","02","08","03"]
["00-02-09-02",4,null,13,0,2,9,2,"00","02","09","02"]
["00-02-10-01",4,null,13,0,2,10,1,"00","02","10","01"]
["00-02-11-00",4,null,13,0,2,11,0,"00","02","11","00"]
["00-03-00-10",5,null,13,0,3,0,10,"00","03","00","10"]
["00-03-01-09",5,null,13,0,3,1,9,"00","03","01","09"]
[{"$f":"I1863&\"-\"&J1863&\"-\"&K1863&\"-\"&L1863","v":"00-03-02-08"},5,null,13,0,3,2,8,"00","03","02","08"]
["00-03-03-07",5,null,13,0,3,3,7,{"$f":"IF(LEN(E1864)=1,0&E1864,IF(LEN(E1864)=0,\"00\",RIGHT(E1864,2)))","v":"00"},{"$f":"IF(LEN(F1864)=1,0&F1864,IF(LEN(F1864)=0,\"00\",RIGHT(F1864,2)))","v":"03"},{"$f":"IF(LEN(G1864)=1,0&G1864,IF(LEN(G1864)=0,\"00\",RIGHT(G1864,2)))","v":"03"},{"$f":"IF(LEN(H1864)=1,0&H1864,IF(LEN(H1864)=0,\"00\",RIGHT(H1864,2)))","v":"07"}]
["00-03-04-06",5,null,13,0,3,4,6,"00","03","04","06"]
["00-03-05-05",5,null,13,0,3,5,5,"00","03","05","05"]
["00-03-06-04",5,null,13,0,3,6,4,"00","03","06","04"]
["00-03-07-03",5,null,13,0,3,7,3,"00","03","07","03"]
["00-03-08-02",4,null,13,0,3,8,2,"00","03","08","02"]
["00-03-09-01",4,null,13,0,3,9,1,"00","03","09","01"]
["00-03-10-00",4,null,13,0,3,10,0,"00","03","10","00"]
["00-04-00-09",5,null,13,0,4,0,9,"00","04","00","09"]
["00-04-01-08",5,null,13,0,4,1,8,"00","04","01","08"]
["00-04-02-07",5,null,13,0,4,2,7,"00","04","02","07"]
["00-04-03-06",5,null,13,0,4,3,6,"00","04","03","06"]
["00-04-04-05",5,null,13,0,4,4,5,"00","04","04","05"]
["00-04-05-04",5,null,13,0,4,5,4,"00","04","05","04"]
["00-04-06-03",4,null,13,0,4,6,3,"00","04","06","03"]
["00-04-07-02",4,null,13,0,4,7,2,"00","04","07","02"]
["00-04-08-01",4,null,13,0,4,8,1,"00","04","08","01"]
["00-04-09-00",4,null,13,0,4,9,0,"00","04","09","00"]
["00-05-00-08",5,null,13,0,5,0,8,"00","05","00","08"]
["00-05-01-07",5,null,13,0,5,1,7,"00","05","01","07"]
["00-05-02-06",5,null,13,0,5,2,6,"00","05","02","06"]
["00-05-03-05",5,null,13,0,5,3,5,"00","05","03","05"]
["00-05-04-04",4,null,13,0,5,4,4,"00","05","04","04"]
["00-05-05-03",4,null,13,0,5,5,3,"00","05","05","03"]
["00-05-06-02",4,null,13,0,5,6,2,"00","05","06","02"]
["00-05-07-01",4,null,13,0,5,7,1,"00","05","07","01"]
["00-05-08-00",4,null,13,0,5,8,0,"00","05","08","00"]
["00-06-00-07",5,null,13,0,6,0,7,"00","06","00","07"]
["00-06-01-06",4,null,13,0,6,1,6,"00","06","01","06"]
["00-06-02-05",4,null,13,0,6,2,5,"00","06","02","05"]
["00-06-03-04",4,null,13,0,6,3,4,"00","06","03","04"]
["00-06-04-03",4,null,13,0,6,4,3,"00","06","04","03"]
["00-06-05-02",4,null,13,0,6,5,2,"00","06","05","02"]
["00-06-06-01",4,null,13,0,6,6,1,"00","06","06","01"]
["00-06-07-00",4,null,13,0,6,7,0,"00","06","07","00"]
["00-07-00-06",3,null,13,0,7,0,6,"00","07","00","06"]
["00-07-01-05",3,null,13,0,7,1,5,"00","07","01","05"]
["00-07-02-04",3,null,13,0,7,2,4,"00","07","02","04"]
["00-07-03-03",3,null,13,0,7,3,3,"00","07","03","03"]
["00-07-04-02",3,null,13,0,7,4,2,"00","07","04","02"]
["00-07-05-01",3,null,13,0,7,5,1,"00","07","05","01"]
["00-07-06-00",3,null,13,0,7,6,0,"00","07","06","00"]
["00-08-00-05",3,null,13,0,8,0,5,"00","08","00","05"]
["00-08-01-04",3,null,13,0,8,1,4,"00","08","01","04"]
["00-08-02-03",3,null,13,0,8,2,3,"00","08","02","03"]
["00-08-03-02",3,null,13,0,8,3,2,"00","08","03","02"]
["00-08-04-01",3,null,13,0,8,4,1,"00","08","04","01"]
["00-08-05-00",3,null,13,0,8,5,0,"00","08","05","00"]
["00-09-00-04",3,null,13,0,9,0,4,"00","09","00","04"]
["00-09-01-03",3,null,13,0,9,1,3,"00","09","01","03"]
["00-09-02-02",3,null,13,0,9,2,2,"00","09","02","02"]
["00-09-03-01",3,null,13,0,9,3,1,"00","09","03","01"]
["00-09-04-00",3,null,13,0,9,4,0,"00","09","04","00"]
["00-10-00-03",3,null,13,0,10,0,3,"00","10","00","03"]
["00-10-01-02",3,null,13,0,10,1,2,"00","10","01","02"]
["00-10-02-01",3,null,13,0,10,2,1,"00","10","02","01"]
["00-10-03-00",3,null,13,0,10,3,0,"00","10","03","00"]
["00-11-00-02",3,null,13,0,11,0,2,"00","11","00","02"]
["00-11-01-01",3,null,13,0,11,1,1,"00","11","01","01"]
["00-11-02-00",2,null,13,0,11,2,0,"00","11","02","00"]
["00-12-00-01",2,null,13,0,12,0,1,"00","12","00","01"]
["00-12-01-00",2,null,13,0,12,1,0,"00","12","01","00"]
["00-13-00-00",2,null,13,0,13,0,0,"00","13","00","00"]
[{"$f":"I1927&\"-\"&J1927&\"-\"&K1927&\"-\"&L1927","v":"01-00-00-12"},5,null,13,1,0,0,12,"01","00","00","12"]
["01-00-01-11",5,null,13,1,0,1,11,{"$f":"IF(LEN(E1928)=1,0&E1928,IF(LEN(E1928)=0,\"00\",RIGHT(E1928,2)))","v":"01"},{"$f":"IF(LEN(F1928)=1,0&F1928,IF(LEN(F1928)=0,\"00\",RIGHT(F1928,2)))","v":"00"},{"$f":"IF(LEN(G1928)=1,0&G1928,IF(LEN(G1928)=0,\"00\",RIGHT(G1928,2)))","v":"01"},{"$f":"IF(LEN(H1928)=1,0&H1928,IF(LEN(H1928)=0,\"00\",RIGHT(H1928,2)))","v":"11"}]
["01-00-02-10",5,null,13,1,0,2,10,"01","00","02","10"]
["01-00-03-09",5,null,13,1,0,3,9,"01","00","03","09"]
["01-00-04-08",5,null,13,1,0,4,8,"01","00","04","08"]
["01-00-05-07",5,null,13,1,0,5,7,"01","00","05","07"]
["01-00-06-06",5,null,13,1,0,6,6,"01","00","06","06"]
["01-00-07-05",5,null,13,1,0,7,5,"01","00","07","05"]
["01-00-08-04",5,null,13,1,0,8,4,"01","00","08","04"]
["01-00-09-03",5,null,13,1,0,9,3,"01","00","09","03"]
["01-00-10-02",4,null,13,1,0,10,2,"01","00","10","02"]
["01-00-11-01",4,null,13,1,0,11,1,"01","00","11","01"]
["01-00-12-00",4,null,13,1,0,12,0,"01","00","12","00"]
["01-01-00-11",5,null,13,1,1,0,11,"01","01","00","11"]
["01-01-01-10",5,null,13,1,1,1,10,"01","01","01","10"]
["01-01-02-09",5,null,13,1,1,2,9,"01","01","02","09"]
["01-01-03-08",5,null,13,1,1,3,8,"01","01","03","08"]
["01-01-04-07",5,null,13,1,1,4,7,"01","01","04","07"]
["01-01-05-06",5,null,13,1,1,5,6,"01","01","05","06"]
["01-01-06-05",5,null,13,1,1,6,5,"01","01","06","05"]
["01-01-07-04",5,null,13,1,1,7,4,"01","01","07","04"]
["01-01-08-03",5,null,13,1,1,8,3,"01","01","08","03"]
["01-01-09-02",4,null,13,1,1,9,2,"01","01","09","02"]
["01-01-10-01",4,null,13,1,1,10,1,"01","01","10","01"]
["01-01-11-00",4,null,13,1,1,11,0,"01","01","11","00"]
["01-02-00-10",5,null,13,1,2,0,10,"01","02","00","10"]
["01-02-01-09",5,null,13,1,2,1,9,"01","02","01","09"]
["01-02-02-08",5,null,13,1,2,2,8,"01","02","02","08"]
["01-02-03-07",5,null,13,1,2,3,7,"01","02","03","07"]
["01-02-04-06",5,null,13,1,2,4,6,"01","02","04","06"]
["01-02-05-05",5,null,13,1,2,5,5,"01","02","05","05"]
["01-02-06-04",5,null,13,1,2,6,4,"01","02","06","04"]
["01-02-07-03",4,null,13,1,2,7,3,"01","02","07","03"]
["01-02-08-02",4,null,13,1,2,8,2,"01","02","08","02"]
["01-02-09-01",4,null,13,1,2,9,1,"01","02","09","01"]
["01-02-10-00",4,null,13,1,2,10,0,"01","02","10","00"]
["01-03-00-09",5,null,13,1,3,0,9,"01","03","00","09"]
["01-03-01-08",5,null,13,1,3,1,8,"01","03","01","08"]
["01-03-02-07",5,null,13,1,3,2,7,"01","03","02","07"]
["01-03-03-06",5,null,13,1,3,3,6,"01","03","03","06"]
["01-03-04-05",5,null,13,1,3,4,5,"01","03","04","05"]
["01-03-05-04",4,null,13,1,3,5,4,"01","03","05","04"]
["01-03-06-03",4,null,13,1,3,6,3,"01","03","06","03"]
["01-03-07-02",4,null,13,1,3,7,2,"01","03","07","02"]
["01-03-08-01",4,null,13,1,3,8,1,"01","03","08","01"]
["01-03-09-00",4,null,13,1,3,9,0,"01","03","09","00"]
["01-04-00-08",5,null,13,1,4,0,8,"01","04","00","08"]
["01-04-01-07",5,null,13,1,4,1,7,"01","04","01","07"]
["01-04-02-06",4,null,13,1,4,2,6,"01","04","02","06"]
["01-04-03-05",4,null,13,1,4,3,5,"01","04","03","05"]
["01-04-04-04",4,null,13,1,4,4,4,"01","04","04","04"]
["01-04-05-03",4,null,13,1,4,5,3,"01","04","05","03"]
["01-04-06-02",4,null,13,1,4,6,2,"01","04","06","02"]
["01-04-07-01",4,null,13,1,4,7,1,"01","04","07","01"]
["01-04-08-00",4,null,13,1,4,8,0,"01","04","08","00"]
["01-05-00-07",4,null,13,1,5,0,7,"01","05","00","07"]
["01-05-01-06",4,null,13,1,5,1,6,"01","05","01","06"]
["01-05-02-05",4,null,13,1,5,2,5,"01","05","02","05"]
["01-05-03-04",4,null,13,1,5,3,4,"01","05","03","04"]
["01-05-04-03",4,null,13,1,5,4,3,"01","05","04","03"]
["01-05-05-02",4,null,13,1,5,5,2,"01","05","05","02"]
["01-05-06-01",4,null,13,1,5,6,1,"01","05","06","01"]
["01-05-07-00",4,null,13,1,5,7,0,"01","05","07","00"]
["01-06-00-06",3,null,13,1,6,0,6,"01","06","00","06"]
[{"$f":"I1991&\"-\"&J1991&\"-\"&K1991&\"-\"&L1991","v":"01-06-01-05"},3,null,13,1,6,1,5,"01","06","01","05"]
["01-06-02-04",3,null,13,1,6,2,4,{"$f":"IF(LEN(E1992)=1,0&E1992,IF(LEN(E1992)=0,\"00\",RIGHT(E1992,2)))","v":"01"},{"$f":"IF(LEN(F1992)=1,0&F1992,IF(LEN(F1992)=0,\"00\",RIGHT(F1992,2)))","v":"06"},{"$f":"IF(LEN(G1992)=1,0&G1992,IF(LEN(G1992)=0,\"00\",RIGHT(G1992,2)))","v":"02"},{"$f":"IF(LEN(H1992)=1,0&H1992,IF(LEN(H1992)=0,\"00\",RIGHT(H1992,2)))","v":"04"}]
["01-06-03-03",3,null,13,1,6,3,3,"01","06","03","03"]
["01-06-04-02",3,null,13,1,6,4,2,"01","06","04","02"]
["01-06-05-01",3,null,13,1,6,5,1,"01","06","05","01"]
["01-06-06-00",3,null,13,1,6,6,0,"01","06","06","00"]
["01-07-00-05",3,null,13,1,7,0,5,"01","07","00","05"]
["01-07-01-04",3,null,13,1,7,1,4,"01","07","01","04"]
["01-07-02-03",3,null,13,1,7,2,3,"01","07","02","03"]
["01-07-03-02",3,null,13,1,7,3,2,"01","07","03","02"]
["01-07-04-01",3,null,13,1,7,4,1,"01","07","04","01"]
["01-07-05-00",3,null,13,1,7,5,0,"01","07","05","00"]
["01-08-00-04",3,null,13,1,8,0,4,"01","08","00","04"]
["01-08-01-03",3,null,13,1,8,1,3,"01","08","01","03"]
["01-08-02-02",3,null,13,1,8,2,2,"01","08","02","02"]
["01-08-03-01",3,null,13,1,8,3,1,"01","08","03","01"]
["01-08-04-00",3,null,13,1,8,4,0,"01","08","04","00"]
["01-09-00-03",3,null,13,1,9,0,3,"01","09","00","03"]
["01-09-01-02",3,null,13,1,9,1,2,"01","09","01","02"]
["01-09-02-01",3,null,13,1,9,2,1,"01","09","02","01"]
["01-09-03-00",2,null,13,1,9,3,0,"01","09","03","00"]
["01-10-00-02",2,null,13,1,10,0,2,"01","10","00","02"]
["01-10-01-01",2,null,13,1,10,1,1,"01","10","01","01"]
["01-10-02-00",2,null,13,1,10,2,0,"01","10","02","00"]
["01-11-00-01",2,null,13,1,11,0,1,"01","11","00","01"]
["01-11-01-00",2,null,13,1,11,1,0,"01","11","01","00"]
["01-12-00-00",2,null,13,1,12,0,0,"01","12","00","00"]
["02-00-00-11",5,null,13,2,0,0,11,"02","00","00","11"]
["02-00-01-10",5,null,13,2,0,1,10,"02","00","01","10"]
["02-00-02-09",5,null,13,2,0,2,9,"02","00","02","09"]
["02-00-03-08",5,null,13,2,0,3,8,"02","00","03","08"]
["02-00-04-07",5,null,13,2,0,4,7,"02","00","04","07"]
["02-00-05-06",5,null,13,2,0,5,6,"02","00","05","06"]
["02-00-06-05",5,null,13,2,0,6,5,"02","00","06","05"]
["02-00-07-04",5,null,13,2,0,7,4,"02","00","07","04"]
["02-00-08-03",4,null,13,2,0,8,3,"02","00","08","03"]
["02-00-09-02",4,null,13,2,0,9,2,"02","00","09","02"]
["02-00-10-01",4,null,13,2,0,10,1,"02","00","10","01"]
["02-00-11-00",4,null,13,2,0,11,0,"02","00","11","00"]
["02-01-00-10",5,null,13,2,1,0,10,"02","01","00","10"]
["02-01-01-09",5,null,13,2,1,1,9,"02","01","01","09"]
["02-01-02-08",5,null,13,2,1,2,8,"02","01","02","08"]
["02-01-03-07",5,null,13,2,1,3,7,"02","01","03","07"]
["02-01-04-06",5,null,13,2,1,4,6,"02","01","04","06"]
["02-01-05-05",5,null,13,2,1,5,5,"02","01","05","05"]
["02-01-06-04",4,null,13,2,1,6,4,"02","01","06","04"]
["02-01-07-03",4,null,13,2,1,7,3,"02","01","07","03"]
["02-01-08-02",4,null,13,2,1,8,2,"02","01","08","02"]
["02-01-09-01",4,null,13,2,1,9,1,"02","01","09","01"]
["02-01-10-00",4,null,13,2,1,10,0,"02","01","10","00"]
["02-02-00-09",5,null,13,2,2,0,9,"02","02","00","09"]
["02-02-01-08",5,null,13,2,2,1,8,"02","02","01","08"]
["02-02-02-07",5,null,13,2,2,2,7,"02","02","02","07"]
["02-02-03-06",4,null,13,2,2,3,6,"02","02","03","06"]
["02-02-04-05",4,null,13,2,2,4,5,"02","02","04","05"]
["02-02-05-04",4,null,13,2,2,5,4,"02","02","05","04"]
["02-02-06-03",4,null,13,2,2,6,3,"02","02","06","03"]
["02-02-07-02",4,null,13,2,2,7,2,"02","02","07","02"]
["02-02-08-01",4,null,13,2,2,8,1,"02","02","08","01"]
["02-02-09-00",4,null,13,2,2,9,0,"02","02","09","00"]
["02-03-00-08",5,null,13,2,3,0,8,"02","03","00","08"]
["02-03-01-07",4,null,13,2,3,1,7,"02","03","01","07"]
["02-03-02-06",4,null,13,2,3,2,6,"02","03","02","06"]
["02-03-03-05",4,null,13,2,3,3,5,"02","03","03","05"]
[{"$f":"I2055&\"-\"&J2055&\"-\"&K2055&\"-\"&L2055","v":"02-03-04-04"},4,null,13,2,3,4,4,"02","03","04","04"]
["02-03-05-03",4,null,13,2,3,5,3,{"$f":"IF(LEN(E2056)=1,0&E2056,IF(LEN(E2056)=0,\"00\",RIGHT(E2056,2)))","v":"02"},{"$f":"IF(LEN(F2056)=1,0&F2056,IF(LEN(F2056)=0,\"00\",RIGHT(F2056,2)))","v":"03"},{"$f":"IF(LEN(G2056)=1,0&G2056,IF(LEN(G2056)=0,\"00\",RIGHT(G2056,2)))","v":"05"},{"$f":"IF(LEN(H2056)=1,0&H2056,IF(LEN(H2056)=0,\"00\",RIGHT(H2056,2)))","v":"03"}]
["02-03-06-02",4,null,13,2,3,6,2,"02","03","06","02"]
["02-03-07-01",4,null,13,2,3,7,1,"02","03","07","01"]
["02-03-08-00",4,null,13,2,3,8,0,"02","03","08","00"]
["02-04-00-07",4,null,13,2,4,0,7,"02","04","00","07"]
["02-04-01-06",4,null,13,2,4,1,6,"02","04","01","06"]
["02-04-02-05",4,null,13,2,4,2,5,"02","04","02","05"]
["02-04-03-04",4,null,13,2,4,3,4,"02","04","03","04"]
["02-04-04-03",4,null,13,2,4,4,3,"02","04","04","03"]
["02-04-05-02",4,null,13,2,4,5,2,"02","04","05","02"]
["02-04-06-01",4,null,13,2,4,6,1,"02","04","06","01"]
["02-04-07-00",4,null,13,2,4,7,0,"02","04","07","00"]
["02-05-00-06",3,null,13,2,5,0,6,"02","05","00","06"]
["02-05-01-05",3,null,13,2,5,1,5,"02","05","01","05"]
["02-05-02-04",3,null,13,2,5,2,4,"02","05","02","04"]
["02-05-03-03",3,null,13,2,5,3,3,"02","05","03","03"]
["02-05-04-02",3,null,13,2,5,4,2,"02","05","04","02"]
["02-05-05-01",3,null,13,2,5,5,1,"02","05","05","01"]
["02-05-06-00",3,null,13,2,5,6,0,"02","05","06","00"]
["02-06-00-05",3,null,13,2,6,0,5,"02","06","00","05"]
["02-06-01-04",3,null,13,2,6,1,4,"02","06","01","04"]
["02-06-02-03",3,null,13,2,6,2,3,"02","06","02","03"]
["02-06-03-02",3,null,13,2,6,3,2,"02","06","03","02"]
["02-06-04-01",3,null,13,2,6,4,1,"02","06","04","01"]
["02-06-05-00",3,null,13,2,6,5,0,"02","06","05","00"]
["02-07-00-04",3,null,13,2,7,0,4,"02","07","00","04"]
["02-07-01-03",3,null,13,2,7,1,3,"02","07","01","03"]
["02-07-02-02",3,null,13,2,7,2,2,"02","07","02","02"]
["02-07-03-01",3,null,13,2,7,3,1,"02","07","03","01"]
["02-07-04-00",3,null,13,2,7,4,0,"02","07","04","00"]
["02-08-00-03",3,null,13,2,8,0,3,"02","08","00","03"]
["02-08-01-02",2,null,13,2,8,1,2,"02","08","01","02"]
["02-08-02-01",2,null,13,2,8,2,1,"02","08","02","01"]
["02-08-03-00",2,null,13,2,8,3,0,"02","08","03","00"]
["02-09-00-02",2,null,13,2,9,0,2,"02","09","00","02"]
["02-09-01-01",2,null,13,2,9,1,1,"02","09","01","01"]
["02-09-02-00",2,null,13,2,9,2,0,"02","09","02","00"]
["02-10-00-01",2,null,13,2,10,0,1,"02","10","00","01"]
["02-10-01-00",2,null,13,2,10,1,0,"02","10","01","00"]
["02-11-00-00",2,null,13,2,11,0,0,"02","11","00","00"]
["03-00-00-10",5,null,13,3,0,0,10,"03","00","00","10"]
["03-00-01-09",5,null,13,3,0,1,9,"03","00","01","09"]
["03-00-02-08",5,null,13,3,0,2,8,"03","00","02","08"]
["03-00-03-07",5,null,13,3,0,3,7,"03","00","03","07"]
["03-00-04-06",4,null,13,3,0,4,6,"03","00","04","06"]
["03-00-05-05",4,null,13,3,0,5,5,"03","00","05","05"]
["03-00-06-04",4,null,13,3,0,6,4,"03","00","06","04"]
["03-00-07-03",4,null,13,3,0,7,3,"03","00","07","03"]
["03-00-08-02",4,null,13,3,0,8,2,"03","00","08","02"]
["03-00-09-01",4,null,13,3,0,9,1,"03","00","09","01"]
["03-00-10-00",4,null,13,3,0,10,0,"03","00","10","00"]
["03-01-00-09",5,null,13,3,1,0,9,"03","01","00","09"]
["03-01-01-08",5,null,13,3,1,1,8,"03","01","01","08"]
["03-01-02-07",4,null,13,3,1,2,7,"03","01","02","07"]
["03-01-03-06",4,null,13,3,1,3,6,"03","01","03","06"]
["03-01-04-05",4,null,13,3,1,4,5,"03","01","04","05"]
["03-01-05-04",4,null,13,3,1,5,4,"03","01","05","04"]
["03-01-06-03",4,null,13,3,1,6,3,"03","01","06","03"]
["03-01-07-02",4,null,13,3,1,7,2,"03","01","07","02"]
["03-01-08-01",4,null,13,3,1,8,1,"03","01","08","01"]
["03-01-09-00",4,null,13,3,1,9,0,"03","01","09","00"]
["03-02-00-08",4,null,13,3,2,0,8,"03","02","00","08"]
["03-02-01-07",4,null,13,3,2,1,7,"03","02","01","07"]
[{"$f":"I2119&\"-\"&J2119&\"-\"&K2119&\"-\"&L2119","v":"03-02-02-06"},4,null,13,3,2,2,6,"03","02","02","06"]
["03-02-03-05",4,null,13,3,2,3,5,{"$f":"IF(LEN(E2120)=1,0&E2120,IF(LEN(E2120)=0,\"00\",RIGHT(E2120,2)))","v":"03"},{"$f":"IF(LEN(F2120)=1,0&F2120,IF(LEN(F2120)=0,\"00\",RIGHT(F2120,2)))","v":"02"},{"$f":"IF(LEN(G2120)=1,0&G2120,IF(LEN(G2120)=0,\"00\",RIGHT(G2120,2)))","v":"03"},{"$f":"IF(LEN(H2120)=1,0&H2120,IF(LEN(H2120)=0,\"00\",RIGHT(H2120,2)))","v":"05"}]
["03-02-04-04",4,null,13,3,2,4,4,"03","02","04","04"]
["03-02-05-03",4,null,13,3,2,5,3,"03","02","05","03"]
["03-02-06-02",4,null,13,3,2,6,2,"03","02","06","02"]
["03-02-07-01",4,null,13,3,2,7,1,"03","02","07","01"]
["03-02-08-00",4,null,13,3,2,8,0,"03","02","08","00"]
["03-03-00-07",4,null,13,3,3,0,7,"03","03","00","07"]
["03-03-01-06",4,null,13,3,3,1,6,"03","03","01","06"]
["03-03-02-05",4,null,13,3,3,2,5,"03","03","02","05"]
["03-03-03-04",4,null,13,3,3,3,4,"03","03","03","04"]
["03-03-04-03",4,null,13,3,3,4,3,"03","03","04","03"]
["03-03-05-02",4,null,13,3,3,5,2,"03","03","05","02"]
["03-03-06-01",4,null,13,3,3,6,1,"03","03","06","01"]
["03-03-07-00",4,null,13,3,3,7,0,"03","03","07","00"]
["03-04-00-06",3,null,13,3,4,0,6,"03","04","00","06"]
["03-04-01-05",3,null,13,3,4,1,5,"03","04","01","05"]
["03-04-02-04",3,null,13,3,4,2,4,"03","04","02","04"]
["03-04-03-03",3,null,13,3,4,3,3,"03","04","03","03"]
["03-04-04-02",3,null,13,3,4,4,2,"03","04","04","02"]
["03-04-05-01",3,null,13,3,4,5,1,"03","04","05","01"]
["03-04-06-00",3,null,13,3,4,6,0,"03","04","06","00"]
["03-05-00-05",3,null,13,3,5,0,5,"03","05","00","05"]
["03-05-01-04",3,null,13,3,5,1,4,"03","05","01","04"]
["03-05-02-03",3,null,13,3,5,2,3,"03","05","02","03"]
["03-05-03-02",3,null,13,3,5,3,2,"03","05","03","02"]
["03-05-04-01",3,null,13,3,5,4,1,"03","05","04","01"]
["03-05-05-00",3,null,13,3,5,5,0,"03","05","05","00"]
["03-06-00-04",3,null,13,3,6,0,4,"03","06","00","04"]
["03-06-01-03",3,null,13,3,6,1,3,"03","06","01","03"]
["03-06-02-02",3,null,13,3,6,2,2,"03","06","02","02"]
["03-06-03-01",3,null,13,3,6,3,1,"03","06","03","01"]
["03-06-04-00",3,null,13,3,6,4,0,"03","06","04","00"]
["03-07-00-03",3,null,13,3,7,0,3,"03","07","00","03"]
["03-07-01-02",2,null,13,3,7,1,2,"03","07","01","02"]
["03-07-02-01",2,null,13,3,7,2,1,"03","07","02","01"]
["03-07-03-00",2,null,13,3,7,3,0,"03","07","03","00"]
["03-08-00-02",2,null,13,3,8,0,2,"03","08","00","02"]
["03-08-01-01",2,null,13,3,8,1,1,"03","08","01","01"]
["03-08-02-00",2,null,13,3,8,2,0,"03","08","02","00"]
["03-09-00-01",2,null,13,3,9,0,1,"03","09","00","01"]
["03-09-01-00",2,null,13,3,9,1,0,"03","09","01","00"]
["03-10-00-00",2,null,13,3,10,0,0,"03","10","00","00"]
["04-00-00-09",4,null,13,4,0,0,9,"04","00","00","09"]
["04-00-01-08",4,null,13,4,0,1,8,"04","00","01","08"]
["04-00-02-07",4,null,13,4,0,2,7,"04","00","02","07"]
["04-00-03-06",4,null,13,4,0,3,6,"04","00","03","06"]
["04-00-04-05",4,null,13,4,0,4,5,"04","00","04","05"]
["04-00-05-04",4,null,13,4,0,5,4,"04","00","05","04"]
["04-00-06-03",4,null,13,4,0,6,3,"04","00","06","03"]
["04-00-07-02",4,null,13,4,0,7,2,"04","00","07","02"]
["04-00-08-01",4,null,13,4,0,8,1,"04","00","08","01"]
["04-00-09-00",4,null,13,4,0,9,0,"04","00","09","00"]
["04-01-00-08",4,null,13,4,1,0,8,"04","01","00","08"]
["04-01-01-07",4,null,13,4,1,1,7,"04","01","01","07"]
["04-01-02-06",4,null,13,4,1,2,6,"04","01","02","06"]
["04-01-03-05",4,null,13,4,1,3,5,"04","01","03","05"]
["04-01-04-04",4,null,13,4,1,4,4,"04","01","04","04"]
["04-01-05-03",4,null,13,4,1,5,3,"04","01","05","03"]
["04-01-06-02",4,null,13,4,1,6,2,"04","01","06","02"]
["04-01-07-01",4,null,13,4,1,7,1,"04","01","07","01"]
["04-01-08-00",4,null,13,4,1,8,0,"04","01","08","00"]
["04-02-00-07",4,null,13,4,2,0,7,"04","02","00","07"]
["04-02-01-06",4,null,13,4,2,1,6,"04","02","01","06"]
[{"$f":"I2183&\"-\"&J2183&\"-\"&K2183&\"-\"&L2183","v":"04-02-02-05"},4,null,13,4,2,2,5,"04","02","02","05"]
["04-02-03-04",4,null,13,4,2,3,4,{"$f":"IF(LEN(E2184)=1,0&E2184,IF(LEN(E2184)=0,\"00\",RIGHT(E2184,2)))","v":"04"},{"$f":"IF(LEN(F2184)=1,0&F2184,IF(LEN(F2184)=0,\"00\",RIGHT(F2184,2)))","v":"02"},{"$f":"IF(LEN(G2184)=1,0&G2184,IF(LEN(G2184)=0,\"00\",RIGHT(G2184,2)))","v":"03"},{"$f":"IF(LEN(H2184)=1,0&H2184,IF(LEN(H2184)=0,\"00\",RIGHT(H2184,2)))","v":"04"}]
["04-02-04-03",4,null,13,4,2,4,3,"04","02","04","03"]
["04-02-05-02",4,null,13,4,2,5,2,"04","02","05","02"]
["04-02-06-01",4,null,13,4,2,6,1,"04","02","06","01"]
["04-02-07-00",4,null,13,4,2,7,0,"04","02","07","00"]
["04-03-00-06",3,null,13,4,3,0,6,"04","03","00","06"]
["04-03-01-05",3,null,13,4,3,1,5,"04","03","01","05"]
["04-03-02-04",3,null,13,4,3,2,4,"04","03","02","04"]
["04-03-03-03",3,null,13,4,3,3,3,"04","03","03","03"]
["04-03-04-02",3,null,13,4,3,4,2,"04","03","04","02"]
["04-03-05-01",3,null,13,4,3,5,1,"04","03","05","01"]
["04-03-06-00",3,null,13,4,3,6,0,"04","03","06","00"]
["04-04-00-05",3,null,13,4,4,0,5,"04","04","00","05"]
["04-04-01-04",3,null,13,4,4,1,4,"04","04","01","04"]
["04-04-02-03",3,null,13,4,4,2,3,"04","04","02","03"]
["04-04-03-02",3,null,13,4,4,3,2,"04","04","03","02"]
["04-04-04-01",3,null,13,4,4,4,1,"04","04","04","01"]
["04-04-05-00",3,null,13,4,4,5,0,"04","04","05","00"]
["04-05-00-04",3,null,13,4,5,0,4,"04","05","00","04"]
["04-05-01-03",3,null,13,4,5,1,3,"04","05","01","03"]
["04-05-02-02",3,null,13,4,5,2,2,"04","05","02","02"]
["04-05-03-01",3,null,13,4,5,3,1,"04","05","03","01"]
["04-05-04-00",3,null,13,4,5,4,0,"04","05","04","00"]
["04-06-00-03",3,null,13,4,6,0,3,"04","06","00","03"]
["04-06-01-02",2,null,13,4,6,1,2,"04","06","01","02"]
["04-06-02-01",2,null,13,4,6,2,1,"04","06","02","01"]
["04-06-03-00",2,null,13,4,6,3,0,"04","06","03","00"]
["04-07-00-02",2,null,13,4,7,0,2,"04","07","00","02"]
["04-07-01-01",2,null,13,4,7,1,1,"04","07","01","01"]
["04-07-02-00",2,null,13,4,7,2,0,"04","07","02","00"]
["04-08-00-01",2,null,13,4,8,0,1,"04","08","00","01"]
["04-08-01-00",2,null,13,4,8,1,0,"04","08","01","00"]
["04-09-00-00",2,null,13,4,9,0,0,"04","09","00","00"]
["05-00-00-08",4,null,13,5,0,0,8,"05","00","00","08"]
["05-00-01-07",4,null,13,5,0,1,7,"05","00","01","07"]
["05-00-02-06",4,null,13,5,0,2,6,"05","00","02","06"]
["05-00-03-05",4,null,13,5,0,3,5,"05","00","03","05"]
["05-00-04-04",4,null,13,5,0,4,4,"05","00","04","04"]
["05-00-05-03",4,null,13,5,0,5,3,"05","00","05","03"]
["05-00-06-02",4,null,13,5,0,6,2,"05","00","06","02"]
["05-00-07-01",4,null,13,5,0,7,1,"05","00","07","01"]
["05-00-08-00",4,null,13,5,0,8,0,"05","00","08","00"]
["05-01-00-07",4,null,13,5,1,0,7,"05","01","00","07"]
["05-01-01-06",4,null,13,5,1,1,6,"05","01","01","06"]
["05-01-02-05",4,null,13,5,1,2,5,"05","01","02","05"]
["05-01-03-04",4,null,13,5,1,3,4,"05","01","03","04"]
["05-01-04-03",4,null,13,5,1,4,3,"05","01","04","03"]
["05-01-05-02",4,null,13,5,1,5,2,"05","01","05","02"]
["05-01-06-01",4,null,13,5,1,6,1,"05","01","06","01"]
["05-01-07-00",3,null,13,5,1,7,0,"05","01","07","00"]
["05-02-00-06",3,null,13,5,2,0,6,"05","02","00","06"]
["05-02-01-05",3,null,13,5,2,1,5,"05","02","01","05"]
["05-02-02-04",3,null,13,5,2,2,4,"05","02","02","04"]
["05-02-03-03",3,null,13,5,2,3,3,"05","02","03","03"]
["05-02-04-02",3,null,13,5,2,4,2,"05","02","04","02"]
["05-02-05-01",3,null,13,5,2,5,1,"05","02","05","01"]
["05-02-06-00",3,null,13,5,2,6,0,"05","02","06","00"]
["05-03-00-05",3,null,13,5,3,0,5,"05","03","00","05"]
["05-03-01-04",3,null,13,5,3,1,4,"05","03","01","04"]
["05-03-02-03",3,null,13,5,3,2,3,"05","03","02","03"]
["05-03-03-02",3,null,13,5,3,3,2,"05","03","03","02"]
["05-03-04-01",3,null,13,5,3,4,1,"05","03","04","01"]
["05-03-05-00",3,null,13,5,3,5,0,"05","03","05","00"]
[{"$f":"I2247&\"-\"&J2247&\"-\"&K2247&\"-\"&L2247","v":"05-04-00-04"},3,null,13,5,4,0,4,"05","04","00","04"]
["05-04-01-03",3,null,13,5,4,1,3,{"$f":"IF(LEN(E2248)=1,0&E2248,IF(LEN(E2248)=0,\"00\",RIGHT(E2248,2)))","v":"05"},{"$f":"IF(LEN(F2248)=1,0&F2248,IF(LEN(F2248)=0,\"00\",RIGHT(F2248,2)))","v":"04"},{"$f":"IF(LEN(G2248)=1,0&G2248,IF(LEN(G2248)=0,\"00\",RIGHT(G2248,2)))","v":"01"},{"$f":"IF(LEN(H2248)=1,0&H2248,IF(LEN(H2248)=0,\"00\",RIGHT(H2248,2)))","v":"03"}]
["05-04-02-02",3,null,13,5,4,2,2,"05","04","02","02"]
["05-04-03-01",3,null,13,5,4,3,1,"05","04","03","01"]
["05-04-04-00",3,null,13,5,4,4,0,"05","04","04","00"]
["05-05-00-03",3,null,13,5,5,0,3,"05","05","00","03"]
["05-05-01-02",2,null,13,5,5,1,2,"05","05","01","02"]
["05-05-02-01",2,null,13,5,5,2,1,"05","05","02","01"]
["05-05-03-00",2,null,13,5,5,3,0,"05","05","03","00"]
["05-06-00-02",2,null,13,5,6,0,2,"05","06","00","02"]
["05-06-01-01",2,null,13,5,6,1,1,"05","06","01","01"]
["05-06-02-00",2,null,13,5,6,2,0,"05","06","02","00"]
["05-07-00-01",2,null,13,5,7,0,1,"05","07","00","01"]
["05-07-01-00",2,null,13,5,7,1,0,"05","07","01","00"]
["05-08-00-00",2,null,13,5,8,0,0,"05","08","00","00"]
["06-00-00-07",4,null,13,6,0,0,7,"06","00","00","07"]
["06-00-01-06",4,null,13,6,0,1,6,"06","00","01","06"]
["06-00-02-05",4,null,13,6,0,2,5,"06","00","02","05"]
["06-00-03-04",4,null,13,6,0,3,4,"06","00","03","04"]
["06-00-04-03",4,null,13,6,0,4,3,"06","00","04","03"]
["06-00-05-02",3,null,13,6,0,5,2,"06","00","05","02"]
["06-00-06-01",3,null,13,6,0,6,1,"06","00","06","01"]
["06-00-07-00",3,null,13,6,0,7,0,"06","00","07","00"]
["06-01-00-06",3,null,13,6,1,0,6,"06","01","00","06"]
["06-01-01-05",3,null,13,6,1,1,5,"06","01","01","05"]
["06-01-02-04",3,null,13,6,1,2,4,"06","01","02","04"]
["06-01-03-03",3,null,13,6,1,3,3,"06","01","03","03"]
["06-01-04-02",3,null,13,6,1,4,2,"06","01","04","02"]
["06-01-05-01",3,null,13,6,1,5,1,"06","01","05","01"]
["06-01-06-00",3,null,13,6,1,6,0,"06","01","06","00"]
["06-02-00-05",3,null,13,6,2,0,5,"06","02","00","05"]
["06-02-01-04",3,null,13,6,2,1,4,"06","02","01","04"]
["06-02-02-03",3,null,13,6,2,2,3,"06","02","02","03"]
["06-02-03-02",3,null,13,6,2,3,2,"06","02","03","02"]
["06-02-04-01",3,null,13,6,2,4,1,"06","02","04","01"]
["06-02-05-00",3,null,13,6,2,5,0,"06","02","05","00"]
["06-03-00-04",3,null,13,6,3,0,4,"06","03","00","04"]
["06-03-01-03",3,null,13,6,3,1,3,"06","03","01","03"]
["06-03-02-02",3,null,13,6,3,2,2,"06","03","02","02"]
["06-03-03-01",3,null,13,6,3,3,1,"06","03","03","01"]
["06-03-04-00",3,null,13,6,3,4,0,"06","03","04","00"]
["06-04-00-03",3,null,13,6,4,0,3,"06","04","00","03"]
["06-04-01-02",2,null,13,6,4,1,2,"06","04","01","02"]
["06-04-02-01",2,null,13,6,4,2,1,"06","04","02","01"]
["06-04-03-00",2,null,13,6,4,3,0,"06","04","03","00"]
["06-05-00-02",2,null,13,6,5,0,2,"06","05","00","02"]
["06-05-01-01",2,null,13,6,5,1,1,"06","05","01","01"]
["06-05-02-00",2,null,13,6,5,2,0,"06","05","02","00"]
["06-06-00-01",2,null,13,6,6,0,1,"06","06","00","01"]
["06-06-01-00",2,null,13,6,6,1,0,"06","06","01","00"]
["06-07-00-00",2,null,13,6,7,0,0,"06","07","00","00"]
["07-00-00-06",3,null,13,7,0,0,6,"07","00","00","06"]
["07-00-01-05",3,null,13,7,0,1,5,"07","00","01","05"]
["07-00-02-04",3,null,13,7,0,2,4,"07","00","02","04"]
["07-00-03-03",3,null,13,7,0,3,3,"07","00","03","03"]
["07-00-04-02",3,null,13,7,0,4,2,"07","00","04","02"]
["07-00-05-01",3,null,13,7,0,5,1,"07","00","05","01"]
["07-00-06-00",3,null,13,7,0,6,0,"07","00","06","00"]
["07-01-00-05",3,null,13,7,1,0,5,"07","01","00","05"]
["07-01-01-04",3,null,13,7,1,1,4,"07","01","01","04"]
["07-01-02-03",3,null,13,7,1,2,3,"07","01","02","03"]
["07-01-03-02",3,null,13,7,1,3,2,"07","01","03","02"]
["07-01-04-01",3,null,13,7,1,4,1,"07","01","04","01"]
["07-01-05-00",3,null,13,7,1,5,0,"07","01","05","00"]
[{"$f":"I2311&\"-\"&J2311&\"-\"&K2311&\"-\"&L2311","v":"07-02-00-04"},3,null,13,7,2,0,4,"07","02","00","04"]
["07-02-01-03",3,null,13,7,2,1,3,{"$f":"IF(LEN(E2312)=1,0&E2312,IF(LEN(E2312)=0,\"00\",RIGHT(E2312,2)))","v":"07"},{"$f":"IF(LEN(F2312)=1,0&F2312,IF(LEN(F2312)=0,\"00\",RIGHT(F2312,2)))","v":"02"},{"$f":"IF(LEN(G2312)=1,0&G2312,IF(LEN(G2312)=0,\"00\",RIGHT(G2312,2)))","v":"01"},{"$f":"IF(LEN(H2312)=1,0&H2312,IF(LEN(H2312)=0,\"00\",RIGHT(H2312,2)))","v":"03"}]
["07-02-02-02",3,null,13,7,2,2,2,"07","02","02","02"]
["07-02-03-01",3,null,13,7,2,3,1,"07","02","03","01"]
["07-02-04-00",3,null,13,7,2,4,0,"07","02","04","00"]
["07-03-00-03",3,null,13,7,3,0,3,"07","03","00","03"]
["07-03-01-02",2,null,13,7,3,1,2,"07","03","01","02"]
["07-03-02-01",2,null,13,7,3,2,1,"07","03","02","01"]
["07-03-03-00",2,null,13,7,3,3,0,"07","03","03","00"]
["07-04-00-02",2,null,13,7,4,0,2,"07","04","00","02"]
["07-04-01-01",2,null,13,7,4,1,1,"07","04","01","01"]
["07-04-02-00",2,null,13,7,4,2,0,"07","04","02","00"]
["07-05-00-01",2,null,13,7,5,0,1,"07","05","00","01"]
["07-05-01-00",2,null,13,7,5,1,0,"07","05","01","00"]
["07-06-00-00",2,null,13,7,6,0,0,"07","06","00","00"]
["08-00-00-05",3,null,13,8,0,0,5,"08","00","00","05"]
["08-00-01-04",3,null,13,8,0,1,4,"08","00","01","04"]
["08-00-02-03",3,null,13,8,0,2,3,"08","00","02","03"]
["08-00-03-02",3,null,13,8,0,3,2,"08","00","03","02"]
["08-00-04-01",3,null,13,8,0,4,1,"08","00","04","01"]
["08-00-05-00",3,null,13,8,0,5,0,"08","00","05","00"]
["08-01-00-04",3,null,13,8,1,0,4,"08","01","00","04"]
["08-01-01-03",3,null,13,8,1,1,3,"08","01","01","03"]
["08-01-02-02",3,null,13,8,1,2,2,"08","01","02","02"]
["08-01-03-01",3,null,13,8,1,3,1,"08","01","03","01"]
["08-01-04-00",3,null,13,8,1,4,0,"08","01","04","00"]
["08-02-00-03",3,null,13,8,2,0,3,"08","02","00","03"]
["08-02-01-02",2,null,13,8,2,1,2,"08","02","01","02"]
["08-02-02-01",2,null,13,8,2,2,1,"08","02","02","01"]
["08-02-03-00",2,null,13,8,2,3,0,"08","02","03","00"]
["08-03-00-02",2,null,13,8,3,0,2,"08","03","00","02"]
["08-03-01-01",2,null,13,8,3,1,1,"08","03","01","01"]
["08-03-02-00",2,null,13,8,3,2,0,"08","03","02","00"]
["08-04-00-01",2,null,13,8,4,0,1,"08","04","00","01"]
["08-04-01-00",2,null,13,8,4,1,0,"08","04","01","00"]
["08-05-00-00",2,null,13,8,5,0,0,"08","05","00","00"]
["09-00-00-04",3,null,13,9,0,0,4,"09","00","00","04"]
["09-00-01-03",3,null,13,9,0,1,3,"09","00","01","03"]
["09-00-02-02",3,null,13,9,0,2,2,"09","00","02","02"]
["09-00-03-01",3,null,13,9,0,3,1,"09","00","03","01"]
["09-00-04-00",3,null,13,9,0,4,0,"09","00","04","00"]
["09-01-00-03",3,null,13,9,1,0,3,"09","01","00","03"]
["09-01-01-02",2,null,13,9,1,1,2,"09","01","01","02"]
["09-01-02-01",2,null,13,9,1,2,1,"09","01","02","01"]
["09-01-03-00",2,null,13,9,1,3,0,"09","01","03","00"]
["09-02-00-02",2,null,13,9,2,0,2,"09","02","00","02"]
["09-02-01-01",2,null,13,9,2,1,1,"09","02","01","01"]
["09-02-02-00",2,null,13,9,2,2,0,"09","02","02","00"]
["09-03-00-01",2,null,13,9,3,0,1,"09","03","00","01"]
["09-03-01-00",2,null,13,9,3,1,0,"09","03","01","00"]
["09-04-00-00",2,null,13,9,4,0,0,"09","04","00","00"]
["10-00-00-03",3,null,13,10,0,0,3,"10","00","00","03"]
["10-00-01-02",2,null,13,10,0,1,2,"10","00","01","02"]
["10-00-02-01",2,null,13,10,0,2,1,"10","00","02","01"]
["10-00-03-00",2,null,13,10,0,3,0,"10","00","03","00"]
["10-01-00-02",2,null,13,10,1,0,2,"10","01","00","02"]
["10-01-01-01",2,null,13,10,1,1,1,"10","01","01","01"]
["10-01-02-00",2,null,13,10,1,2,0,"10","01","02","00"]
["10-02-00-01",2,null,13,10,2,0,1,"10","02","00","01"]
["10-02-01-00",2,null,13,10,2,1,0,"10","02","01","00"]
["10-03-00-00",2,null,13,10,3,0,0,"10","03","00","00"]
["11-00-00-02",2,null,13,11,0,0,2,"11","00","00","02"]
["11-00-01-01",2,null,13,11,0,1,1,"11","00","01","01"]
["11-00-02-00",2,null,13,11,0,2,0,"11","00","02","00"]
[{"$f":"I2375&\"-\"&J2375&\"-\"&K2375&\"-\"&L2375","v":"11-01-00-01"},2,null,13,11,1,0,1,"11","01","00","01"]
["11-01-01-00",2,null,13,11,1,1,0,{"$f":"IF(LEN(E2376)=1,0&E2376,IF(LEN(E2376)=0,\"00\",RIGHT(E2376,2)))","v":"11"},{"$f":"IF(LEN(F2376)=1,0&F2376,IF(LEN(F2376)=0,\"00\",RIGHT(F2376,2)))","v":"01"},{"$f":"IF(LEN(G2376)=1,0&G2376,IF(LEN(G2376)=0,\"00\",RIGHT(G2376,2)))","v":"01"},{"$f":"IF(LEN(H2376)=1,0&H2376,IF(LEN(H2376)=0,\"00\",RIGHT(H2376,2)))","v":"00"}]
["11-02-00-00",2,null,13,11,2,0,0,"11","02","00","00"]
["12-00-00-01",2,null,13,12,0,0,1,"12","00","00","01"]
["12-00-01-00",2,null,13,12,0,1,0,"12","00","01","00"]
["12-01-00-00",2,null,13,12,1,0,0,"12","01","00","00"]
["13-00-00-00",1,null,13,13,0,0,0,"13","00","00","00"]
["00-00-00-14",7,null,14,0,0,0,14,"00","00","00","14"]
["00-00-01-13",6,null,14,0,0,1,13,"00","00","01","13"]
["00-00-02-12",6,null,14,0,0,2,12,"00","00","02","12"]
["00-00-03-11",6,null,14,0,0,3,11,"00","00","03","11"]
["00-00-04-10",6,null,14,0,0,4,10,"00","00","04","10"]
["00-00-05-09",6,null,14,0,0,5,9,"00","00","05","09"]
["00-00-06-08",6,null,14,0,0,6,8,"00","00","06","08"]
["00-00-07-07",6,null,14,0,0,7,7,"00","00","07","07"]
["00-00-08-06",5,null,14,0,0,8,6,"00","00","08","06"]
["00-00-09-05",5,null,14,0,0,9,5,"00","00","09","05"]
["00-00-10-04",5,null,14,0,0,10,4,"00","00","10","04"]
["00-00-11-03",5,null,14,0,0,11,3,"00","00","11","03"]
["00-00-12-02",4,null,14,0,0,12,2,"00","00","12","02"]
["00-00-13-01",4,null,14,0,0,13,1,"00","00","13","01"]
["00-00-14-00",4,null,14,0,0,14,0,"00","00","14","00"]
["00-01-00-13",5,null,14,0,1,0,13,"00","01","00","13"]
["00-01-01-12",5,null,14,0,1,1,12,"00","01","01","12"]
["00-01-02-11",5,null,14,0,1,2,11,"00","01","02","11"]
["00-01-03-10",5,null,14,0,1,3,10,"00","01","03","10"]
["00-01-04-09",5,null,14,0,1,4,9,"00","01","04","09"]
["00-01-05-08",5,null,14,0,1,5,8,"00","01","05","08"]
["00-01-06-07",5,null,14,0,1,6,7,"00","01","06","07"]
["00-01-07-06",5,null,14,0,1,7,6,"00","01","07","06"]
["00-01-08-05",5,null,14,0,1,8,5,"00","01","08","05"]
["00-01-09-04",5,null,14,0,1,9,4,"00","01","09","04"]
["00-01-10-03",5,null,14,0,1,10,3,"00","01","10","03"]
["00-01-11-02",4,null,14,0,1,11,2,"00","01","11","02"]
["00-01-12-01",4,null,14,0,1,12,1,"00","01","12","01"]
["00-01-13-00",4,null,14,0,1,13,0,"00","01","13","00"]
["00-02-00-12",5,null,14,0,2,0,12,"00","02","00","12"]
["00-02-01-11",5,null,14,0,2,1,11,"00","02","01","11"]
["00-02-02-10",5,null,14,0,2,2,10,"00","02","02","10"]
["00-02-03-09",5,null,14,0,2,3,9,"00","02","03","09"]
["00-02-04-08",5,null,14,0,2,4,8,"00","02","04","08"]
["00-02-05-07",5,null,14,0,2,5,7,"00","02","05","07"]
["00-02-06-06",5,null,14,0,2,6,6,"00","02","06","06"]
["00-02-07-05",5,null,14,0,2,7,5,"00","02","07","05"]
["00-02-08-04",5,null,14,0,2,8,4,"00","02","08","04"]
["00-02-09-03",5,null,14,0,2,9,3,"00","02","09","03"]
["00-02-10-02",4,null,14,0,2,10,2,"00","02","10","02"]
["00-02-11-01",4,null,14,0,2,11,1,"00","02","11","01"]
["00-02-12-00",4,null,14,0,2,12,0,"00","02","12","00"]
["00-03-00-11",5,null,14,0,3,0,11,"00","03","00","11"]
["00-03-01-10",5,null,14,0,3,1,10,"00","03","01","10"]
["00-03-02-09",5,null,14,0,3,2,9,"00","03","02","09"]
["00-03-03-08",5,null,14,0,3,3,8,"00","03","03","08"]
["00-03-04-07",5,null,14,0,3,4,7,"00","03","04","07"]
["00-03-05-06",5,null,14,0,3,5,6,"00","03","05","06"]
["00-03-06-05",5,null,14,0,3,6,5,"00","03","06","05"]
["00-03-07-04",5,null,14,0,3,7,4,"00","03","07","04"]
["00-03-08-03",5,null,14,0,3,8,3,"00","03","08","03"]
["00-03-09-02",4,null,14,0,3,9,2,"00","03","09","02"]
["00-03-10-01",4,null,14,0,3,10,1,"00","03","10","01"]
["00-03-11-00",4,null,14,0,3,11,0,"00","03","11","00"]
["00-04-00-10",5,null,14,0,4,0,10,"00","04","00","10"]
["00-04-01-09",5,null,14,0,4,1,9,"00","04","01","09"]
["00-04-02-08",5,null,14,0,4,2,8,"00","04","02","08"]
[{"$f":"I2439&\"-\"&J2439&\"-\"&K2439&\"-\"&L2439","v":"00-04-03-07"},5,null,14,0,4,3,7,"00","04","03","07"]
["00-04-04-06",5,null,14,0,4,4,6,{"$f":"IF(LEN(E2440)=1,0&E2440,IF(LEN(E2440)=0,\"00\",RIGHT(E2440,2)))","v":"00"},{"$f":"IF(LEN(F2440)=1,0&F2440,IF(LEN(F2440)=0,\"00\",RIGHT(F2440,2)))","v":"04"},{"$f":"IF(LEN(G2440)=1,0&G2440,IF(LEN(G2440)=0,\"00\",RIGHT(G2440,2)))","v":"04"},{"$f":"IF(LEN(H2440)=1,0&H2440,IF(LEN(H2440)=0,\"00\",RIGHT(H2440,2)))","v":"06"}]
["00-04-05-05",5,null,14,0,4,5,5,"00","04","05","05"]
["00-04-06-04",5,null,14,0,4,6,4,"00","04","06","04"]
["00-04-07-03",5,null,14,0,4,7,3,"00","04","07","03"]
["00-04-08-02",4,null,14,0,4,8,2,"00","04","08","02"]
["00-04-09-01",4,null,14,0,4,9,1,"00","04","09","01"]
["00-04-10-00",4,null,14,0,4,10,0,"00","04","10","00"]
["00-05-00-09",5,null,14,0,5,0,9,"00","05","00","09"]
["00-05-01-08",5,null,14,0,5,1,8,"00","05","01","08"]
["00-05-02-07",5,null,14,0,5,2,7,"00","05","02","07"]
["00-05-03-06",5,null,14,0,5,3,6,"00","05","03","06"]
["00-05-04-05",5,null,14,0,5,4,5,"00","05","04","05"]
["00-05-05-04",4,null,14,0,5,5,4,"00","05","05","04"]
["00-05-06-03",4,null,14,0,5,6,3,"00","05","06","03"]
["00-05-07-02",4,null,14,0,5,7,2,"00","05","07","02"]
["00-05-08-01",4,null,14,0,5,8,1,"00","05","08","01"]
["00-05-09-00",4,null,14,0,5,9,0,"00","05","09","00"]
["00-06-00-08",5,null,14,0,6,0,8,"00","06","00","08"]
["00-06-01-07",5,null,14,0,6,1,7,"00","06","01","07"]
["00-06-02-06",5,null,14,0,6,2,6,"00","06","02","06"]
["00-06-03-05",4,null,14,0,6,3,5,"00","06","03","05"]
["00-06-04-04",4,null,14,0,6,4,4,"00","06","04","04"]
["00-06-05-03",4,null,14,0,6,5,3,"00","06","05","03"]
["00-06-06-02",4,null,14,0,6,6,2,"00","06","06","02"]
["00-06-07-01",4,null,14,0,6,7,1,"00","06","07","01"]
["00-06-08-00",4,null,14,0,6,8,0,"00","06","08","00"]
["00-07-00-07",4,null,14,0,7,0,7,"00","07","00","07"]
["00-07-01-06",4,null,14,0,7,1,6,"00","07","01","06"]
["00-07-02-05",4,null,14,0,7,2,5,"00","07","02","05"]
["00-07-03-04",4,null,14,0,7,3,4,"00","07","03","04"]
["00-07-04-03",4,null,14,0,7,4,3,"00","07","04","03"]
["00-07-05-02",4,null,14,0,7,5,2,"00","07","05","02"]
["00-07-06-01",4,null,14,0,7,6,1,"00","07","06","01"]
["00-07-07-00",4,null,14,0,7,7,0,"00","07","07","00"]
["00-08-00-06",3,null,14,0,8,0,6,"00","08","00","06"]
["00-08-01-05",3,null,14,0,8,1,5,"00","08","01","05"]
["00-08-02-04",3,null,14,0,8,2,4,"00","08","02","04"]
["00-08-03-03",3,null,14,0,8,3,3,"00","08","03","03"]
["00-08-04-02",3,null,14,0,8,4,2,"00","08","04","02"]
["00-08-05-01",3,null,14,0,8,5,1,"00","08","05","01"]
["00-08-06-00",3,null,14,0,8,6,0,"00","08","06","00"]
["00-09-00-05",3,null,14,0,9,0,5,"00","09","00","05"]
["00-09-01-04",3,null,14,0,9,1,4,"00","09","01","04"]
["00-09-02-03",3,null,14,0,9,2,3,"00","09","02","03"]
["00-09-03-02",3,null,14,0,9,3,2,"00","09","03","02"]
["00-09-04-01",3,null,14,0,9,4,1,"00","09","04","01"]
["00-09-05-00",3,null,14,0,9,5,0,"00","09","05","00"]
["00-10-00-04",3,null,14,0,10,0,4,"00","10","00","04"]
["00-10-01-03",3,null,14,0,10,1,3,"00","10","01","03"]
["00-10-02-02",3,null,14,0,10,2,2,"00","10","02","02"]
["00-10-03-01",3,null,14,0,10,3,1,"00","10","03","01"]
["00-10-04-00",3,null,14,0,10,4,0,"00","10","04","00"]
["00-11-00-03",3,null,14,0,11,0,3,"00","11","00","03"]
["00-11-01-02",3,null,14,0,11,1,2,"00","11","01","02"]
["00-11-02-01",3,null,14,0,11,2,1,"00","11","02","01"]
["00-11-03-00",3,null,14,0,11,3,0,"00","11","03","00"]
["00-12-00-02",3,null,14,0,12,0,2,"00","12","00","02"]
["00-12-01-01",3,null,14,0,12,1,1,"00","12","01","01"]
["00-12-02-00",2,null,14,0,12,2,0,"00","12","02","00"]
["00-13-00-01",2,null,14,0,13,0,1,"00","13","00","01"]
["00-13-01-00",2,null,14,0,13,1,0,"00","13","01","00"]
["00-14-00-00",2,null,14,0,14,0,0,"00","14","00","00"]
["01-00-00-13",5,null,14,1,0,0,13,"01","00","00","13"]
[{"$f":"I2503&\"-\"&J2503&\"-\"&K2503&\"-\"&L2503","v":"01-00-01-12"},5,null,14,1,0,1,12,"01","00","01","12"]
["01-00-02-11",5,null,14,1,0,2,11,{"$f":"IF(LEN(E2504)=1,0&E2504,IF(LEN(E2504)=0,\"00\",RIGHT(E2504,2)))","v":"01"},{"$f":"IF(LEN(F2504)=1,0&F2504,IF(LEN(F2504)=0,\"00\",RIGHT(F2504,2)))","v":"00"},{"$f":"IF(LEN(G2504)=1,0&G2504,IF(LEN(G2504)=0,\"00\",RIGHT(G2504,2)))","v":"02"},{"$f":"IF(LEN(H2504)=1,0&H2504,IF(LEN(H2504)=0,\"00\",RIGHT(H2504,2)))","v":"11"}]
["01-00-03-10",5,null,14,1,0,3,10,"01","00","03","10"]
["01-00-04-09",5,null,14,1,0,4,9,"01","00","04","09"]
["01-00-05-08",5,null,14,1,0,5,8,"01","00","05","08"]
["01-00-06-07",5,null,14,1,0,6,7,"01","00","06","07"]
["01-00-07-06",5,null,14,1,0,7,6,"01","00","07","06"]
["01-00-08-05",5,null,14,1,0,8,5,"01","00","08","05"]
["01-00-09-04",5,null,14,1,0,9,4,"01","00","09","04"]
["01-00-10-03",5,null,14,1,0,10,3,"01","00","10","03"]
["01-00-11-02",4,null,14,1,0,11,2,"01","00","11","02"]
["01-00-12-01",4,null,14,1,0,12,1,"01","00","12","01"]
["01-00-13-00",4,null,14,1,0,13,0,"01","00","13","00"]
["01-01-00-12",5,null,14,1,1,0,12,"01","01","00","12"]
["01-01-01-11",5,null,14,1,1,1,11,"01","01","01","11"]
["01-01-02-10",5,null,14,1,1,2,10,"01","01","02","10"]
["01-01-03-09",5,null,14,1,1,3,9,"01","01","03","09"]
["01-01-04-08",5,null,14,1,1,4,8,"01","01","04","08"]
["01-01-05-07",5,null,14,1,1,5,7,"01","01","05","07"]
["01-01-06-06",5,null,14,1,1,6,6,"01","01","06","06"]
["01-01-07-05",5,null,14,1,1,7,5,"01","01","07","05"]
["01-01-08-04",5,null,14,1,1,8,4,"01","01","08","04"]
["01-01-09-03",5,null,14,1,1,9,3,"01","01","09","03"]
["01-01-10-02",4,null,14,1,1,10,2,"01","01","10","02"]
["01-01-11-01",4,null,14,1,1,11,1,"01","01","11","01"]
["01-01-12-00",4,null,14,1,1,12,0,"01","01","12","00"]
["01-02-00-11",5,null,14,1,2,0,11,"01","02","00","11"]
["01-02-01-10",5,null,14,1,2,1,10,"01","02","01","10"]
["01-02-02-09",5,null,14,1,2,2,9,"01","02","02","09"]
["01-02-03-08",5,null,14,1,2,3,8,"01","02","03","08"]
["01-02-04-07",5,null,14,1,2,4,7,"01","02","04","07"]
["01-02-05-06",5,null,14,1,2,5,6,"01","02","05","06"]
["01-02-06-05",5,null,14,1,2,6,5,"01","02","06","05"]
["01-02-07-04",5,null,14,1,2,7,4,"01","02","07","04"]
["01-02-08-03",5,null,14,1,2,8,3,"01","02","08","03"]
["01-02-09-02",4,null,14,1,2,9,2,"01","02","09","02"]
["01-02-10-01",4,null,14,1,2,10,1,"01","02","10","01"]
["01-02-11-00",4,null,14,1,2,11,0,"01","02","11","00"]
["01-03-00-10",5,null,14,1,3,0,10,"01","03","00","10"]
["01-03-01-09",5,null,14,1,3,1,9,"01","03","01","09"]
["01-03-02-08",5,null,14,1,3,2,8,"01","03","02","08"]
["01-03-03-07",5,null,14,1,3,3,7,"01","03","03","07"]
["01-03-04-06",5,null,14,1,3,4,6,"01","03","04","06"]
["01-03-05-05",5,null,14,1,3,5,5,"01","03","05","05"]
["01-03-06-04",4,null,14,1,3,6,4,"01","03","06","04"]
["01-03-07-03",4,null,14,1,3,7,3,"01","03","07","03"]
["01-03-08-02",4,null,14,1,3,8,2,"01","03","08","02"]
["01-03-09-01",4,null,14,1,3,9,1,"01","03","09","01"]
["01-03-10-00",4,null,14,1,3,10,0,"01","03","10","00"]
["01-04-00-09",5,null,14,1,4,0,9,"01","04","00","09"]
["01-04-01-08",5,null,14,1,4,1,8,"01","04","01","08"]
["01-04-02-07",5,null,14,1,4,2,7,"01","04","02","07"]
["01-04-03-06",5,null,14,1,4,3,6,"01","04","03","06"]
["01-04-04-05",4,null,14,1,4,4,5,"01","04","04","05"]
["01-04-05-04",4,null,14,1,4,5,4,"01","04","05","04"]
["01-04-06-03",4,null,14,1,4,6,3,"01","04","06","03"]
["01-04-07-02",4,null,14,1,4,7,2,"01","04","07","02"]
["01-04-08-01",4,null,14,1,4,8,1,"01","04","08","01"]
["01-04-09-00",4,null,14,1,4,9,0,"01","04","09","00"]
["01-05-00-08",5,null,14,1,5,0,8,"01","05","00","08"]
["01-05-01-07",4,null,14,1,5,1,7,"01","05","01","07"]
["01-05-02-06",4,null,14,1,5,2,6,"01","05","02","06"]
["01-05-03-05",4,null,14,1,5,3,5,"01","05","03","05"]
["01-05-04-04",4,null,14,1,5,4,4,"01","05","04","04"]
[{"$f":"I2567&\"-\"&J2567&\"-\"&K2567&\"-\"&L2567","v":"01-05-05-03"},4,null,14,1,5,5,3,"01","05","05","03"]
["01-05-06-02",4,null,14,1,5,6,2,{"$f":"IF(LEN(E2568)=1,0&E2568,IF(LEN(E2568)=0,\"00\",RIGHT(E2568,2)))","v":"01"},{"$f":"IF(LEN(F2568)=1,0&F2568,IF(LEN(F2568)=0,\"00\",RIGHT(F2568,2)))","v":"05"},{"$f":"IF(LEN(G2568)=1,0&G2568,IF(LEN(G2568)=0,\"00\",RIGHT(G2568,2)))","v":"06"},{"$f":"IF(LEN(H2568)=1,0&H2568,IF(LEN(H2568)=0,\"00\",RIGHT(H2568,2)))","v":"02"}]
["01-05-07-01",4,null,14,1,5,7,1,"01","05","07","01"]
["01-05-08-00",4,null,14,1,5,8,0,"01","05","08","00"]
["01-06-00-07",4,null,14,1,6,0,7,"01","06","00","07"]
["01-06-01-06",4,null,14,1,6,1,6,"01","06","01","06"]
["01-06-02-05",4,null,14,1,6,2,5,"01","06","02","05"]
["01-06-03-04",4,null,14,1,6,3,4,"01","06","03","04"]
["01-06-04-03",4,null,14,1,6,4,3,"01","06","04","03"]
["01-06-05-02",4,null,14,1,6,5,2,"01","06","05","02"]
["01-06-06-01",4,null,14,1,6,6,1,"01","06","06","01"]
["01-06-07-00",4,null,14,1,6,7,0,"01","06","07","00"]
["01-07-00-06",3,null,14,1,7,0,6,"01","07","00","06"]
["01-07-01-05",3,null,14,1,7,1,5,"01","07","01","05"]
["01-07-02-04",3,null,14,1,7,2,4,"01","07","02","04"]
["01-07-03-03",3,null,14,1,7,3,3,"01","07","03","03"]
["01-07-04-02",3,null,14,1,7,4,2,"01","07","04","02"]
["01-07-05-01",3,null,14,1,7,5,1,"01","07","05","01"]
["01-07-06-00",3,null,14,1,7,6,0,"01","07","06","00"]
["01-08-00-05",3,null,14,1,8,0,5,"01","08","00","05"]
["01-08-01-04",3,null,14,1,8,1,4,"01","08","01","04"]
["01-08-02-03",3,null,14,1,8,2,3,"01","08","02","03"]
["01-08-03-02",3,null,14,1,8,3,2,"01","08","03","02"]
["01-08-04-01",3,null,14,1,8,4,1,"01","08","04","01"]
["01-08-05-00",3,null,14,1,8,5,0,"01","08","05","00"]
["01-09-00-04",3,null,14,1,9,0,4,"01","09","00","04"]
["01-09-01-03",3,null,14,1,9,1,3,"01","09","01","03"]
["01-09-02-02",3,null,14,1,9,2,2,"01","09","02","02"]
["01-09-03-01",3,null,14,1,9,3,1,"01","09","03","01"]
["01-09-04-00",3,null,14,1,9,4,0,"01","09","04","00"]
["01-10-00-03",3,null,14,1,10,0,3,"01","10","00","03"]
["01-10-01-02",3,null,14,1,10,1,2,"01","10","01","02"]
["01-10-02-01",3,null,14,1,10,2,1,"01","10","02","01"]
["01-10-03-00",2,null,14,1,10,3,0,"01","10","03","00"]
["01-11-00-02",2,null,14,1,11,0,2,"01","11","00","02"]
["01-11-01-01",2,null,14,1,11,1,1,"01","11","01","01"]
["01-11-02-00",2,null,14,1,11,2,0,"01","11","02","00"]
["01-12-00-01",2,null,14,1,12,0,1,"01","12","00","01"]
["01-12-01-00",2,null,14,1,12,1,0,"01","12","01","00"]
["01-13-00-00",2,null,14,1,13,0,0,"01","13","00","00"]
["02-00-00-12",5,null,14,2,0,0,12,"02","00","00","12"]
["02-00-01-11",5,null,14,2,0,1,11,"02","00","01","11"]
["02-00-02-10",5,null,14,2,0,2,10,"02","00","02","10"]
["02-00-03-09",5,null,14,2,0,3,9,"02","00","03","09"]
["02-00-04-08",5,null,14,2,0,4,8,"02","00","04","08"]
["02-00-05-07",5,null,14,2,0,5,7,"02","00","05","07"]
["02-00-06-06",5,null,14,2,0,6,6,"02","00","06","06"]
["02-00-07-05",5,null,14,2,0,7,5,"02","00","07","05"]
["02-00-08-04",5,null,14,2,0,8,4,"02","00","08","04"]
["02-00-09-03",5,null,14,2,0,9,3,"02","00","09","03"]
["02-00-10-02",4,null,14,2,0,10,2,"02","00","10","02"]
["02-00-11-01",4,null,14,2,0,11,1,"02","00","11","01"]
["02-00-12-00",4,null,14,2,0,12,0,"02","00","12","00"]
["02-01-00-11",5,null,14,2,1,0,11,"02","01","00","11"]
["02-01-01-10",5,null,14,2,1,1,10,"02","01","01","10"]
["02-01-02-09",5,null,14,2,1,2,9,"02","01","02","09"]
["02-01-03-08",5,null,14,2,1,3,8,"02","01","03","08"]
["02-01-04-07",5,null,14,2,1,4,7,"02","01","04","07"]
["02-01-05-06",5,null,14,2,1,5,6,"02","01","05","06"]
["02-01-06-05",5,null,14,2,1,6,5,"02","01","06","05"]
["02-01-07-04",4,null,14,2,1,7,4,"02","01","07","04"]
["02-01-08-03",4,null,14,2,1,8,3,"02","01","08","03"]
["02-01-09-02",4,null,14,2,1,9,2,"02","01","09","02"]
["02-01-10-01",4,null,14,2,1,10,1,"02","01","10","01"]
[{"$f":"I2631&\"-\"&J2631&\"-\"&K2631&\"-\"&L2631","v":"02-01-11-00"},4,null,14,2,1,11,0,"02","01","11","00"]
["02-02-00-10",5,null,14,2,2,0,10,{"$f":"IF(LEN(E2632)=1,0&E2632,IF(LEN(E2632)=0,\"00\",RIGHT(E2632,2)))","v":"02"},{"$f":"IF(LEN(F2632)=1,0&F2632,IF(LEN(F2632)=0,\"00\",RIGHT(F2632,2)))","v":"02"},{"$f":"IF(LEN(G2632)=1,0&G2632,IF(LEN(G2632)=0,\"00\",RIGHT(G2632,2)))","v":"00"},{"$f":"IF(LEN(H2632)=1,0&H2632,IF(LEN(H2632)=0,\"00\",RIGHT(H2632,2)))","v":"10"}]
["02-02-01-09",5,null,14,2,2,1,9,"02","02","01","09"]
["02-02-02-08",5,null,14,2,2,2,8,"02","02","02","08"]
["02-02-03-07",5,null,14,2,2,3,7,"02","02","03","07"]
["02-02-04-06",5,null,14,2,2,4,6,"02","02","04","06"]
["02-02-05-05",4,null,14,2,2,5,5,"02","02","05","05"]
["02-02-06-04",4,null,14,2,2,6,4,"02","02","06","04"]
["02-02-07-03",4,null,14,2,2,7,3,"02","02","07","03"]
["02-02-08-02",4,null,14,2,2,8,2,"02","02","08","02"]
["02-02-09-01",4,null,14,2,2,9,1,"02","02","09","01"]
["02-02-10-00",4,null,14,2,2,10,0,"02","02","10","00"]
["02-03-00-09",5,null,14,2,3,0,9,"02","03","00","09"]
["02-03-01-08",5,null,14,2,3,1,8,"02","03","01","08"]
["02-03-02-07",4,null,14,2,3,2,7,"02","03","02","07"]
["02-03-03-06",4,null,14,2,3,3,6,"02","03","03","06"]
["02-03-04-05",4,null,14,2,3,4,5,"02","03","04","05"]
["02-03-05-04",4,null,14,2,3,5,4,"02","03","05","04"]
["02-03-06-03",4,null,14,2,3,6,3,"02","03","06","03"]
["02-03-07-02",4,null,14,2,3,7,2,"02","03","07","02"]
["02-03-08-01",4,null,14,2,3,8,1,"02","03","08","01"]
["02-03-09-00",4,null,14,2,3,9,0,"02","03","09","00"]
["02-04-00-08",4,null,14,2,4,0,8,"02","04","00","08"]
["02-04-01-07",4,null,14,2,4,1,7,"02","04","01","07"]
["02-04-02-06",4,null,14,2,4,2,6,"02","04","02","06"]
["02-04-03-05",4,null,14,2,4,3,5,"02","04","03","05"]
["02-04-04-04",4,null,14,2,4,4,4,"02","04","04","04"]
["02-04-05-03",4,null,14,2,4,5,3,"02","04","05","03"]
["02-04-06-02",4,null,14,2,4,6,2,"02","04","06","02"]
["02-04-07-01",4,null,14,2,4,7,1,"02","04","07","01"]
["02-04-08-00",4,null,14,2,4,8,0,"02","04","08","00"]
["02-05-00-07",4,null,14,2,5,0,7,"02","05","00","07"]
["02-05-01-06",4,null,14,2,5,1,6,"02","05","01","06"]
["02-05-02-05",4,null,14,2,5,2,5,"02","05","02","05"]
["02-05-03-04",4,null,14,2,5,3,4,"02","05","03","04"]
["02-05-04-03",4,null,14,2,5,4,3,"02","05","04","03"]
["02-05-05-02",4,null,14,2,5,5,2,"02","05","05","02"]
["02-05-06-01",4,null,14,2,5,6,1,"02","05","06","01"]
["02-05-07-00",4,null,14,2,5,7,0,"02","05","07","00"]
["02-06-00-06",3,null,14,2,6,0,6,"02","06","00","06"]
["02-06-01-05",3,null,14,2,6,1,5,"02","06","01","05"]
["02-06-02-04",3,null,14,2,6,2,4,"02","06","02","04"]
["02-06-03-03",3,null,14,2,6,3,3,"02","06","03","03"]
["02-06-04-02",3,null,14,2,6,4,2,"02","06","04","02"]
["02-06-05-01",3,null,14,2,6,5,1,"02","06","05","01"]
["02-06-06-00",3,null,14,2,6,6,0,"02","06","06","00"]
["02-07-00-05",3,null,14,2,7,0,5,"02","07","00","05"]
["02-07-01-04",3,null,14,2,7,1,4,"02","07","01","04"]
["02-07-02-03",3,null,14,2,7,2,3,"02","07","02","03"]
["02-07-03-02",3,null,14,2,7,3,2,"02","07","03","02"]
["02-07-04-01",3,null,14,2,7,4,1,"02","07","04","01"]
["02-07-05-00",3,null,14,2,7,5,0,"02","07","05","00"]
["02-08-00-04",3,null,14,2,8,0,4,"02","08","00","04"]
["02-08-01-03",3,null,14,2,8,1,3,"02","08","01","03"]
["02-08-02-02",3,null,14,2,8,2,2,"02","08","02","02"]
["02-08-03-01",3,null,14,2,8,3,1,"02","08","03","01"]
["02-08-04-00",3,null,14,2,8,4,0,"02","08","04","00"]
["02-09-00-03",3,null,14,2,9,0,3,"02","09","00","03"]
["02-09-01-02",2,null,14,2,9,1,2,"02","09","01","02"]
["02-09-02-01",2,null,14,2,9,2,1,"02","09","02","01"]
["02-09-03-00",2,null,14,2,9,3,0,"02","09","03","00"]
["02-10-00-02",2,null,14,2,10,0,2,"02","10","00","02"]
["02-10-01-01",2,null,14,2,10,1,1,"02","10","01","01"]
["02-10-02-00",2,null,14,2,10,2,0,"02","10","02","00"]
[{"$f":"I2695&\"-\"&J2695&\"-\"&K2695&\"-\"&L2695","v":"02-11-00-01"},2,null,14,2,11,0,1,"02","11","00","01"]
["02-11-01-00",2,null,14,2,11,1,0,{"$f":"IF(LEN(E2696)=1,0&E2696,IF(LEN(E2696)=0,\"00\",RIGHT(E2696,2)))","v":"02"},{"$f":"IF(LEN(F2696)=1,0&F2696,IF(LEN(F2696)=0,\"00\",RIGHT(F2696,2)))","v":"11"},{"$f":"IF(LEN(G2696)=1,0&G2696,IF(LEN(G2696)=0,\"00\",RIGHT(G2696,2)))","v":"01"},{"$f":"IF(LEN(H2696)=1,0&H2696,IF(LEN(H2696)=0,\"00\",RIGHT(H2696,2)))","v":"00"}]
["02-12-00-00",2,null,14,2,12,0,0,"02","12","00","00"]
["03-00-00-11",5,null,14,3,0,0,11,"03","00","00","11"]
["03-00-01-10",5,null,14,3,0,1,10,"03","00","01","10"]
["03-00-02-09",5,null,14,3,0,2,9,"03","00","02","09"]
["03-00-03-08",5,null,14,3,0,3,8,"03","00","03","08"]
["03-00-04-07",5,null,14,3,0,4,7,"03","00","04","07"]
["03-00-05-06",5,null,14,3,0,5,6,"03","00","05","06"]
["03-00-06-05",4,null,14,3,0,6,5,"03","00","06","05"]
["03-00-07-04",4,null,14,3,0,7,4,"03","00","07","04"]
["03-00-08-03",4,null,14,3,0,8,3,"03","00","08","03"]
["03-00-09-02",4,null,14,3,0,9,2,"03","00","09","02"]
["03-00-10-01",4,null,14,3,0,10,1,"03","00","10","01"]
["03-00-11-00",4,null,14,3,0,11,0,"03","00","11","00"]
["03-01-00-10",5,null,14,3,1,0,10,"03","01","00","10"]
["03-01-01-09",5,null,14,3,1,1,9,"03","01","01","09"]
["03-01-02-08",5,null,14,3,1,2,8,"03","01","02","08"]
["03-01-03-07",4,null,14,3,1,3,7,"03","01","03","07"]
["03-01-04-06",4,null,14,3,1,4,6,"03","01","04","06"]
["03-01-05-05",4,null,14,3,1,5,5,"03","01","05","05"]
["03-01-06-04",4,null,14,3,1,6,4,"03","01","06","04"]
["03-01-07-03",4,null,14,3,1,7,3,"03","01","07","03"]
["03-01-08-02",4,null,14,3,1,8,2,"03","01","08","02"]
["03-01-09-01",4,null,14,3,1,9,1,"03","01","09","01"]
["03-01-10-00",4,null,14,3,1,10,0,"03","01","10","00"]
["03-02-00-09",5,null,14,3,2,0,9,"03","02","00","09"]
["03-02-01-08",4,null,14,3,2,1,8,"03","02","01","08"]
["03-02-02-07",4,null,14,3,2,2,7,"03","02","02","07"]
["03-02-03-06",4,null,14,3,2,3,6,"03","02","03","06"]
["03-02-04-05",4,null,14,3,2,4,5,"03","02","04","05"]
["03-02-05-04",4,null,14,3,2,5,4,"03","02","05","04"]
["03-02-06-03",4,null,14,3,2,6,3,"03","02","06","03"]
["03-02-07-02",4,null,14,3,2,7,2,"03","02","07","02"]
["03-02-08-01",4,null,14,3,2,8,1,"03","02","08","01"]
["03-02-09-00",4,null,14,3,2,9,0,"03","02","09","00"]
["03-03-00-08",4,null,14,3,3,0,8,"03","03","00","08"]
["03-03-01-07",4,null,14,3,3,1,7,"03","03","01","07"]
["03-03-02-06",4,null,14,3,3,2,6,"03","03","02","06"]
["03-03-03-05",4,null,14,3,3,3,5,"03","03","03","05"]
["03-03-04-04",4,null,14,3,3,4,4,"03","03","04","04"]
["03-03-05-03",4,null,14,3,3,5,3,"03","03","05","03"]
["03-03-06-02",4,null,14,3,3,6,2,"03","03","06","02"]
["03-03-07-01",4,null,14,3,3,7,1,"03","03","07","01"]
["03-03-08-00",4,null,14,3,3,8,0,"03","03","08","00"]
["03-04-00-07",4,null,14,3,4,0,7,"03","04","00","07"]
["03-04-01-06",4,null,14,3,4,1,6,"03","04","01","06"]
["03-04-02-05",4,null,14,3,4,2,5,"03","04","02","05"]
["03-04-03-04",4,null,14,3,4,3,4,"03","04","03","04"]
["03-04-04-03",4,null,14,3,4,4,3,"03","04","04","03"]
["03-04-05-02",4,null,14,3,4,5,2,"03","04","05","02"]
["03-04-06-01",4,null,14,3,4,6,1,"03","04","06","01"]
["03-04-07-00",4,null,14,3,4,7,0,"03","04","07","00"]
["03-05-00-06",3,null,14,3,5,0,6,"03","05","00","06"]
["03-05-01-05",3,null,14,3,5,1,5,"03","05","01","05"]
["03-05-02-04",3,null,14,3,5,2,4,"03","05","02","04"]
["03-05-03-03",3,null,14,3,5,3,3,"03","05","03","03"]
["03-05-04-02",3,null,14,3,5,4,2,"03","05","04","02"]
["03-05-05-01",3,null,14,3,5,5,1,"03","05","05","01"]
["03-05-06-00",3,null,14,3,5,6,0,"03","05","06","00"]
["03-06-00-05",3,null,14,3,6,0,5,"03","06","00","05"]
["03-06-01-04",3,null,14,3,6,1,4,"03","06","01","04"]
["03-06-02-03",3,null,14,3,6,2,3,"03","06","02","03"]
["03-06-03-02",3,null,14,3,6,3,2,"03","06","03","02"]
[{"$f":"I2759&\"-\"&J2759&\"-\"&K2759&\"-\"&L2759","v":"03-06-04-01"},3,null,14,3,6,4,1,"03","06","04","01"]
["03-06-05-00",3,null,14,3,6,5,0,{"$f":"IF(LEN(E2760)=1,0&E2760,IF(LEN(E2760)=0,\"00\",RIGHT(E2760,2)))","v":"03"},{"$f":"IF(LEN(F2760)=1,0&F2760,IF(LEN(F2760)=0,\"00\",RIGHT(F2760,2)))","v":"06"},{"$f":"IF(LEN(G2760)=1,0&G2760,IF(LEN(G2760)=0,\"00\",RIGHT(G2760,2)))","v":"05"},{"$f":"IF(LEN(H2760)=1,0&H2760,IF(LEN(H2760)=0,\"00\",RIGHT(H2760,2)))","v":"00"}]
["03-07-00-04",3,null,14,3,7,0,4,"03","07","00","04"]
["03-07-01-03",3,null,14,3,7,1,3,"03","07","01","03"]
["03-07-02-02",3,null,14,3,7,2,2,"03","07","02","02"]
["03-07-03-01",3,null,14,3,7,3,1,"03","07","03","01"]
["03-07-04-00",3,null,14,3,7,4,0,"03","07","04","00"]
["03-08-00-03",3,null,14,3,8,0,3,"03","08","00","03"]
["03-08-01-02",2,null,14,3,8,1,2,"03","08","01","02"]
["03-08-02-01",2,null,14,3,8,2,1,"03","08","02","01"]
["03-08-03-00",2,null,14,3,8,3,0,"03","08","03","00"]
["03-09-00-02",2,null,14,3,9,0,2,"03","09","00","02"]
["03-09-01-01",2,null,14,3,9,1,1,"03","09","01","01"]
["03-09-02-00",2,null,14,3,9,2,0,"03","09","02","00"]
["03-10-00-01",2,null,14,3,10,0,1,"03","10","00","01"]
["03-10-01-00",2,null,14,3,10,1,0,"03","10","01","00"]
["03-11-00-00",2,null,14,3,11,0,0,"03","11","00","00"]
["04-00-00-10",5,null,14,4,0,0,10,"04","00","00","10"]
["04-00-01-09",5,null,14,4,0,1,9,"04","00","01","09"]
["04-00-02-08",4,null,14,4,0,2,8,"04","00","02","08"]
["04-00-03-07",4,null,14,4,0,3,7,"04","00","03","07"]
["04-00-04-06",4,null,14,4,0,4,6,"04","00","04","06"]
["04-00-05-05",4,null,14,4,0,5,5,"04","00","05","05"]
["04-00-06-04",4,null,14,4,0,6,4,"04","00","06","04"]
["04-00-07-03",4,null,14,4,0,7,3,"04","00","07","03"]
["04-00-08-02",4,null,14,4,0,8,2,"04","00","08","02"]
["04-00-09-01",4,null,14,4,0,9,1,"04","00","09","01"]
["04-00-10-00",4,null,14,4,0,10,0,"04","00","10","00"]
["04-01-00-09",4,null,14,4,1,0,9,"04","01","00","09"]
["04-01-01-08",4,null,14,4,1,1,8,"04","01","01","08"]
["04-01-02-07",4,null,14,4,1,2,7,"04","01","02","07"]
["04-01-03-06",4,null,14,4,1,3,6,"04","01","03","06"]
["04-01-04-05",4,null,14,4,1,4,5,"04","01","04","05"]
["04-01-05-04",4,null,14,4,1,5,4,"04","01","05","04"]
["04-01-06-03",4,null,14,4,1,6,3,"04","01","06","03"]
["04-01-07-02",4,null,14,4,1,7,2,"04","01","07","02"]
["04-01-08-01",4,null,14,4,1,8,1,"04","01","08","01"]
["04-01-09-00",4,null,14,4,1,9,0,"04","01","09","00"]
["04-02-00-08",4,null,14,4,2,0,8,"04","02","00","08"]
["04-02-01-07",4,null,14,4,2,1,7,"04","02","01","07"]
["04-02-02-06",4,null,14,4,2,2,6,"04","02","02","06"]
["04-02-03-05",4,null,14,4,2,3,5,"04","02","03","05"]
["04-02-04-04",4,null,14,4,2,4,4,"04","02","04","04"]
["04-02-05-03",4,null,14,4,2,5,3,"04","02","05","03"]
["04-02-06-02",4,null,14,4,2,6,2,"04","02","06","02"]
["04-02-07-01",4,null,14,4,2,7,1,"04","02","07","01"]
["04-02-08-00",4,null,14,4,2,8,0,"04","02","08","00"]
["04-03-00-07",4,null,14,4,3,0,7,"04","03","00","07"]
["04-03-01-06",4,null,14,4,3,1,6,"04","03","01","06"]
["04-03-02-05",4,null,14,4,3,2,5,"04","03","02","05"]
["04-03-03-04",4,null,14,4,3,3,4,"04","03","03","04"]
["04-03-04-03",4,null,14,4,3,4,3,"04","03","04","03"]
["04-03-05-02",4,null,14,4,3,5,2,"04","03","05","02"]
["04-03-06-01",4,null,14,4,3,6,1,"04","03","06","01"]
["04-03-07-00",4,null,14,4,3,7,0,"04","03","07","00"]
["04-04-00-06",3,null,14,4,4,0,6,"04","04","00","06"]
["04-04-01-05",3,null,14,4,4,1,5,"04","04","01","05"]
["04-04-02-04",3,null,14,4,4,2,4,"04","04","02","04"]
["04-04-03-03",4,null,14,4,4,3,3,"04","04","03","03"]
["04-04-04-02",3,null,14,4,4,4,2,"04","04","04","02"]
["04-04-05-01",3,null,14,4,4,5,1,"04","04","05","01"]
["04-04-06-00",3,null,14,4,4,6,0,"04","04","06","00"]
["04-05-00-05",3,null,14,4,5,0,5,"04","05","00","05"]
["04-05-01-04",3,null,14,4,5,1,4,"04","05","01","04"]
[{"$f":"I2823&\"-\"&J2823&\"-\"&K2823&\"-\"&L2823","v":"04-05-02-03"},3,null,14,4,5,2,3,"04","05","02","03"]
["04-05-03-02",3,null,14,4,5,3,2,{"$f":"IF(LEN(E2824)=1,0&E2824,IF(LEN(E2824)=0,\"00\",RIGHT(E2824,2)))","v":"04"},{"$f":"IF(LEN(F2824)=1,0&F2824,IF(LEN(F2824)=0,\"00\",RIGHT(F2824,2)))","v":"05"},{"$f":"IF(LEN(G2824)=1,0&G2824,IF(LEN(G2824)=0,\"00\",RIGHT(G2824,2)))","v":"03"},{"$f":"IF(LEN(H2824)=1,0&H2824,IF(LEN(H2824)=0,\"00\",RIGHT(H2824,2)))","v":"02"}]
["04-05-04-01",3,null,14,4,5,4,1,"04","05","04","01"]
["04-05-05-00",3,null,14,4,5,5,0,"04","05","05","00"]
["04-06-00-04",3,null,14,4,6,0,4,"04","06","00","04"]
["04-06-01-03",3,null,14,4,6,1,3,"04","06","01","03"]
["04-06-02-02",3,null,14,4,6,2,2,"04","06","02","02"]
["04-06-03-01",3,null,14,4,6,3,1,"04","06","03","01"]
["04-06-04-00",3,null,14,4,6,4,0,"04","06","04","00"]
["04-07-00-03",3,null,14,4,7,0,3,"04","07","00","03"]
["04-07-01-02",2,null,14,4,7,1,2,"04","07","01","02"]
["04-07-02-01",2,null,14,4,7,2,1,"04","07","02","01"]
["04-07-03-00",2,null,14,4,7,3,0,"04","07","03","00"]
["04-08-00-02",2,null,14,4,8,0,2,"04","08","00","02"]
["04-08-01-01",2,null,14,4,8,1,1,"04","08","01","01"]
["04-08-02-00",2,null,14,4,8,2,0,"04","08","02","00"]
["04-09-00-01",2,null,14,4,9,0,1,"04","09","00","01"]
["04-09-01-00",2,null,14,4,9,1,0,"04","09","01","00"]
["04-10-00-00",2,null,14,4,10,0,0,"04","10","00","00"]
["05-00-00-09",4,null,14,5,0,0,9,"05","00","00","09"]
["05-00-01-08",4,null,14,5,0,1,8,"05","00","01","08"]
["05-00-02-07",4,null,14,5,0,2,7,"05","00","02","07"]
["05-00-03-06",4,null,14,5,0,3,6,"05","00","03","06"]
["05-00-04-05",4,null,14,5,0,4,5,"05","00","04","05"]
["05-00-05-04",4,null,14,5,0,5,4,"05","00","05","04"]
["05-00-06-03",4,null,14,5,0,6,3,"05","00","06","03"]
["05-00-07-02",4,null,14,5,0,7,2,"05","00","07","02"]
["05-00-08-01",4,null,14,5,0,8,1,"05","00","08","01"]
["05-00-09-00",4,null,14,5,0,9,0,"05","00","09","00"]
["05-01-00-08",4,null,14,5,1,0,8,"05","01","00","08"]
["05-01-01-07",4,null,14,5,1,1,7,"05","01","01","07"]
["05-01-02-06",4,null,14,5,1,2,6,"05","01","02","06"]
["05-01-03-05",4,null,14,5,1,3,5,"05","01","03","05"]
["05-01-04-04",4,null,14,5,1,4,4,"05","01","04","04"]
["05-01-05-03",4,null,14,5,1,5,3,"05","01","05","03"]
["05-01-06-02",4,null,14,5,1,6,2,"05","01","06","02"]
["05-01-07-01",4,null,14,5,1,7,1,"05","01","07","01"]
["05-01-08-00",4,null,14,5,1,8,0,"05","01","08","00"]
["05-02-00-07",4,null,14,5,2,0,7,"05","02","00","07"]
["05-02-01-06",4,null,14,5,2,1,6,"05","02","01","06"]
["05-02-02-05",4,null,14,5,2,2,5,"05","02","02","05"]
["05-02-03-04",4,null,14,5,2,3,4,"05","02","03","04"]
["05-02-04-03",4,null,14,5,2,4,3,"05","02","04","03"]
["05-02-05-02",4,null,14,5,2,5,2,"05","02","05","02"]
["05-02-06-01",4,null,14,5,2,6,1,"05","02","06","01"]
["05-02-07-00",3,null,14,5,2,7,0,"05","02","07","00"]
["05-03-00-06",3,null,14,5,3,0,6,"05","03","00","06"]
["05-03-01-05",3,null,14,5,3,1,5,"05","03","01","05"]
["05-03-02-04",3,null,14,5,3,2,4,"05","03","02","04"]
["05-03-03-03",3,null,14,5,3,3,3,"05","03","03","03"]
["05-03-04-02",3,null,14,5,3,4,2,"05","03","04","02"]
["05-03-05-01",3,null,14,5,3,5,1,"05","03","05","01"]
["05-03-06-00",3,null,14,5,3,6,0,"05","03","06","00"]
["05-04-00-05",3,null,14,5,4,0,5,"05","04","00","05"]
["05-04-01-04",3,null,14,5,4,1,4,"05","04","01","04"]
["05-04-02-03",3,null,14,5,4,2,3,"05","04","02","03"]
["05-04-03-02",3,null,14,5,4,3,2,"05","04","03","02"]
["05-04-04-01",3,null,14,5,4,4,1,"05","04","04","01"]
["05-04-05-00",3,null,14,5,4,5,0,"05","04","05","00"]
["05-05-00-04",3,null,14,5,5,0,4,"05","05","00","04"]
["05-05-01-03",3,null,14,5,5,1,3,"05","05","01","03"]
["05-05-02-02",3,null,14,5,5,2,2,"05","05","02","02"]
["05-05-03-01",3,null,14,5,5,3,1,"05","05","03","01"]
["05-05-04-00",3,null,14,5,5,4,0,"05","05","04","00"]
[{"$f":"I2887&\"-\"&J2887&\"-\"&K2887&\"-\"&L2887","v":"05-06-00-03"},3,null,14,5,6,0,3,"05","06","00","03"]
["05-06-01-02",2,null,14,5,6,1,2,{"$f":"IF(LEN(E2888)=1,0&E2888,IF(LEN(E2888)=0,\"00\",RIGHT(E2888,2)))","v":"05"},{"$f":"IF(LEN(F2888)=1,0&F2888,IF(LEN(F2888)=0,\"00\",RIGHT(F2888,2)))","v":"06"},{"$f":"IF(LEN(G2888)=1,0&G2888,IF(LEN(G2888)=0,\"00\",RIGHT(G2888,2)))","v":"01"},{"$f":"IF(LEN(H2888)=1,0&H2888,IF(LEN(H2888)=0,\"00\",RIGHT(H2888,2)))","v":"02"}]
["05-06-02-01",2,null,14,5,6,2,1,"05","06","02","01"]
["05-06-03-00",2,null,14,5,6,3,0,"05","06","03","00"]
["05-07-00-02",2,null,14,5,7,0,2,"05","07","00","02"]
["05-07-01-01",2,null,14,5,7,1,1,"05","07","01","01"]
["05-07-02-00",2,null,14,5,7,2,0,"05","07","02","00"]
["05-08-00-01",2,null,14,5,8,0,1,"05","08","00","01"]
["05-08-01-00",2,null,14,5,8,1,0,"05","08","01","00"]
["05-09-00-00",2,null,14,5,9,0,0,"05","09","00","00"]
["06-00-00-08",4,null,14,6,0,0,8,"06","00","00","08"]
["06-00-01-07",4,null,14,6,0,1,7,"06","00","01","07"]
["06-00-02-06",4,null,14,6,0,2,6,"06","00","02","06"]
["06-00-03-05",4,null,14,6,0,3,5,"06","00","03","05"]
["06-00-04-04",4,null,14,6,0,4,4,"06","00","04","04"]
["06-00-05-03",4,null,14,6,0,5,3,"06","00","05","03"]
["06-00-06-02",4,null,14,6,0,6,2,"06","00","06","02"]
["06-00-07-01",4,null,14,6,0,7,1,"06","00","07","01"]
["06-00-08-00",3,null,14,6,0,8,0,"06","00","08","00"]
["06-01-00-07",4,null,14,6,1,0,7,"06","01","00","07"]
["06-01-01-06",4,null,14,6,1,1,6,"06","01","01","06"]
["06-01-02-05",4,null,14,6,1,2,5,"06","01","02","05"]
["06-01-03-04",4,null,14,6,1,3,4,"06","01","03","04"]
["06-01-04-03",4,null,14,6,1,4,3,"06","01","04","03"]
["06-01-05-02",3,null,14,6,1,5,2,"06","01","05","02"]
["06-01-06-01",3,null,14,6,1,6,1,"06","01","06","01"]
["06-01-07-00",3,null,14,6,1,7,0,"06","01","07","00"]
["06-02-00-06",3,null,14,6,2,0,6,"06","02","00","06"]
["06-02-01-05",3,null,14,6,2,1,5,"06","02","01","05"]
["06-02-02-04",3,null,14,6,2,2,4,"06","02","02","04"]
["06-02-03-03",3,null,14,6,2,3,3,"06","02","03","03"]
["06-02-04-02",3,null,14,6,2,4,2,"06","02","04","02"]
["06-02-05-01",3,null,14,6,2,5,1,"06","02","05","01"]
["06-02-06-00",3,null,14,6,2,6,0,"06","02","06","00"]
["06-03-00-05",3,null,14,6,3,0,5,"06","03","00","05"]
["06-03-01-04",3,null,14,6,3,1,4,"06","03","01","04"]
["06-03-02-03",3,null,14,6,3,2,3,"06","03","02","03"]
["06-03-03-02",3,null,14,6,3,3,2,"06","03","03","02"]
["06-03-04-01",3,null,14,6,3,4,1,"06","03","04","01"]
["06-03-05-00",3,null,14,6,3,5,0,"06","03","05","00"]
["06-04-00-04",3,null,14,6,4,0,4,"06","04","00","04"]
["06-04-01-03",3,null,14,6,4,1,3,"06","04","01","03"]
["06-04-02-02",3,null,14,6,4,2,2,"06","04","02","02"]
["06-04-03-01",3,null,14,6,4,3,1,"06","04","03","01"]
["06-04-04-00",3,null,14,6,4,4,0,"06","04","04","00"]
["06-05-00-03",3,null,14,6,5,0,3,"06","05","00","03"]
["06-05-01-02",2,null,14,6,5,1,2,"06","05","01","02"]
["06-05-02-01",2,null,14,6,5,2,1,"06","05","02","01"]
["06-05-03-00",2,null,14,6,5,3,0,"06","05","03","00"]
["06-06-00-02",2,null,14,6,6,0,2,"06","06","00","02"]
["06-06-01-01",2,null,14,6,6,1,1,"06","06","01","01"]
["06-06-02-00",2,null,14,6,6,2,0,"06","06","02","00"]
["06-07-00-01",2,null,14,6,7,0,1,"06","07","00","01"]
["06-07-01-00",2,null,14,6,7,1,0,"06","07","01","00"]
["06-08-00-00",2,null,14,6,8,0,0,"06","08","00","00"]
["07-00-00-07",4,null,14,7,0,0,7,"07","00","00","07"]
["07-00-01-06",4,null,14,7,0,1,6,"07","00","01","06"]
["07-00-02-05",4,null,14,7,0,2,5,"07","00","02","05"]
["07-00-03-04",4,null,14,7,0,3,4,"07","00","03","04"]
["07-00-04-03",3,null,14,7,0,4,3,"07","00","04","03"]
["07-00-05-02",3,null,14,7,0,5,2,"07","00","05","02"]
["07-00-06-01",3,null,14,7,0,6,1,"07","00","06","01"]
["07-00-07-00",3,null,14,7,0,7,0,"07","00","07","00"]
["07-01-00-06",3,null,14,7,1,0,6,"07","01","00","06"]
[{"$f":"I2951&\"-\"&J2951&\"-\"&K2951&\"-\"&L2951","v":"07-01-01-05"},3,null,14,7,1,1,5,"07","01","01","05"]
["07-01-02-04",3,null,14,7,1,2,4,{"$f":"IF(LEN(E2952)=1,0&E2952,IF(LEN(E2952)=0,\"00\",RIGHT(E2952,2)))","v":"07"},{"$f":"IF(LEN(F2952)=1,0&F2952,IF(LEN(F2952)=0,\"00\",RIGHT(F2952,2)))","v":"01"},{"$f":"IF(LEN(G2952)=1,0&G2952,IF(LEN(G2952)=0,\"00\",RIGHT(G2952,2)))","v":"02"},{"$f":"IF(LEN(H2952)=1,0&H2952,IF(LEN(H2952)=0,\"00\",RIGHT(H2952,2)))","v":"04"}]
["07-01-03-03",3,null,14,7,1,3,3,"07","01","03","03"]
["07-01-04-02",3,null,14,7,1,4,2,"07","01","04","02"]
["07-01-05-01",3,null,14,7,1,5,1,"07","01","05","01"]
["07-01-06-00",3,null,14,7,1,6,0,"07","01","06","00"]
["07-02-00-05",3,null,14,7,2,0,5,"07","02","00","05"]
["07-02-01-04",3,null,14,7,2,1,4,"07","02","01","04"]
["07-02-02-03",3,null,14,7,2,2,3,"07","02","02","03"]
["07-02-03-02",3,null,14,7,2,3,2,"07","02","03","02"]
["07-02-04-01",3,null,14,7,2,4,1,"07","02","04","01"]
["07-02-05-00",3,null,14,7,2,5,0,"07","02","05","00"]
["07-03-00-04",3,null,14,7,3,0,4,"07","03","00","04"]
["07-03-01-03",3,null,14,7,3,1,3,"07","03","01","03"]
["07-03-02-02",3,null,14,7,3,2,2,"07","03","02","02"]
["07-03-03-01",3,null,14,7,3,3,1,"07","03","03","01"]
["07-03-04-00",3,null,14,7,3,4,0,"07","03","04","00"]
["07-04-00-03",3,null,14,7,4,0,3,"07","04","00","03"]
["07-04-01-02",2,null,14,7,4,1,2,"07","04","01","02"]
["07-04-02-01",2,null,14,7,4,2,1,"07","04","02","01"]
["07-04-03-00",2,null,14,7,4,3,0,"07","04","03","00"]
["07-05-00-02",2,null,14,7,5,0,2,"07","05","00","02"]
["07-05-01-01",2,null,14,7,5,1,1,"07","05","01","01"]
["07-05-02-00",2,null,14,7,5,2,0,"07","05","02","00"]
["07-06-00-01",2,null,14,7,6,0,1,"07","06","00","01"]
["07-06-01-00",2,null,14,7,6,1,0,"07","06","01","00"]
["07-07-00-00",2,null,14,7,7,0,0,"07","07","00","00"]
["08-00-00-06",3,null,14,8,0,0,6,"08","00","00","06"]
["08-00-01-05",3,null,14,8,0,1,5,"08","00","01","05"]
["08-00-02-04",3,null,14,8,0,2,4,"08","00","02","04"]
["08-00-03-03",3,null,14,8,0,3,3,"08","00","03","03"]
["08-00-04-02",3,null,14,8,0,4,2,"08","00","04","02"]
["08-00-05-01",3,null,14,8,0,5,1,"08","00","05","01"]
["08-00-06-00",3,null,14,8,0,6,0,"08","00","06","00"]
["08-01-00-05",3,null,14,8,1,0,5,"08","01","00","05"]
["08-01-01-04",3,null,14,8,1,1,4,"08","01","01","04"]
["08-01-02-03",3,null,14,8,1,2,3,"08","01","02","03"]
["08-01-03-02",3,null,14,8,1,3,2,"08","01","03","02"]
["08-01-04-01",3,null,14,8,1,4,1,"08","01","04","01"]
["08-01-05-00",3,null,14,8,1,5,0,"08","01","05","00"]
["08-02-00-04",3,null,14,8,2,0,4,"08","02","00","04"]
["08-02-01-03",3,null,14,8,2,1,3,"08","02","01","03"]
["08-02-02-02",3,null,14,8,2,2,2,"08","02","02","02"]
["08-02-03-01",3,null,14,8,2,3,1,"08","02","03","01"]
["08-02-04-00",3,null,14,8,2,4,0,"08","02","04","00"]
["08-03-00-03",3,null,14,8,3,0,3,"08","03","00","03"]
["08-03-01-02",2,null,14,8,3,1,2,"08","03","01","02"]
["08-03-02-01",2,null,14,8,3,2,1,"08","03","02","01"]
["08-03-03-00",2,null,14,8,3,3,0,"08","03","03","00"]
["08-04-00-02",2,null,14,8,4,0,2,"08","04","00","02"]
["08-04-01-01",2,null,14,8,4,1,1,"08","04","01","01"]
["08-04-02-00",2,null,14,8,4,2,0,"08","04","02","00"]
["08-05-00-01",2,null,14,8,5,0,1,"08","05","00","01"]
["08-05-01-00",2,null,14,8,5,1,0,"08","05","01","00"]
["08-06-00-00",2,null,14,8,6,0,0,"08","06","00","00"]
["09-00-00-05",3,null,14,9,0,0,5,"09","00","00","05"]
["09-00-01-04",3,null,14,9,0,1,4,"09","00","01","04"]
["09-00-02-03",3,null,14,9,0,2,3,"09","00","02","03"]
["09-00-03-02",3,null,14,9,0,3,2,"09","00","03","02"]
["09-00-04-01",3,null,14,9,0,4,1,"09","00","04","01"]
["09-00-05-00",3,null,14,9,0,5,0,"09","00","05","00"]
["09-01-00-04",3,null,14,9,1,0,4,"09","01","00","04"]
["09-01-01-03",3,null,14,9,1,1,3,"09","01","01","03"]
["09-01-02-02",3,null,14,9,1,2,2,"09","01","02","02"]
[{"$f":"I3015&\"-\"&J3015&\"-\"&K3015&\"-\"&L3015","v":"09-01-03-01"},3,null,14,9,1,3,1,"09","01","03","01"]
["09-01-04-00",3,null,14,9,1,4,0,{"$f":"IF(LEN(E3016)=1,0&E3016,IF(LEN(E3016)=0,\"00\",RIGHT(E3016,2)))","v":"09"},{"$f":"IF(LEN(F3016)=1,0&F3016,IF(LEN(F3016)=0,\"00\",RIGHT(F3016,2)))","v":"01"},{"$f":"IF(LEN(G3016)=1,0&G3016,IF(LEN(G3016)=0,\"00\",RIGHT(G3016,2)))","v":"04"},{"$f":"IF(LEN(H3016)=1,0&H3016,IF(LEN(H3016)=0,\"00\",RIGHT(H3016,2)))","v":"00"}]
["09-02-00-03",3,null,14,9,2,0,3,"09","02","00","03"]
["09-02-01-02",2,null,14,9,2,1,2,"09","02","01","02"]
["09-02-02-01",2,null,14,9,2,2,1,"09","02","02","01"]
["09-02-03-00",2,null,14,9,2,3,0,"09","02","03","00"]
["09-03-00-02",2,null,14,9,3,0,2,"09","03","00","02"]
["09-03-01-01",2,null,14,9,3,1,1,"09","03","01","01"]
["09-03-02-00",2,null,14,9,3,2,0,"09","03","02","00"]
["09-04-00-01",2,null,14,9,4,0,1,"09","04","00","01"]
["09-04-01-00",2,null,14,9,4,1,0,"09","04","01","00"]
["09-05-00-00",2,null,14,9,5,0,0,"09","05","00","00"]
["10-00-00-04",3,null,14,10,0,0,4,"10","00","00","04"]
["10-00-01-03",3,null,14,10,0,1,3,"10","00","01","03"]
["10-00-02-02",3,null,14,10,0,2,2,"10","00","02","02"]
["10-00-03-01",3,null,14,10,0,3,1,"10","00","03","01"]
["10-00-04-00",3,null,14,10,0,4,0,"10","00","04","00"]
["10-01-00-03",3,null,14,10,1,0,3,"10","01","00","03"]
["10-01-01-02",2,null,14,10,1,1,2,"10","01","01","02"]
["10-01-02-01",2,null,14,10,1,2,1,"10","01","02","01"]
["10-01-03-00",2,null,14,10,1,3,0,"10","01","03","00"]
["10-02-00-02",2,null,14,10,2,0,2,"10","02","00","02"]
["10-02-01-01",2,null,14,10,2,1,1,"10","02","01","01"]
["10-02-02-00",2,null,14,10,2,2,0,"10","02","02","00"]
["10-03-00-01",2,null,14,10,3,0,1,"10","03","00","01"]
["10-03-01-00",2,null,14,10,3,1,0,"10","03","01","00"]
["10-04-00-00",2,null,14,10,4,0,0,"10","04","00","00"]
["11-00-00-03",3,null,14,11,0,0,3,"11","00","00","03"]
["11-00-01-02",2,null,14,11,0,1,2,"11","00","01","02"]
["11-00-02-01",2,null,14,11,0,2,1,"11","00","02","01"]
["11-00-03-00",2,null,14,11,0,3,0,"11","00","03","00"]
["11-01-00-02",2,null,14,11,1,0,2,"11","01","00","02"]
["11-01-01-01",2,null,14,11,1,1,1,"11","01","01","01"]
["11-01-02-00",2,null,14,11,1,2,0,"11","01","02","00"]
["11-02-00-01",2,null,14,11,2,0,1,"11","02","00","01"]
["11-02-01-00",2,null,14,11,2,1,0,"11","02","01","00"]
["11-03-00-00",2,null,14,11,3,0,0,"11","03","00","00"]
["12-00-00-02",2,null,14,12,0,0,2,"12","00","00","02"]
["12-00-01-01",2,null,14,12,0,1,1,"12","00","01","01"]
["12-00-02-00",2,null,14,12,0,2,0,"12","00","02","00"]
["12-01-00-01",2,null,14,12,1,0,1,"12","01","00","01"]
["12-01-01-00",2,null,14,12,1,1,0,"12","01","01","00"]
["12-02-00-00",2,null,14,12,2,0,0,"12","02","00","00"]
["13-00-00-01",2,null,14,13,0,0,1,"13","00","00","01"]
["13-00-01-00",2,null,14,13,0,1,0,"13","00","01","00"]
["13-01-00-00",2,null,14,13,1,0,0,"13","01","00","00"]
["14-00-00-00",1,null,14,14,0,0,0,"14","00","00","00"]
["00-00-00-15",7,null,15,0,0,0,15,"00","00","00","15"]
["00-00-01-14",6,null,15,0,0,1,14,"00","00","01","14"]
["00-00-02-13",6,null,15,0,0,2,13,"00","00","02","13"]
["00-00-03-12",6,null,15,0,0,3,12,"00","00","03","12"]
["00-00-04-11",6,null,15,0,0,4,11,"00","00","04","11"]
["00-00-05-10",6,null,15,0,0,5,10,"00","00","05","10"]
["00-00-06-09",6,null,15,0,0,6,9,"00","00","06","09"]
["00-00-07-08",6,null,15,0,0,7,8,"00","00","07","08"]
["00-00-08-07",5,null,15,0,0,8,7,"00","00","08","07"]
["00-00-09-06",5,null,15,0,0,9,6,"00","00","09","06"]
["00-00-10-05",5,null,15,0,0,10,5,"00","00","10","05"]
["00-00-11-04",5,null,15,0,0,11,4,"00","00","11","04"]
["00-00-12-03",5,null,15,0,0,12,3,"00","00","12","03"]
["00-00-13-02",4,null,15,0,0,13,2,"00","00","13","02"]
["00-00-14-01",4,null,15,0,0,14,1,"00","00","14","01"]
["00-00-15-00",4,null,15,0,0,15,0,"00","00","15","00"]
["00-01-00-14",5,null,15,0,1,0,14,"00","01","00","14"]
[{"$f":"I3079&\"-\"&J3079&\"-\"&K3079&\"-\"&L3079","v":"00-01-01-13"},5,null,15,0,1,1,13,"00","01","01","13"]
["00-01-02-12",5,null,15,0,1,2,12,{"$f":"IF(LEN(E3080)=1,0&E3080,IF(LEN(E3080)=0,\"00\",RIGHT(E3080,2)))","v":"00"},{"$f":"IF(LEN(F3080)=1,0&F3080,IF(LEN(F3080)=0,\"00\",RIGHT(F3080,2)))","v":"01"},{"$f":"IF(LEN(G3080)=1,0&G3080,IF(LEN(G3080)=0,\"00\",RIGHT(G3080,2)))","v":"02"},{"$f":"IF(LEN(H3080)=1,0&H3080,IF(LEN(H3080)=0,\"00\",RIGHT(H3080,2)))","v":"12"}]
["00-01-03-11",5,null,15,0,1,3,11,"00","01","03","11"]
["00-01-04-10",5,null,15,0,1,4,10,"00","01","04","10"]
["00-01-05-09",5,null,15,0,1,5,9,"00","01","05","09"]
["00-01-06-08",5,null,15,0,1,6,8,"00","01","06","08"]
["00-01-07-07",5,null,15,0,1,7,7,"00","01","07","07"]
["00-01-08-06",5,null,15,0,1,8,6,"00","01","08","06"]
["00-01-09-05",5,null,15,0,1,9,5,"00","01","09","05"]
["00-01-10-04",5,null,15,0,1,10,4,"00","01","10","04"]
["00-01-11-03",5,null,15,0,1,11,3,"00","01","11","03"]
["00-01-12-02",4,null,15,0,1,12,2,"00","01","12","02"]
["00-01-13-01",4,null,15,0,1,13,1,"00","01","13","01"]
["00-01-14-00",4,null,15,0,1,14,0,"00","01","14","00"]
["00-02-00-13",5,null,15,0,2,0,13,"00","02","00","13"]
["00-02-01-12",5,null,15,0,2,1,12,"00","02","01","12"]
["00-02-02-11",5,null,15,0,2,2,11,"00","02","02","11"]
["00-02-03-10",5,null,15,0,2,3,10,"00","02","03","10"]
["00-02-04-09",5,null,15,0,2,4,9,"00","02","04","09"]
["00-02-05-08",5,null,15,0,2,5,8,"00","02","05","08"]
["00-02-06-07",5,null,15,0,2,6,7,"00","02","06","07"]
["00-02-07-06",5,null,15,0,2,7,6,"00","02","07","06"]
["00-02-08-05",5,null,15,0,2,8,5,"00","02","08","05"]
["00-02-09-04",5,null,15,0,2,9,4,"00","02","09","04"]
["00-02-10-03",5,null,15,0,2,10,3,"00","02","10","03"]
["00-02-11-02",4,null,15,0,2,11,2,"00","02","11","02"]
["00-02-12-01",4,null,15,0,2,12,1,"00","02","12","01"]
["00-02-13-00",4,null,15,0,2,13,0,"00","02","13","00"]
["00-03-00-12",5,null,15,0,3,0,12,"00","03","00","12"]
["00-03-01-11",5,null,15,0,3,1,11,"00","03","01","11"]
["00-03-02-10",5,null,15,0,3,2,10,"00","03","02","10"]
["00-03-03-09",5,null,15,0,3,3,9,"00","03","03","09"]
["00-03-04-08",5,null,15,0,3,4,8,"00","03","04","08"]
["00-03-05-07",5,null,15,0,3,5,7,"00","03","05","07"]
["00-03-06-06",5,null,15,0,3,6,6,"00","03","06","06"]
["00-03-07-05",5,null,15,0,3,7,5,"00","03","07","05"]
["00-03-08-04",5,null,15,0,3,8,4,"00","03","08","04"]
["00-03-09-03",5,null,15,0,3,9,3,"00","03","09","03"]
["00-03-10-02",4,null,15,0,3,10,2,"00","03","10","02"]
["00-03-11-01",4,null,15,0,3,11,1,"00","03","11","01"]
["00-03-12-00",4,null,15,0,3,12,0,"00","03","12","00"]
["00-04-00-11",5,null,15,0,4,0,11,"00","04","00","11"]
["00-04-01-10",5,null,15,0,4,1,10,"00","04","01","10"]
["00-04-02-09",5,null,15,0,4,2,9,"00","04","02","09"]
["00-04-03-08",5,null,15,0,4,3,8,"00","04","03","08"]
["00-04-04-07",5,null,15,0,4,4,7,"00","04","04","07"]
["00-04-05-06",5,null,15,0,4,5,6,"00","04","05","06"]
["00-04-06-05",5,null,15,0,4,6,5,"00","04","06","05"]
["00-04-07-04",5,null,15,0,4,7,4,"00","04","07","04"]
["00-04-08-03",5,null,15,0,4,8,3,"00","04","08","03"]
["00-04-09-02",4,null,15,0,4,9,2,"00","04","09","02"]
["00-04-10-01",4,null,15,0,4,10,1,"00","04","10","01"]
["00-04-11-00",4,null,15,0,4,11,0,"00","04","11","00"]
["00-05-00-10",5,null,15,0,5,0,10,"00","05","00","10"]
["00-05-01-09",5,null,15,0,5,1,9,"00","05","01","09"]
["00-05-02-08",5,null,15,0,5,2,8,"00","05","02","08"]
["00-05-03-07",5,null,15,0,5,3,7,"00","05","03","07"]
["00-05-04-06",5,null,15,0,5,4,6,"00","05","04","06"]
["00-05-05-05",5,null,15,0,5,5,5,"00","05","05","05"]
["00-05-06-04",4,null,15,0,5,6,4,"00","05","06","04"]
["00-05-07-03",4,null,15,0,5,7,3,"00","05","07","03"]
["00-05-08-02",4,null,15,0,5,8,2,"00","05","08","02"]
["00-05-09-01",4,null,15,0,5,9,1,"00","05","09","01"]
["00-05-10-00",4,null,15,0,5,10,0,"00","05","10","00"]
[{"$f":"I3143&\"-\"&J3143&\"-\"&K3143&\"-\"&L3143","v":"00-06-00-09"},5,null,15,0,6,0,9,"00","06","00","09"]
["00-06-01-08",5,null,15,0,6,1,8,{"$f":"IF(LEN(E3144)=1,0&E3144,IF(LEN(E3144)=0,\"00\",RIGHT(E3144,2)))","v":"00"},{"$f":"IF(LEN(F3144)=1,0&F3144,IF(LEN(F3144)=0,\"00\",RIGHT(F3144,2)))","v":"06"},{"$f":"IF(LEN(G3144)=1,0&G3144,IF(LEN(G3144)=0,\"00\",RIGHT(G3144,2)))","v":"01"},{"$f":"IF(LEN(H3144)=1,0&H3144,IF(LEN(H3144)=0,\"00\",RIGHT(H3144,2)))","v":"08"}]
["00-06-02-07",5,null,15,0,6,2,7,"00","06","02","07"]
["00-06-03-06",5,null,15,0,6,3,6,"00","06","03","06"]
["00-06-04-05",4,null,15,0,6,4,5,"00","06","04","05"]
["00-06-05-04",4,null,15,0,6,5,4,"00","06","05","04"]
["00-06-06-03",4,null,15,0,6,6,3,"00","06","06","03"]
["00-06-07-02",4,null,15,0,6,7,2,"00","06","07","02"]
["00-06-08-01",4,null,15,0,6,8,1,"00","06","08","01"]
["00-06-09-00",4,null,15,0,6,9,0,"00","06","09","00"]
["00-07-00-08",5,null,15,0,7,0,8,"00","07","00","08"]
["00-07-01-07",4,null,15,0,7,1,7,"00","07","01","07"]
["00-07-02-06",4,null,15,0,7,2,6,"00","07","02","06"]
["00-07-03-05",4,null,15,0,7,3,5,"00","07","03","05"]
["00-07-04-04",4,null,15,0,7,4,4,"00","07","04","04"]
["00-07-05-03",4,null,15,0,7,5,3,"00","07","05","03"]
["00-07-06-02",4,null,15,0,7,6,2,"00","07","06","02"]
["00-07-07-01",4,null,15,0,7,7,1,"00","07","07","01"]
["00-07-08-00",4,null,15,0,7,8,0,"00","07","08","00"]
["00-08-00-07",3,null,15,0,8,0,7,"00","08","00","07"]
["00-08-01-06",3,null,15,0,8,1,6,"00","08","01","06"]
["00-08-02-05",3,null,15,0,8,2,5,"00","08","02","05"]
["00-08-03-04",3,null,15,0,8,3,4,"00","08","03","04"]
["00-08-04-03",3,null,15,0,8,4,3,"00","08","04","03"]
["00-08-05-02",3,null,15,0,8,5,2,"00","08","05","02"]
["00-08-06-01",3,null,15,0,8,6,1,"00","08","06","01"]
["00-08-07-00",3,null,15,0,8,7,0,"00","08","07","00"]
["00-09-00-06",3,null,15,0,9,0,6,"00","09","00","06"]
["00-09-01-05",3,null,15,0,9,1,5,"00","09","01","05"]
["00-09-02-04",3,null,15,0,9,2,4,"00","09","02","04"]
["00-09-03-03",3,null,15,0,9,3,3,"00","09","03","03"]
["00-09-04-02",3,null,15,0,9,4,2,"00","09","04","02"]
["00-09-05-01",3,null,15,0,9,5,1,"00","09","05","01"]
["00-09-06-00",3,null,15,0,9,6,0,"00","09","06","00"]
["00-10-00-05",3,null,15,0,10,0,5,"00","10","00","05"]
["00-10-01-04",3,null,15,0,10,1,4,"00","10","01","04"]
["00-10-02-03",3,null,15,0,10,2,3,"00","10","02","03"]
["00-10-03-02",3,null,15,0,10,3,2,"00","10","03","02"]
["00-10-04-01",3,null,15,0,10,4,1,"00","10","04","01"]
["00-10-05-00",3,null,15,0,10,5,0,"00","10","05","00"]
["00-11-00-04",3,null,15,0,11,0,4,"00","11","00","04"]
["00-11-01-03",3,null,15,0,11,1,3,"00","11","01","03"]
["00-11-02-02",3,null,15,0,11,2,2,"00","11","02","02"]
["00-11-03-01",3,null,15,0,11,3,1,"00","11","03","01"]
["00-11-04-00",3,null,15,0,11,4,0,"00","11","04","00"]
["00-12-00-03",3,null,15,0,12,0,3,"00","12","00","03"]
["00-12-01-02",3,null,15,0,12,1,2,"00","12","01","02"]
["00-12-02-01",3,null,15,0,12,2,1,"00","12","02","01"]
["00-12-03-00",3,null,15,0,12,3,0,"00","12","03","00"]
["00-13-00-02",3,null,15,0,13,0,2,"00","13","00","02"]
["00-13-01-01",2,null,15,0,13,1,1,"00","13","01","01"]
["00-13-02-00",2,null,15,0,13,2,0,"00","13","02","00"]
["00-14-00-01",2,null,15,0,14,0,1,"00","14","00","01"]
["00-14-01-00",2,null,15,0,14,1,0,"00","14","01","00"]
["00-15-00-00",2,null,15,0,15,0,0,"00","15","00","00"]
["01-00-00-14",5,null,15,1,0,0,14,"01","00","00","14"]
["01-00-01-13",5,null,15,1,0,1,13,"01","00","01","13"]
["01-00-02-12",5,null,15,1,0,2,12,"01","00","02","12"]
["01-00-03-11",5,null,15,1,0,3,11,"01","00","03","11"]
["01-00-04-10",5,null,15,1,0,4,10,"01","00","04","10"]
["01-00-05-09",5,null,15,1,0,5,9,"01","00","05","09"]
["01-00-06-08",5,null,15,1,0,6,8,"01","00","06","08"]
["01-00-07-07",5,null,15,1,0,7,7,"01","00","07","07"]
["01-00-08-06",5,null,15,1,0,8,6,"01","00","08","06"]
[{"$f":"I3207&\"-\"&J3207&\"-\"&K3207&\"-\"&L3207","v":"01-00-09-05"},5,null,15,1,0,9,5,"01","00","09","05"]
["01-00-10-04",5,null,15,1,0,10,4,{"$f":"IF(LEN(E3208)=1,0&E3208,IF(LEN(E3208)=0,\"00\",RIGHT(E3208,2)))","v":"01"},{"$f":"IF(LEN(F3208)=1,0&F3208,IF(LEN(F3208)=0,\"00\",RIGHT(F3208,2)))","v":"00"},{"$f":"IF(LEN(G3208)=1,0&G3208,IF(LEN(G3208)=0,\"00\",RIGHT(G3208,2)))","v":"10"},{"$f":"IF(LEN(H3208)=1,0&H3208,IF(LEN(H3208)=0,\"00\",RIGHT(H3208,2)))","v":"04"}]
["01-00-11-03",5,null,15,1,0,11,3,"01","00","11","03"]
["01-00-12-02",4,null,15,1,0,12,2,"01","00","12","02"]
["01-00-13-01",4,null,15,1,0,13,1,"01","00","13","01"]
["01-00-14-00",4,null,15,1,0,14,0,"01","00","14","00"]
["01-01-00-13",5,null,15,1,1,0,13,"01","01","00","13"]
["01-01-01-12",5,null,15,1,1,1,12,"01","01","01","12"]
["01-01-02-11",5,null,15,1,1,2,11,"01","01","02","11"]
["01-01-03-10",5,null,15,1,1,3,10,"01","01","03","10"]
["01-01-04-09",5,null,15,1,1,4,9,"01","01","04","09"]
["01-01-05-08",5,null,15,1,1,5,8,"01","01","05","08"]
["01-01-06-07",5,null,15,1,1,6,7,"01","01","06","07"]
["01-01-07-06",5,null,15,1,1,7,6,"01","01","07","06"]
["01-01-08-05",5,null,15,1,1,8,5,"01","01","08","05"]
["01-01-09-04",5,null,15,1,1,9,4,"01","01","09","04"]
["01-01-10-03",5,null,15,1,1,10,3,"01","01","10","03"]
["01-01-11-02",4,null,15,1,1,11,2,"01","01","11","02"]
["01-01-12-01",4,null,15,1,1,12,1,"01","01","12","01"]
["01-01-13-00",4,null,15,1,1,13,0,"01","01","13","00"]
["01-02-00-12",5,null,15,1,2,0,12,"01","02","00","12"]
["01-02-01-11",5,null,15,1,2,1,11,"01","02","01","11"]
["01-02-02-10",5,null,15,1,2,2,10,"01","02","02","10"]
["01-02-03-09",5,null,15,1,2,3,9,"01","02","03","09"]
["01-02-04-08",5,null,15,1,2,4,8,"01","02","04","08"]
["01-02-05-07",5,null,15,1,2,5,7,"01","02","05","07"]
["01-02-06-06",5,null,15,1,2,6,6,"01","02","06","06"]
["01-02-07-05",5,null,15,1,2,7,5,"01","02","07","05"]
["01-02-08-04",5,null,15,1,2,8,4,"01","02","08","04"]
["01-02-09-03",5,null,15,1,2,9,3,"01","02","09","03"]
["01-02-10-02",4,null,15,1,2,10,2,"01","02","10","02"]
["01-02-11-01",4,null,15,1,2,11,1,"01","02","11","01"]
["01-02-12-00",4,null,15,1,2,12,0,"01","02","12","00"]
["01-03-00-11",5,null,15,1,3,0,11,"01","03","00","11"]
["01-03-01-10",5,null,15,1,3,1,10,"01","03","01","10"]
["01-03-02-09",5,null,15,1,3,2,9,"01","03","02","09"]
["01-03-03-08",5,null,15,1,3,3,8,"01","03","03","08"]
["01-03-04-07",5,null,15,1,3,4,7,"01","03","04","07"]
["01-03-05-06",5,null,15,1,3,5,6,"01","03","05","06"]
["01-03-06-05",5,null,15,1,3,6,5,"01","03","06","05"]
["01-03-07-04",4,null,15,1,3,7,4,"01","03","07","04"]
["01-03-08-03",4,null,15,1,3,8,3,"01","03","08","03"]
["01-03-09-02",4,null,15,1,3,9,2,"01","03","09","02"]
["01-03-10-01",4,null,15,1,3,10,1,"01","03","10","01"]
["01-03-11-00",4,null,15,1,3,11,0,"01","03","11","00"]
["01-04-00-10",5,null,15,1,4,0,10,"01","04","00","10"]
["01-04-01-09",5,null,15,1,4,1,9,"01","04","01","09"]
["01-04-02-08",5,null,15,1,4,2,8,"01","04","02","08"]
["01-04-03-07",5,null,15,1,4,3,7,"01","04","03","07"]
["01-04-04-06",5,null,15,1,4,4,6,"01","04","04","06"]
["01-04-05-05",4,null,15,1,4,5,5,"01","04","05","05"]
["01-04-06-04",4,null,15,1,4,6,4,"01","04","06","04"]
["01-04-07-03",4,null,15,1,4,7,3,"01","04","07","03"]
["01-04-08-02",4,null,15,1,4,8,2,"01","04","08","02"]
["01-04-09-01",4,null,15,1,4,9,1,"01","04","09","01"]
["01-04-10-00",4,null,15,1,4,10,0,"01","04","10","00"]
["01-05-00-09",5,null,15,1,5,0,9,"01","05","00","09"]
["01-05-01-08",5,null,15,1,5,1,8,"01","05","01","08"]
["01-05-02-07",4,null,15,1,5,2,7,"01","05","02","07"]
["01-05-03-06",4,null,15,1,5,3,6,"01","05","03","06"]
["01-05-04-05",4,null,15,1,5,4,5,"01","05","04","05"]
["01-05-05-04",4,null,15,1,5,5,4,"01","05","05","04"]
["01-05-06-03",4,null,15,1,5,6,3,"01","05","06","03"]
["01-05-07-02",4,null,15,1,5,7,2,"01","05","07","02"]
[{"$f":"I3271&\"-\"&J3271&\"-\"&K3271&\"-\"&L3271","v":"01-05-08-01"},4,null,15,1,5,8,1,"01","05","08","01"]
["01-05-09-00",4,null,15,1,5,9,0,{"$f":"IF(LEN(E3272)=1,0&E3272,IF(LEN(E3272)=0,\"00\",RIGHT(E3272,2)))","v":"01"},{"$f":"IF(LEN(F3272)=1,0&F3272,IF(LEN(F3272)=0,\"00\",RIGHT(F3272,2)))","v":"05"},{"$f":"IF(LEN(G3272)=1,0&G3272,IF(LEN(G3272)=0,\"00\",RIGHT(G3272,2)))","v":"09"},{"$f":"IF(LEN(H3272)=1,0&H3272,IF(LEN(H3272)=0,\"00\",RIGHT(H3272,2)))","v":"00"}]
["01-06-00-08",4,null,15,1,6,0,8,"01","06","00","08"]
["01-06-01-07",4,null,15,1,6,1,7,"01","06","01","07"]
["01-06-02-06",4,null,15,1,6,2,6,"01","06","02","06"]
["01-06-03-05",4,null,15,1,6,3,5,"01","06","03","05"]
["01-06-04-04",4,null,15,1,6,4,4,"01","06","04","04"]
["01-06-05-03",4,null,15,1,6,5,3,"01","06","05","03"]
["01-06-06-02",4,null,15,1,6,6,2,"01","06","06","02"]
["01-06-07-01",4,null,15,1,6,7,1,"01","06","07","01"]
["01-06-08-00",4,null,15,1,6,8,0,"01","06","08","00"]
["01-07-00-07",3,null,15,1,7,0,7,"01","07","00","07"]
["01-07-01-06",3,null,15,1,7,1,6,"01","07","01","06"]
["01-07-02-05",3,null,15,1,7,2,5,"01","07","02","05"]
["01-07-03-04",3,null,15,1,7,3,4,"01","07","03","04"]
["01-07-04-03",3,null,15,1,7,4,3,"01","07","04","03"]
["01-07-05-02",3,null,15,1,7,5,2,"01","07","05","02"]
["01-07-06-01",3,null,15,1,7,6,1,"01","07","06","01"]
["01-07-07-00",3,null,15,1,7,7,0,"01","07","07","00"]
["01-08-00-06",3,null,15,1,8,0,6,"01","08","00","06"]
["01-08-01-05",3,null,15,1,8,1,5,"01","08","01","05"]
["01-08-02-04",3,null,15,1,8,2,4,"01","08","02","04"]
["01-08-03-03",3,null,15,1,8,3,3,"01","08","03","03"]
["01-08-04-02",3,null,15,1,8,4,2,"01","08","04","02"]
["01-08-05-01",3,null,15,1,8,5,1,"01","08","05","01"]
["01-08-06-00",3,null,15,1,8,6,0,"01","08","06","00"]
["01-09-00-05",3,null,15,1,9,0,5,"01","09","00","05"]
["01-09-01-04",3,null,15,1,9,1,4,"01","09","01","04"]
["01-09-02-03",3,null,15,1,9,2,3,"01","09","02","03"]
["01-09-03-02",3,null,15,1,9,3,2,"01","09","03","02"]
["01-09-04-01",3,null,15,1,9,4,1,"01","09","04","01"]
["01-09-05-00",3,null,15,1,9,5,0,"01","09","05","00"]
["01-10-00-04",3,null,15,1,10,0,4,"01","10","00","04"]
["01-10-01-03",3,null,15,1,10,1,3,"01","10","01","03"]
["01-10-02-02",3,null,15,1,10,2,2,"01","10","02","02"]
["01-10-03-01",3,null,15,1,10,3,1,"01","10","03","01"]
["01-10-04-00",3,null,15,1,10,4,0,"01","10","04","00"]
["01-11-00-03",3,null,15,1,11,0,3,"01","11","00","03"]
["01-11-01-02",3,null,15,1,11,1,2,"01","11","01","02"]
["01-11-02-01",2,null,15,1,11,2,1,"01","11","02","01"]
["01-11-03-00",2,null,15,1,11,3,0,"01","11","03","00"]
["01-12-00-02",2,null,15,1,12,0,2,"01","12","00","02"]
["01-12-01-01",2,null,15,1,12,1,1,"01","12","01","01"]
["01-12-02-00",2,null,15,1,12,2,0,"01","12","02","00"]
["01-13-00-01",2,null,15,1,13,0,1,"01","13","00","01"]
["01-13-01-00",2,null,15,1,13,1,0,"01","13","01","00"]
["01-14-00-00",2,null,15,1,14,0,0,"01","14","00","00"]
["02-00-00-13",5,null,15,2,0,0,13,"02","00","00","13"]
["02-00-01-12",5,null,15,2,0,1,12,"02","00","01","12"]
["02-00-02-11",5,null,15,2,0,2,11,"02","00","02","11"]
["02-00-03-10",5,null,15,2,0,3,10,"02","00","03","10"]
["02-00-04-09",5,null,15,2,0,4,9,"02","00","04","09"]
["02-00-05-08",5,null,15,2,0,5,8,"02","00","05","08"]
["02-00-06-07",5,null,15,2,0,6,7,"02","00","06","07"]
["02-00-07-06",5,null,15,2,0,7,6,"02","00","07","06"]
["02-00-08-05",5,null,15,2,0,8,5,"02","00","08","05"]
["02-00-09-04",5,null,15,2,0,9,4,"02","00","09","04"]
["02-00-10-03",5,null,15,2,0,10,3,"02","00","10","03"]
["02-00-11-02",4,null,15,2,0,11,2,"02","00","11","02"]
["02-00-12-01",4,null,15,2,0,12,1,"02","00","12","01"]
["02-00-13-00",4,null,15,2,0,13,0,"02","00","13","00"]
["02-01-00-12",5,null,15,2,1,0,12,"02","01","00","12"]
["02-01-01-11",5,null,15,2,1,1,11,"02","01","01","11"]
["02-01-02-10",5,null,15,2,1,2,10,"02","01","02","10"]
[{"$f":"I3335&\"-\"&J3335&\"-\"&K3335&\"-\"&L3335","v":"02-01-03-09"},5,null,15,2,1,3,9,"02","01","03","09"]
["02-01-04-08",5,null,15,2,1,4,8,{"$f":"IF(LEN(E3336)=1,0&E3336,IF(LEN(E3336)=0,\"00\",RIGHT(E3336,2)))","v":"02"},{"$f":"IF(LEN(F3336)=1,0&F3336,IF(LEN(F3336)=0,\"00\",RIGHT(F3336,2)))","v":"01"},{"$f":"IF(LEN(G3336)=1,0&G3336,IF(LEN(G3336)=0,\"00\",RIGHT(G3336,2)))","v":"04"},{"$f":"IF(LEN(H3336)=1,0&H3336,IF(LEN(H3336)=0,\"00\",RIGHT(H3336,2)))","v":"08"}]
["02-01-05-07",5,null,15,2,1,5,7,"02","01","05","07"]
["02-01-06-06",5,null,15,2,1,6,6,"02","01","06","06"]
["02-01-07-05",5,null,15,2,1,7,5,"02","01","07","05"]
["02-01-08-04",4,null,15,2,1,8,4,"02","01","08","04"]
["02-01-09-03",4,null,15,2,1,9,3,"02","01","09","03"]
["02-01-10-02",4,null,15,2,1,10,2,"02","01","10","02"]
["02-01-11-01",4,null,15,2,1,11,1,"02","01","11","01"]
["02-01-12-00",4,null,15,2,1,12,0,"02","01","12","00"]
["02-02-00-11",5,null,15,2,2,0,11,"02","02","00","11"]
["02-02-01-10",5,null,15,2,2,1,10,"02","02","01","10"]
["02-02-02-09",5,null,15,2,2,2,9,"02","02","02","09"]
["02-02-03-08",5,null,15,2,2,3,8,"02","02","03","08"]
["02-02-04-07",5,null,15,2,2,4,7,"02","02","04","07"]
["02-02-05-06",5,null,15,2,2,5,6,"02","02","05","06"]
["02-02-06-05",4,null,15,2,2,6,5,"02","02","06","05"]
["02-02-07-04",4,null,15,2,2,7,4,"02","02","07","04"]
["02-02-08-03",4,null,15,2,2,8,3,"02","02","08","03"]
["02-02-09-02",4,null,15,2,2,9,2,"02","02","09","02"]
["02-02-10-01",4,null,15,2,2,10,1,"02","02","10","01"]
["02-02-11-00",4,null,15,2,2,11,0,"02","02","11","00"]
["02-03-00-10",5,null,15,2,3,0,10,"02","03","00","10"]
["02-03-01-09",5,null,15,2,3,1,9,"02","03","01","09"]
["02-03-02-08",5,null,15,2,3,2,8,"02","03","02","08"]
["02-03-03-07",4,null,15,2,3,3,7,"02","03","03","07"]
["02-03-04-06",4,null,15,2,3,4,6,"02","03","04","06"]
["02-03-05-05",4,null,15,2,3,5,5,"02","03","05","05"]
["02-03-06-04",4,null,15,2,3,6,4,"02","03","06","04"]
["02-03-07-03",4,null,15,2,3,7,3,"02","03","07","03"]
["02-03-08-02",4,null,15,2,3,8,2,"02","03","08","02"]
["02-03-09-01",4,null,15,2,3,9,1,"02","03","09","01"]
["02-03-10-00",4,null,15,2,3,10,0,"02","03","10","00"]
["02-04-00-09",5,null,15,2,4,0,9,"02","04","00","09"]
["02-04-01-08",4,null,15,2,4,1,8,"02","04","01","08"]
["02-04-02-07",4,null,15,2,4,2,7,"02","04","02","07"]
["02-04-03-06",4,null,15,2,4,3,6,"02","04","03","06"]
["02-04-04-05",4,null,15,2,4,4,5,"02","04","04","05"]
["02-04-05-04",4,null,15,2,4,5,4,"02","04","05","04"]
["02-04-06-03",4,null,15,2,4,6,3,"02","04","06","03"]
["02-04-07-02",4,null,15,2,4,7,2,"02","04","07","02"]
["02-04-08-01",4,null,15,2,4,8,1,"02","04","08","01"]
["02-04-09-00",4,null,15,2,4,9,0,"02","04","09","00"]
["02-05-00-08",4,null,15,2,5,0,8,"02","05","00","08"]
["02-05-01-07",4,null,15,2,5,1,7,"02","05","01","07"]
["02-05-02-06",4,null,15,2,5,2,6,"02","05","02","06"]
["02-05-03-05",4,null,15,2,5,3,5,"02","05","03","05"]
["02-05-04-04",4,null,15,2,5,4,4,"02","05","04","04"]
["02-05-05-03",4,null,15,2,5,5,3,"02","05","05","03"]
["02-05-06-02",4,null,15,2,5,6,2,"02","05","06","02"]
["02-05-07-01",4,null,15,2,5,7,1,"02","05","07","01"]
["02-05-08-00",4,null,15,2,5,8,0,"02","05","08","00"]
["02-06-00-07",3,null,15,2,6,0,7,"02","06","00","07"]
["02-06-01-06",3,null,15,2,6,1,6,"02","06","01","06"]
["02-06-02-05",3,null,15,2,6,2,5,"02","06","02","05"]
["02-06-03-04",3,null,15,2,6,3,4,"02","06","03","04"]
["02-06-04-03",3,null,15,2,6,4,3,"02","06","04","03"]
["02-06-05-02",3,null,15,2,6,5,2,"02","06","05","02"]
["02-06-06-01",3,null,15,2,6,6,1,"02","06","06","01"]
["02-06-07-00",3,null,15,2,6,7,0,"02","06","07","00"]
["02-07-00-06",3,null,15,2,7,0,6,"02","07","00","06"]
["02-07-01-05",3,null,15,2,7,1,5,"02","07","01","05"]
["02-07-02-04",3,null,15,2,7,2,4,"02","07","02","04"]
["02-07-03-03",3,null,15,2,7,3,3,"02","07","03","03"]
[{"$f":"I3399&\"-\"&J3399&\"-\"&K3399&\"-\"&L3399","v":"02-07-04-02"},3,null,15,2,7,4,2,"02","07","04","02"]
["02-07-05-01",3,null,15,2,7,5,1,{"$f":"IF(LEN(E3400)=1,0&E3400,IF(LEN(E3400)=0,\"00\",RIGHT(E3400,2)))","v":"02"},{"$f":"IF(LEN(F3400)=1,0&F3400,IF(LEN(F3400)=0,\"00\",RIGHT(F3400,2)))","v":"07"},{"$f":"IF(LEN(G3400)=1,0&G3400,IF(LEN(G3400)=0,\"00\",RIGHT(G3400,2)))","v":"05"},{"$f":"IF(LEN(H3400)=1,0&H3400,IF(LEN(H3400)=0,\"00\",RIGHT(H3400,2)))","v":"01"}]
["02-07-06-00",3,null,15,2,7,6,0,"02","07","06","00"]
["02-08-00-05",3,null,15,2,8,0,5,"02","08","00","05"]
["02-08-01-04",3,null,15,2,8,1,4,"02","08","01","04"]
["02-08-02-03",3,null,15,2,8,2,3,"02","08","02","03"]
["02-08-03-02",3,null,15,2,8,3,2,"02","08","03","02"]
["02-08-04-01",3,null,15,2,8,4,1,"02","08","04","01"]
["02-08-05-00",3,null,15,2,8,5,0,"02","08","05","00"]
["02-09-00-04",3,null,15,2,9,0,4,"02","09","00","04"]
["02-09-01-03",3,null,15,2,9,1,3,"02","09","01","03"]
["02-09-02-02",3,null,15,2,9,2,2,"02","09","02","02"]
["02-09-03-01",3,null,15,2,9,3,1,"02","09","03","01"]
["02-09-04-00",3,null,15,2,9,4,0,"02","09","04","00"]
["02-10-00-03",3,null,15,2,10,0,3,"02","10","00","03"]
["02-10-01-02",2,null,15,2,10,1,2,"02","10","01","02"]
["02-10-02-01",2,null,15,2,10,2,1,"02","10","02","01"]
["02-10-03-00",2,null,15,2,10,3,0,"02","10","03","00"]
["02-11-00-02",2,null,15,2,11,0,2,"02","11","00","02"]
["02-11-01-01",2,null,15,2,11,1,1,"02","11","01","01"]
["02-11-02-00",2,null,15,2,11,2,0,"02","11","02","00"]
["02-12-00-01",2,null,15,2,12,0,1,"02","12","00","01"]
["02-12-01-00",2,null,15,2,12,1,0,"02","12","01","00"]
["02-13-00-00",2,null,15,2,13,0,0,"02","13","00","00"]
["03-00-00-12",5,null,15,3,0,0,12,"03","00","00","12"]
["03-00-01-11",5,null,15,3,0,1,11,"03","00","01","11"]
["03-00-02-10",5,null,15,3,0,2,10,"03","00","02","10"]
["03-00-03-09",5,null,15,3,0,3,9,"03","00","03","09"]
["03-00-04-08",5,null,15,3,0,4,8,"03","00","04","08"]
["03-00-05-07",5,null,15,3,0,5,7,"03","00","05","07"]
["03-00-06-06",5,null,15,3,0,6,6,"03","00","06","06"]
["03-00-07-05",4,null,15,3,0,7,5,"03","00","07","05"]
["03-00-08-04",4,null,15,3,0,8,4,"03","00","08","04"]
["03-00-09-03",4,null,15,3,0,9,3,"03","00","09","03"]
["03-00-10-02",4,null,15,3,0,10,2,"03","00","10","02"]
["03-00-11-01",4,null,15,3,0,11,1,"03","00","11","01"]
["03-00-12-00",4,null,15,3,0,12,0,"03","00","12","00"]
["03-01-00-11",5,null,15,3,1,0,11,"03","01","00","11"]
["03-01-01-10",5,null,15,3,1,1,10,"03","01","01","10"]
["03-01-02-09",5,null,15,3,1,2,9,"03","01","02","09"]
["03-01-03-08",5,null,15,3,1,3,8,"03","01","03","08"]
["03-01-04-07",4,null,15,3,1,4,7,"03","01","04","07"]
["03-01-05-06",4,null,15,3,1,5,6,"03","01","05","06"]
["03-01-06-05",4,null,15,3,1,6,5,"03","01","06","05"]
["03-01-07-04",4,null,15,3,1,7,4,"03","01","07","04"]
["03-01-08-03",4,null,15,3,1,8,3,"03","01","08","03"]
["03-01-09-02",4,null,15,3,1,9,2,"03","01","09","02"]
["03-01-10-01",4,null,15,3,1,10,1,"03","01","10","01"]
["03-01-11-00",4,null,15,3,1,11,0,"03","01","11","00"]
["03-02-00-10",5,null,15,3,2,0,10,"03","02","00","10"]
["03-02-01-09",5,null,15,3,2,1,9,"03","02","01","09"]
["03-02-02-08",4,null,15,3,2,2,8,"03","02","02","08"]
["03-02-03-07",4,null,15,3,2,3,7,"03","02","03","07"]
["03-02-04-06",4,null,15,3,2,4,6,"03","02","04","06"]
["03-02-05-05",4,null,15,3,2,5,5,"03","02","05","05"]
["03-02-06-04",4,null,15,3,2,6,4,"03","02","06","04"]
["03-02-07-03",4,null,15,3,2,7,3,"03","02","07","03"]
["03-02-08-02",4,null,15,3,2,8,2,"03","02","08","02"]
["03-02-09-01",4,null,15,3,2,9,1,"03","02","09","01"]
["03-02-10-00",4,null,15,3,2,10,0,"03","02","10","00"]
["03-03-00-09",4,null,15,3,3,0,9,"03","03","00","09"]
["03-03-01-08",4,null,15,3,3,1,8,"03","03","01","08"]
["03-03-02-07",4,null,15,3,3,2,7,"03","03","02","07"]
["03-03-03-06",4,null,15,3,3,3,6,"03","03","03","06"]
[{"$f":"I3463&\"-\"&J3463&\"-\"&K3463&\"-\"&L3463","v":"03-03-04-05"},4,null,15,3,3,4,5,"03","03","04","05"]
["03-03-05-04",4,null,15,3,3,5,4,{"$f":"IF(LEN(E3464)=1,0&E3464,IF(LEN(E3464)=0,\"00\",RIGHT(E3464,2)))","v":"03"},{"$f":"IF(LEN(F3464)=1,0&F3464,IF(LEN(F3464)=0,\"00\",RIGHT(F3464,2)))","v":"03"},{"$f":"IF(LEN(G3464)=1,0&G3464,IF(LEN(G3464)=0,\"00\",RIGHT(G3464,2)))","v":"05"},{"$f":"IF(LEN(H3464)=1,0&H3464,IF(LEN(H3464)=0,\"00\",RIGHT(H3464,2)))","v":"04"}]
["03-03-06-03",4,null,15,3,3,6,3,"03","03","06","03"]
["03-03-07-02",4,null,15,3,3,7,2,"03","03","07","02"]
["03-03-08-01",4,null,15,3,3,8,1,"03","03","08","01"]
["03-03-09-00",4,null,15,3,3,9,0,"03","03","09","00"]
["03-04-00-08",4,null,15,3,4,0,8,"03","04","00","08"]
["03-04-01-07",4,null,15,3,4,1,7,"03","04","01","07"]
["03-04-02-06",4,null,15,3,4,2,6,"03","04","02","06"]
["03-04-03-05",4,null,15,3,4,3,5,"03","04","03","05"]
["03-04-04-04",4,null,15,3,4,4,4,"03","04","04","04"]
["03-04-05-03",4,null,15,3,4,5,3,"03","04","05","03"]
["03-04-06-02",4,null,15,3,4,6,2,"03","04","06","02"]
["03-04-07-01",4,null,15,3,4,7,1,"03","04","07","01"]
["03-04-08-00",4,null,15,3,4,8,0,"03","04","08","00"]
["03-05-00-07",3,null,15,3,5,0,7,"03","05","00","07"]
["03-05-01-06",3,null,15,3,5,1,6,"03","05","01","06"]
["03-05-02-05",3,null,15,3,5,2,5,"03","05","02","05"]
["03-05-03-04",3,null,15,3,5,3,4,"03","05","03","04"]
["03-05-04-03",3,null,15,3,5,4,3,"03","05","04","03"]
["03-05-05-02",3,null,15,3,5,5,2,"03","05","05","02"]
["03-05-06-01",3,null,15,3,5,6,1,"03","05","06","01"]
["03-05-07-00",3,null,15,3,5,7,0,"03","05","07","00"]
["03-06-00-06",3,null,15,3,6,0,6,"03","06","00","06"]
["03-06-01-05",3,null,15,3,6,1,5,"03","06","01","05"]
["03-06-02-04",3,null,15,3,6,2,4,"03","06","02","04"]
["03-06-03-03",3,null,15,3,6,3,3,"03","06","03","03"]
["03-06-04-02",3,null,15,3,6,4,2,"03","06","04","02"]
["03-06-05-01",3,null,15,3,6,5,1,"03","06","05","01"]
["03-06-06-00",3,null,15,3,6,6,0,"03","06","06","00"]
["03-07-00-05",3,null,15,3,7,0,5,"03","07","00","05"]
["03-07-01-04",3,null,15,3,7,1,4,"03","07","01","04"]
["03-07-02-03",3,null,15,3,7,2,3,"03","07","02","03"]
["03-07-03-02",3,null,15,3,7,3,2,"03","07","03","02"]
["03-07-04-01",3,null,15,3,7,4,1,"03","07","04","01"]
["03-07-05-00",3,null,15,3,7,5,0,"03","07","05","00"]
["03-08-00-04",3,null,15,3,8,0,4,"03","08","00","04"]
["03-08-01-03",3,null,15,3,8,1,3,"03","08","01","03"]
["03-08-02-02",3,null,15,3,8,2,2,"03","08","02","02"]
["03-08-03-01",3,null,15,3,8,3,1,"03","08","03","01"]
["03-08-04-00",3,null,15,3,8,4,0,"03","08","04","00"]
["03-09-00-03",3,null,15,3,9,0,3,"03","09","00","03"]
["03-09-01-02",2,null,15,3,9,1,2,"03","09","01","02"]
["03-09-02-01",2,null,15,3,9,2,1,"03","09","02","01"]
["03-09-03-00",2,null,15,3,9,3,0,"03","09","03","00"]
["03-10-00-02",2,null,15,3,10,0,2,"03","10","00","02"]
["03-10-01-01",2,null,15,3,10,1,1,"03","10","01","01"]
["03-10-02-00",2,null,15,3,10,2,0,"03","10","02","00"]
["03-11-00-01",2,null,15,3,11,0,1,"03","11","00","01"]
["03-11-01-00",2,null,15,3,11,1,0,"03","11","01","00"]
["03-12-00-00",2,null,15,3,12,0,0,"03","12","00","00"]
["04-00-00-11",5,null,15,4,0,0,11,"04","00","00","11"]
["04-00-01-10",5,null,15,4,0,1,10,"04","00","01","10"]
["04-00-02-09",5,null,15,4,0,2,9,"04","00","02","09"]
["04-00-03-08",4,null,15,4,0,3,8,"04","00","03","08"]
["04-00-04-07",4,null,15,4,0,4,7,"04","00","04","07"]
["04-00-05-06",4,null,15,4,0,5,6,"04","00","05","06"]
["04-00-06-05",4,null,15,4,0,6,5,"04","00","06","05"]
["04-00-07-04",4,null,15,4,0,7,4,"04","00","07","04"]
["04-00-08-03",4,null,15,4,0,8,3,"04","00","08","03"]
["04-00-09-02",4,null,15,4,0,9,2,"04","00","09","02"]
["04-00-10-01",4,null,15,4,0,10,1,"04","00","10","01"]
["04-00-11-00",4,null,15,4,0,11,0,"04","00","11","00"]
["04-01-00-10",4,null,15,4,1,0,10,"04","01","00","10"]
[{"$f":"I3527&\"-\"&J3527&\"-\"&K3527&\"-\"&L3527","v":"04-01-01-09"},4,null,15,4,1,1,9,"04","01","01","09"]
["04-01-02-08",4,null,15,4,1,2,8,{"$f":"IF(LEN(E3528)=1,0&E3528,IF(LEN(E3528)=0,\"00\",RIGHT(E3528,2)))","v":"04"},{"$f":"IF(LEN(F3528)=1,0&F3528,IF(LEN(F3528)=0,\"00\",RIGHT(F3528,2)))","v":"01"},{"$f":"IF(LEN(G3528)=1,0&G3528,IF(LEN(G3528)=0,\"00\",RIGHT(G3528,2)))","v":"02"},{"$f":"IF(LEN(H3528)=1,0&H3528,IF(LEN(H3528)=0,\"00\",RIGHT(H3528,2)))","v":"08"}]
["04-01-03-07",4,null,15,4,1,3,7,"04","01","03","07"]
["04-01-04-06",4,null,15,4,1,4,6,"04","01","04","06"]
["04-01-05-05",4,null,15,4,1,5,5,"04","01","05","05"]
["04-01-06-04",4,null,15,4,1,6,4,"04","01","06","04"]
["04-01-07-03",4,null,15,4,1,7,3,"04","01","07","03"]
["04-01-08-02",4,null,15,4,1,8,2,"04","01","08","02"]
["04-01-09-01",4,null,15,4,1,9,1,"04","01","09","01"]
["04-01-10-00",4,null,15,4,1,10,0,"04","01","10","00"]
["04-02-00-09",4,null,15,4,2,0,9,"04","02","00","09"]
["04-02-01-08",4,null,15,4,2,1,8,"04","02","01","08"]
["04-02-02-07",4,null,15,4,2,2,7,"04","02","02","07"]
["04-02-03-06",4,null,15,4,2,3,6,"04","02","03","06"]
["04-02-04-05",4,null,15,4,2,4,5,"04","02","04","05"]
["04-02-05-04",4,null,15,4,2,5,4,"04","02","05","04"]
["04-02-06-03",4,null,15,4,2,6,3,"04","02","06","03"]
["04-02-07-02",4,null,15,4,2,7,2,"04","02","07","02"]
["04-02-08-01",4,null,15,4,2,8,1,"04","02","08","01"]
["04-02-09-00",4,null,15,4,2,9,0,"04","02","09","00"]
["04-03-00-08",4,null,15,4,3,0,8,"04","03","00","08"]
["04-03-01-07",4,null,15,4,3,1,7,"04","03","01","07"]
["04-03-02-06",4,null,15,4,3,2,6,"04","03","02","06"]
["04-03-03-05",4,null,15,4,3,3,5,"04","03","03","05"]
["04-03-04-04",4,null,15,4,3,4,4,"04","03","04","04"]
["04-03-05-03",4,null,15,4,3,5,3,"04","03","05","03"]
["04-03-06-02",4,null,15,4,3,6,2,"04","03","06","02"]
["04-03-07-01",4,null,15,4,3,7,1,"04","03","07","01"]
["04-03-08-00",4,null,15,4,3,8,0,"04","03","08","00"]
["04-04-00-07",3,null,15,4,4,0,7,"04","04","00","07"]
["04-04-01-06",3,null,15,4,4,1,6,"04","04","01","06"]
["04-04-02-05",3,null,15,4,4,2,5,"04","04","02","05"]
["04-04-03-04",3,null,15,4,4,3,4,"04","04","03","04"]
["04-04-04-03",3,null,15,4,4,4,3,"04","04","04","03"]
["04-04-05-02",3,null,15,4,4,5,2,"04","04","05","02"]
["04-04-06-01",3,null,15,4,4,6,1,"04","04","06","01"]
["04-04-07-00",3,null,15,4,4,7,0,"04","04","07","00"]
["04-05-00-06",3,null,15,4,5,0,6,"04","05","00","06"]
["04-05-01-05",3,null,15,4,5,1,5,"04","05","01","05"]
["04-05-02-04",3,null,15,4,5,2,4,"04","05","02","04"]
["04-05-03-03",3,null,15,4,5,3,3,"04","05","03","03"]
["04-05-04-02",3,null,15,4,5,4,2,"04","05","04","02"]
["04-05-05-01",3,null,15,4,5,5,1,"04","05","05","01"]
["04-05-06-00",3,null,15,4,5,6,0,"04","05","06","00"]
["04-06-00-05",3,null,15,4,6,0,5,"04","06","00","05"]
["04-06-01-04",3,null,15,4,6,1,4,"04","06","01","04"]
["04-06-02-03",3,null,15,4,6,2,3,"04","06","02","03"]
["04-06-03-02",3,null,15,4,6,3,2,"04","06","03","02"]
["04-06-04-01",3,null,15,4,6,4,1,"04","06","04","01"]
["04-06-05-00",3,null,15,4,6,5,0,"04","06","05","00"]
["04-07-00-04",3,null,15,4,7,0,4,"04","07","00","04"]
["04-07-01-03",3,null,15,4,7,1,3,"04","07","01","03"]
["04-07-02-02",3,null,15,4,7,2,2,"04","07","02","02"]
["04-07-03-01",3,null,15,4,7,3,1,"04","07","03","01"]
["04-07-04-00",3,null,15,4,7,4,0,"04","07","04","00"]
["04-08-00-03",3,null,15,4,8,0,3,"04","08","00","03"]
["04-08-01-02",2,null,15,4,8,1,2,"04","08","01","02"]
["04-08-02-01",2,null,15,4,8,2,1,"04","08","02","01"]
["04-08-03-00",2,null,15,4,8,3,0,"04","08","03","00"]
["04-09-00-02",2,null,15,4,9,0,2,"04","09","00","02"]
["04-09-01-01",2,null,15,4,9,1,1,"04","09","01","01"]
["04-09-02-00",2,null,15,4,9,2,0,"04","09","02","00"]
["04-10-00-01",2,null,15,4,10,0,1,"04","10","00","01"]
["04-10-01-00",2,null,15,4,10,1,0,"04","10","01","00"]
[{"$f":"I3591&\"-\"&J3591&\"-\"&K3591&\"-\"&L3591","v":"04-11-00-00"},2,null,15,4,11,0,0,"04","11","00","00"]
["05-00-00-10",4,null,15,5,0,0,10,{"$f":"IF(LEN(E3592)=1,0&E3592,IF(LEN(E3592)=0,\"00\",RIGHT(E3592,2)))","v":"05"},{"$f":"IF(LEN(F3592)=1,0&F3592,IF(LEN(F3592)=0,\"00\",RIGHT(F3592,2)))","v":"00"},{"$f":"IF(LEN(G3592)=1,0&G3592,IF(LEN(G3592)=0,\"00\",RIGHT(G3592,2)))","v":"00"},{"$f":"IF(LEN(H3592)=1,0&H3592,IF(LEN(H3592)=0,\"00\",RIGHT(H3592,2)))","v":"10"}]
["05-00-01-09",4,null,15,5,0,1,9,"05","00","01","09"]
["05-00-02-08",4,null,15,5,0,2,8,"05","00","02","08"]
["05-00-03-07",4,null,15,5,0,3,7,"05","00","03","07"]
["05-00-04-06",4,null,15,5,0,4,6,"05","00","04","06"]
["05-00-05-05",4,null,15,5,0,5,5,"05","00","05","05"]
["05-00-06-04",4,null,15,5,0,6,4,"05","00","06","04"]
["05-00-07-03",4,null,15,5,0,7,3,"05","00","07","03"]
["05-00-08-02",4,null,15,5,0,8,2,"05","00","08","02"]
["05-00-09-01",4,null,15,5,0,9,1,"05","00","09","01"]
["05-00-10-00",4,null,15,5,0,10,0,"05","00","10","00"]
["05-01-00-09",4,null,15,5,1,0,9,"05","01","00","09"]
["05-01-01-08",4,null,15,5,1,1,8,"05","01","01","08"]
["05-01-02-07",4,null,15,5,1,2,7,"05","01","02","07"]
["05-01-03-06",4,null,15,5,1,3,6,"05","01","03","06"]
["05-01-04-05",4,null,15,5,1,4,5,"05","01","04","05"]
["05-01-05-04",4,null,15,5,1,5,4,"05","01","05","04"]
["05-01-06-03",4,null,15,5,1,6,3,"05","01","06","03"]
["05-01-07-02",4,null,15,5,1,7,2,"05","01","07","02"]
["05-01-08-01",4,null,15,5,1,8,1,"05","01","08","01"]
["05-01-09-00",4,null,15,5,1,9,0,"05","01","09","00"]
["05-02-00-08",4,null,15,5,2,0,8,"05","02","00","08"]
["05-02-01-07",4,null,15,5,2,1,7,"05","02","01","07"]
["05-02-02-06",4,null,15,5,2,2,6,"05","02","02","06"]
["05-02-03-05",4,null,15,5,2,3,5,"05","02","03","05"]
["05-02-04-04",4,null,15,5,2,4,4,"05","02","04","04"]
["05-02-05-03",4,null,15,5,2,5,3,"05","02","05","03"]
["05-02-06-02",4,null,15,5,2,6,2,"05","02","06","02"]
["05-02-07-01",4,null,15,5,2,7,1,"05","02","07","01"]
["05-02-08-00",4,null,15,5,2,8,0,"05","02","08","00"]
["05-03-00-07",3,null,15,5,3,0,7,"05","03","00","07"]
["05-03-01-06",3,null,15,5,3,1,6,"05","03","01","06"]
["05-03-02-05",3,null,15,5,3,2,5,"05","03","02","05"]
["05-03-03-04",3,null,15,5,3,3,4,"05","03","03","04"]
["05-03-04-03",3,null,15,5,3,4,3,"05","03","04","03"]
["05-03-05-02",3,null,15,5,3,5,2,"05","03","05","02"]
["05-03-06-01",3,null,15,5,3,6,1,"05","03","06","01"]
["05-03-07-00",3,null,15,5,3,7,0,"05","03","07","00"]
["05-04-00-06",3,null,15,5,4,0,6,"05","04","00","06"]
["05-04-01-05",3,null,15,5,4,1,5,"05","04","01","05"]
["05-04-02-04",3,null,15,5,4,2,4,"05","04","02","04"]
["05-04-03-03",3,null,15,5,4,3,3,"05","04","03","03"]
["05-04-04-02",3,null,15,5,4,4,2,"05","04","04","02"]
["05-04-05-01",3,null,15,5,4,5,1,"05","04","05","01"]
["05-04-06-00",3,null,15,5,4,6,0,"05","04","06","00"]
["05-05-00-05",3,null,15,5,5,0,5,"05","05","00","05"]
["05-05-01-04",3,null,15,5,5,1,4,"05","05","01","04"]
["05-05-02-03",3,null,15,5,5,2,3,"05","05","02","03"]
["05-05-03-02",3,null,15,5,5,3,2,"05","05","03","02"]
["05-05-04-01",3,null,15,5,5,4,1,"05","05","04","01"]
["05-05-05-00",3,null,15,5,5,5,0,"05","05","05","00"]
["05-06-00-04",3,null,15,5,6,0,4,"05","06","00","04"]
["05-06-01-03",3,null,15,5,6,1,3,"05","06","01","03"]
["05-06-02-02",3,null,15,5,6,2,2,"05","06","02","02"]
["05-06-03-01",3,null,15,5,6,3,1,"05","06","03","01"]
["05-06-04-00",3,null,15,5,6,4,0,"05","06","04","00"]
["05-07-00-03",3,null,15,5,7,0,3,"05","07","00","03"]
["05-07-01-02",2,null,15,5,7,1,2,"05","07","01","02"]
["05-07-02-01",2,null,15,5,7,2,1,"05","07","02","01"]
["05-07-03-00",2,null,15,5,7,3,0,"05","07","03","00"]
["05-08-00-02",2,null,15,5,8,0,2,"05","08","00","02"]
["05-08-01-01",2,null,15,5,8,1,1,"05","08","01","01"]
["05-08-02-00",2,null,15,5,8,2,0,"05","08","02","00"]
[{"$f":"I3655&\"-\"&J3655&\"-\"&K3655&\"-\"&L3655","v":"05-09-00-01"},2,null,15,5,9,0,1,"05","09","00","01"]
["05-09-01-00",2,null,15,5,9,1,0,{"$f":"IF(LEN(E3656)=1,0&E3656,IF(LEN(E3656)=0,\"00\",RIGHT(E3656,2)))","v":"05"},{"$f":"IF(LEN(F3656)=1,0&F3656,IF(LEN(F3656)=0,\"00\",RIGHT(F3656,2)))","v":"09"},{"$f":"IF(LEN(G3656)=1,0&G3656,IF(LEN(G3656)=0,\"00\",RIGHT(G3656,2)))","v":"01"},{"$f":"IF(LEN(H3656)=1,0&H3656,IF(LEN(H3656)=0,\"00\",RIGHT(H3656,2)))","v":"00"}]
["05-10-00-00",2,null,15,5,10,0,0,"05","10","00","00"]
["06-00-00-09",4,null,15,6,0,0,9,"06","00","00","09"]
["06-00-01-08",4,null,15,6,0,1,8,"06","00","01","08"]
["06-00-02-07",4,null,15,6,0,2,7,"06","00","02","07"]
["06-00-03-06",4,null,15,6,0,3,6,"06","00","03","06"]
["06-00-04-05",4,null,15,6,0,4,5,"06","00","04","05"]
["06-00-05-04",4,null,15,6,0,5,4,"06","00","05","04"]
["06-00-06-03",4,null,15,6,0,6,3,"06","00","06","03"]
["06-00-07-02",4,null,15,6,0,7,2,"06","00","07","02"]
["06-00-08-01",4,null,15,6,0,8,1,"06","00","08","01"]
["06-00-09-00",4,null,15,6,0,9,0,"06","00","09","00"]
["06-01-00-08",4,null,15,6,1,0,8,"06","01","00","08"]
["06-01-01-07",4,null,15,6,1,1,7,"06","01","01","07"]
["06-01-02-06",4,null,15,6,1,2,6,"06","01","02","06"]
["06-01-03-05",4,null,15,6,1,3,5,"06","01","03","05"]
["06-01-04-04",4,null,15,6,1,4,4,"06","01","04","04"]
["06-01-05-03",4,null,15,6,1,5,3,"06","01","05","03"]
["06-01-06-02",4,null,15,6,1,6,2,"06","01","06","02"]
["06-01-07-01",3,null,15,6,1,7,1,"06","01","07","01"]
["06-01-08-00",3,null,15,6,1,8,0,"06","01","08","00"]
["06-02-00-07",3,null,15,6,2,0,7,"06","02","00","07"]
["06-02-01-06",3,null,15,6,2,1,6,"06","02","01","06"]
["06-02-02-05",3,null,15,6,2,2,5,"06","02","02","05"]
["06-02-03-04",3,null,15,6,2,3,4,"06","02","03","04"]
["06-02-04-03",3,null,15,6,2,4,3,"06","02","04","03"]
["06-02-05-02",3,null,15,6,2,5,2,"06","02","05","02"]
["06-02-06-01",3,null,15,6,2,6,1,"06","02","06","01"]
["06-02-07-00",3,null,15,6,2,7,0,"06","02","07","00"]
["06-03-00-06",3,null,15,6,3,0,6,"06","03","00","06"]
["06-03-01-05",3,null,15,6,3,1,5,"06","03","01","05"]
["06-03-02-04",3,null,15,6,3,2,4,"06","03","02","04"]
["06-03-03-03",3,null,15,6,3,3,3,"06","03","03","03"]
["06-03-04-02",3,null,15,6,3,4,2,"06","03","04","02"]
["06-03-05-01",3,null,15,6,3,5,1,"06","03","05","01"]
["06-03-06-00",3,null,15,6,3,6,0,"06","03","06","00"]
["06-04-00-05",3,null,15,6,4,0,5,"06","04","00","05"]
["06-04-01-04",3,null,15,6,4,1,4,"06","04","01","04"]
["06-04-02-03",3,null,15,6,4,2,3,"06","04","02","03"]
["06-04-03-02",3,null,15,6,4,3,2,"06","04","03","02"]
["06-04-04-01",3,null,15,6,4,4,1,"06","04","04","01"]
["06-04-05-00",3,null,15,6,4,5,0,"06","04","05","00"]
["06-05-00-04",3,null,15,6,5,0,4,"06","05","00","04"]
["06-05-01-03",3,null,15,6,5,1,3,"06","05","01","03"]
["06-05-02-02",3,null,15,6,5,2,2,"06","05","02","02"]
["06-05-03-01",3,null,15,6,5,3,1,"06","05","03","01"]
["06-05-04-00",3,null,15,6,5,4,0,"06","05","04","00"]
["06-06-00-03",3,null,15,6,6,0,3,"06","06","00","03"]
["06-06-01-02",2,null,15,6,6,1,2,"06","06","01","02"]
["06-06-02-01",2,null,15,6,6,2,1,"06","06","02","01"]
["06-06-03-00",2,null,15,6,6,3,0,"06","06","03","00"]
["06-07-00-02",2,null,15,6,7,0,2,"06","07","00","02"]
["06-07-01-01",2,null,15,6,7,1,1,"06","07","01","01"]
["06-07-02-00",2,null,15,6,7,2,0,"06","07","02","00"]
["06-08-00-01",2,null,15,6,8,0,1,"06","08","00","01"]
["06-08-01-00",2,null,15,6,8,1,0,"06","08","01","00"]
["06-09-00-00",2,null,15,6,9,0,0,"06","09","00","00"]
["07-00-00-08",4,null,15,7,0,0,8,"07","00","00","08"]
["07-00-01-07",4,null,15,7,0,1,7,"07","00","01","07"]
["07-00-02-06",4,null,15,7,0,2,6,"07","00","02","06"]
["07-00-03-05",4,null,15,7,0,3,5,"07","00","03","05"]
["07-00-04-04",4,null,15,7,0,4,4,"07","00","04","04"]
["07-00-05-03",4,null,15,7,0,5,3,"07","00","05","03"]
[{"$f":"I3719&\"-\"&J3719&\"-\"&K3719&\"-\"&L3719","v":"07-00-06-02"},3,null,15,7,0,6,2,"07","00","06","02"]
["07-00-07-01",3,null,15,7,0,7,1,{"$f":"IF(LEN(E3720)=1,0&E3720,IF(LEN(E3720)=0,\"00\",RIGHT(E3720,2)))","v":"07"},{"$f":"IF(LEN(F3720)=1,0&F3720,IF(LEN(F3720)=0,\"00\",RIGHT(F3720,2)))","v":"00"},{"$f":"IF(LEN(G3720)=1,0&G3720,IF(LEN(G3720)=0,\"00\",RIGHT(G3720,2)))","v":"07"},{"$f":"IF(LEN(H3720)=1,0&H3720,IF(LEN(H3720)=0,\"00\",RIGHT(H3720,2)))","v":"01"}]
["07-00-08-00",3,null,15,7,0,8,0,"07","00","08","00"]
["07-01-00-07",3,null,15,7,1,0,7,"07","01","00","07"]
["07-01-01-06",3,null,15,7,1,1,6,"07","01","01","06"]
["07-01-02-05",3,null,15,7,1,2,5,"07","01","02","05"]
["07-01-03-04",3,null,15,7,1,3,4,"07","01","03","04"]
["07-01-04-03",3,null,15,7,1,4,3,"07","01","04","03"]
["07-01-05-02",3,null,15,7,1,5,2,"07","01","05","02"]
["07-01-06-01",3,null,15,7,1,6,1,"07","01","06","01"]
["07-01-07-00",3,null,15,7,1,7,0,"07","01","07","00"]
["07-02-00-06",3,null,15,7,2,0,6,"07","02","00","06"]
["07-02-01-05",3,null,15,7,2,1,5,"07","02","01","05"]
["07-02-02-04",3,null,15,7,2,2,4,"07","02","02","04"]
["07-02-03-03",3,null,15,7,2,3,3,"07","02","03","03"]
["07-02-04-02",3,null,15,7,2,4,2,"07","02","04","02"]
["07-02-05-01",3,null,15,7,2,5,1,"07","02","05","01"]
["07-02-06-00",3,null,15,7,2,6,0,"07","02","06","00"]
["07-03-00-05",3,null,15,7,3,0,5,"07","03","00","05"]
["07-03-01-04",3,null,15,7,3,1,4,"07","03","01","04"]
["07-03-02-03",3,null,15,7,3,2,3,"07","03","02","03"]
["07-03-03-02",3,null,15,7,3,3,2,"07","03","03","02"]
["07-03-04-01",3,null,15,7,3,4,1,"07","03","04","01"]
["07-03-05-00",3,null,15,7,3,5,0,"07","03","05","00"]
["07-04-00-04",3,null,15,7,4,0,4,"07","04","00","04"]
["07-04-01-03",3,null,15,7,4,1,3,"07","04","01","03"]
["07-04-02-02",3,null,15,7,4,2,2,"07","04","02","02"]
["07-04-03-01",3,null,15,7,4,3,1,"07","04","03","01"]
["07-04-04-00",3,null,15,7,4,4,0,"07","04","04","00"]
["07-05-00-03",3,null,15,7,5,0,3,"07","05","00","03"]
["07-05-01-02",2,null,15,7,5,1,2,"07","05","01","02"]
["07-05-02-01",2,null,15,7,5,2,1,"07","05","02","01"]
["07-05-03-00",2,null,15,7,5,3,0,"07","05","03","00"]
["07-06-00-02",2,null,15,7,6,0,2,"07","06","00","02"]
["07-06-01-01",2,null,15,7,6,1,1,"07","06","01","01"]
["07-06-02-00",2,null,15,7,6,2,0,"07","06","02","00"]
["07-07-00-01",2,null,15,7,7,0,1,"07","07","00","01"]
["07-07-01-00",2,null,15,7,7,1,0,"07","07","01","00"]
["07-08-00-00",2,null,15,7,8,0,0,"07","08","00","00"]
["08-00-00-07",3,null,15,8,0,0,7,"08","00","00","07"]
["08-00-01-06",3,null,15,8,0,1,6,"08","00","01","06"]
["08-00-02-05",3,null,15,8,0,2,5,"08","00","02","05"]
["08-00-03-04",3,null,15,8,0,3,4,"08","00","03","04"]
["08-00-04-03",3,null,15,8,0,4,3,"08","00","04","03"]
["08-00-05-02",3,null,15,8,0,5,2,"08","00","05","02"]
["08-00-06-01",3,null,15,8,0,6,1,"08","00","06","01"]
["08-00-07-00",3,null,15,8,0,7,0,"08","00","07","00"]
["08-01-00-06",3,null,15,8,1,0,6,"08","01","00","06"]
["08-01-01-05",3,null,15,8,1,1,5,"08","01","01","05"]
["08-01-02-04",3,null,15,8,1,2,4,"08","01","02","04"]
["08-01-03-03",3,null,15,8,1,3,3,"08","01","03","03"]
["08-01-04-02",3,null,15,8,1,4,2,"08","01","04","02"]
["08-01-05-01",3,null,15,8,1,5,1,"08","01","05","01"]
["08-01-06-00",3,null,15,8,1,6,0,"08","01","06","00"]
["08-02-00-05",3,null,15,8,2,0,5,"08","02","00","05"]
["08-02-01-04",3,null,15,8,2,1,4,"08","02","01","04"]
["08-02-02-03",3,null,15,8,2,2,3,"08","02","02","03"]
["08-02-03-02",3,null,15,8,2,3,2,"08","02","03","02"]
["08-02-04-01",3,null,15,8,2,4,1,"08","02","04","01"]
["08-02-05-00",3,null,15,8,2,5,0,"08","02","05","00"]
["08-03-00-04",3,null,15,8,3,0,4,"08","03","00","04"]
["08-03-01-03",3,null,15,8,3,1,3,"08","03","01","03"]
["08-03-02-02",3,null,15,8,3,2,2,"08","03","02","02"]
["08-03-03-01",3,null,15,8,3,3,1,"08","03","03","01"]
[{"$f":"I3783&\"-\"&J3783&\"-\"&K3783&\"-\"&L3783","v":"08-03-04-00"},3,null,15,8,3,4,0,"08","03","04","00"]
["08-04-00-03",3,null,15,8,4,0,3,{"$f":"IF(LEN(E3784)=1,0&E3784,IF(LEN(E3784)=0,\"00\",RIGHT(E3784,2)))","v":"08"},{"$f":"IF(LEN(F3784)=1,0&F3784,IF(LEN(F3784)=0,\"00\",RIGHT(F3784,2)))","v":"04"},{"$f":"IF(LEN(G3784)=1,0&G3784,IF(LEN(G3784)=0,\"00\",RIGHT(G3784,2)))","v":"00"},{"$f":"IF(LEN(H3784)=1,0&H3784,IF(LEN(H3784)=0,\"00\",RIGHT(H3784,2)))","v":"03"}]
["08-04-01-02",2,null,15,8,4,1,2,"08","04","01","02"]
["08-04-02-01",2,null,15,8,4,2,1,"08","04","02","01"]
["08-04-03-00",2,null,15,8,4,3,0,"08","04","03","00"]
["08-05-00-02",2,null,15,8,5,0,2,"08","05","00","02"]
["08-05-01-01",2,null,15,8,5,1,1,"08","05","01","01"]
["08-05-02-00",2,null,15,8,5,2,0,"08","05","02","00"]
["08-06-00-01",2,null,15,8,6,0,1,"08","06","00","01"]
["08-06-01-00",2,null,15,8,6,1,0,"08","06","01","00"]
["08-07-00-00",2,null,15,8,7,0,0,"08","07","00","00"]
["09-00-00-06",3,null,15,9,0,0,6,"09","00","00","06"]
["09-00-01-05",3,null,15,9,0,1,5,"09","00","01","05"]
["09-00-02-04",3,null,15,9,0,2,4,"09","00","02","04"]
["09-00-03-03",3,null,15,9,0,3,3,"09","00","03","03"]
["09-00-04-02",3,null,15,9,0,4,2,"09","00","04","02"]
["09-00-05-01",3,null,15,9,0,5,1,"09","00","05","01"]
["09-00-06-00",3,null,15,9,0,6,0,"09","00","06","00"]
["09-01-00-05",3,null,15,9,1,0,5,"09","01","00","05"]
["09-01-01-04",3,null,15,9,1,1,4,"09","01","01","04"]
["09-01-02-03",3,null,15,9,1,2,3,"09","01","02","03"]
["09-01-03-02",3,null,15,9,1,3,2,"09","01","03","02"]
["09-01-04-01",3,null,15,9,1,4,1,"09","01","04","01"]
["09-01-05-00",3,null,15,9,1,5,0,"09","01","05","00"]
["09-02-00-04",3,null,15,9,2,0,4,"09","02","00","04"]
["09-02-01-03",3,null,15,9,2,1,3,"09","02","01","03"]
["09-02-02-02",3,null,15,9,2,2,2,"09","02","02","02"]
["09-02-03-01",3,null,15,9,2,3,1,"09","02","03","01"]
["09-02-04-00",3,null,15,9,2,4,0,"09","02","04","00"]
["09-03-00-03",3,null,15,9,3,0,3,"09","03","00","03"]
["09-03-01-02",2,null,15,9,3,1,2,"09","03","01","02"]
["09-03-02-01",2,null,15,9,3,2,1,"09","03","02","01"]
["09-03-03-00",2,null,15,9,3,3,0,"09","03","03","00"]
["09-04-00-02",2,null,15,9,4,0,2,"09","04","00","02"]
["09-04-01-01",2,null,15,9,4,1,1,"09","04","01","01"]
["09-04-02-00",2,null,15,9,4,2,0,"09","04","02","00"]
["09-05-00-01",2,null,15,9,5,0,1,"09","05","00","01"]
["09-05-01-00",2,null,15,9,5,1,0,"09","05","01","00"]
["09-06-00-00",2,null,15,9,6,0,0,"09","06","00","00"]
["10-00-00-05",3,null,15,10,0,0,5,"10","00","00","05"]
["10-00-01-04",3,null,15,10,0,1,4,"10","00","01","04"]
["10-00-02-03",3,null,15,10,0,2,3,"10","00","02","03"]
["10-00-03-02",3,null,15,10,0,3,2,"10","00","03","02"]
["10-00-04-01",3,null,15,10,0,4,1,"10","00","04","01"]
["10-00-05-00",3,null,15,10,0,5,0,"10","00","05","00"]
["10-01-00-04",3,null,15,10,1,0,4,"10","01","00","04"]
["10-01-01-03",3,null,15,10,1,1,3,"10","01","01","03"]
["10-01-02-02",3,null,15,10,1,2,2,"10","01","02","02"]
["10-01-03-01",3,null,15,10,1,3,1,"10","01","03","01"]
["10-01-04-00",3,null,15,10,1,4,0,"10","01","04","00"]
["10-02-00-03",3,null,15,10,2,0,3,"10","02","00","03"]
["10-02-01-02",2,null,15,10,2,1,2,"10","02","01","02"]
["10-02-02-01",2,null,15,10,2,2,1,"10","02","02","01"]
["10-02-03-00",2,null,15,10,2,3,0,"10","02","03","00"]
["10-03-00-02",2,null,15,10,3,0,2,"10","03","00","02"]
["10-03-01-01",2,null,15,10,3,1,1,"10","03","01","01"]
["10-03-02-00",2,null,15,10,3,2,0,"10","03","02","00"]
["10-04-00-01",2,null,15,10,4,0,1,"10","04","00","01"]
["10-04-01-00",2,null,15,10,4,1,0,"10","04","01","00"]
["10-05-00-00",2,null,15,10,5,0,0,"10","05","00","00"]
["11-00-00-04",3,null,15,11,0,0,4,"11","00","00","04"]
["11-00-01-03",3,null,15,11,0,1,3,"11","00","01","03"]
["11-00-02-02",3,null,15,11,0,2,2,"11","00","02","02"]
["11-00-03-01",3,null,15,11,0,3,1,"11","00","03","01"]
[{"$f":"I3847&\"-\"&J3847&\"-\"&K3847&\"-\"&L3847","v":"11-00-04-00"},3,null,15,11,0,4,0,"11","00","04","00"]
["11-01-00-03",3,null,15,11,1,0,3,{"$f":"IF(LEN(E3848)=1,0&E3848,IF(LEN(E3848)=0,\"00\",RIGHT(E3848,2)))","v":"11"},{"$f":"IF(LEN(F3848)=1,0&F3848,IF(LEN(F3848)=0,\"00\",RIGHT(F3848,2)))","v":"01"},{"$f":"IF(LEN(G3848)=1,0&G3848,IF(LEN(G3848)=0,\"00\",RIGHT(G3848,2)))","v":"00"},{"$f":"IF(LEN(H3848)=1,0&H3848,IF(LEN(H3848)=0,\"00\",RIGHT(H3848,2)))","v":"03"}]
["11-01-01-02",2,null,15,11,1,1,2,"11","01","01","02"]
["11-01-02-01",2,null,15,11,1,2,1,"11","01","02","01"]
["11-01-03-00",2,null,15,11,1,3,0,"11","01","03","00"]
["11-02-00-02",2,null,15,11,2,0,2,"11","02","00","02"]
["11-02-01-01",2,null,15,11,2,1,1,"11","02","01","01"]
["11-02-02-00",2,null,15,11,2,2,0,"11","02","02","00"]
["11-03-00-01",2,null,15,11,3,0,1,"11","03","00","01"]
["11-03-01-00",2,null,15,11,3,1,0,"11","03","01","00"]
["11-04-00-00",2,null,15,11,4,0,0,"11","04","00","00"]
["12-00-00-03",3,null,15,12,0,0,3,"12","00","00","03"]
["12-00-01-02",2,null,15,12,0,1,2,"12","00","01","02"]
["12-00-02-01",2,null,15,12,0,2,1,"12","00","02","01"]
["12-00-03-00",2,null,15,12,0,3,0,"12","00","03","00"]
["12-01-00-02",2,null,15,12,1,0,2,"12","01","00","02"]
["12-01-01-01",2,null,15,12,1,1,1,"12","01","01","01"]
["12-01-02-00",2,null,15,12,1,2,0,"12","01","02","00"]
["12-02-00-01",2,null,15,12,2,0,1,"12","02","00","01"]
["12-02-01-00",2,null,15,12,2,1,0,"12","02","01","00"]
["12-03-00-00",2,null,15,12,3,0,0,"12","03","00","00"]
["13-00-00-02",2,null,15,13,0,0,2,"13","00","00","02"]
["13-00-01-01",2,null,15,13,0,1,1,"13","00","01","01"]
["13-00-02-00",2,null,15,13,0,2,0,"13","00","02","00"]
["13-01-00-01",2,null,15,13,1,0,1,"13","01","00","01"]
["13-01-01-00",2,null,15,13,1,1,0,"13","01","01","00"]
["13-02-00-00",2,null,15,13,2,0,0,"13","02","00","00"]
["14-00-00-01",2,null,15,14,0,0,1,"14","00","00","01"]
["14-00-01-00",2,null,15,14,0,1,0,"14","00","01","00"]
["14-01-00-00",2,null,15,14,1,0,0,"14","01","00","00"]
["15-00-00-00",1,null,15,15,0,0,0,"15","00","00","00"]
["00-00-00-16",7,null,16,0,0,0,16,"00","00","00","16"]
["00-00-01-15",6,null,16,0,0,1,15,"00","00","01","15"]
["00-00-02-14",6,null,16,0,0,2,14,"00","00","02","14"]
["00-00-03-13",6,null,16,0,0,3,13,"00","00","03","13"]
["00-00-04-12",6,null,16,0,0,4,12,"00","00","04","12"]
["00-00-05-11",6,null,16,0,0,5,11,"00","00","05","11"]
["00-00-06-10",6,null,16,0,0,6,10,"00","00","06","10"]
["00-00-07-09",6,null,16,0,0,7,9,"00","00","07","09"]
["00-00-08-08",6,null,16,0,0,8,8,"00","00","08","08"]
["00-00-09-07",5,null,16,0,0,9,7,"00","00","09","07"]
["00-00-10-06",5,null,16,0,0,10,6,"00","00","10","06"]
["00-00-11-05",5,null,16,0,0,11,5,"00","00","11","05"]
["00-00-12-04",5,null,16,0,0,12,4,"00","00","12","04"]
["00-00-13-03",4,null,16,0,0,13,3,"00","00","13","03"]
["00-00-14-02",4,null,16,0,0,14,2,"00","00","14","02"]
["00-00-15-01",4,null,16,0,0,15,1,"00","00","15","01"]
["00-00-16-00",4,null,16,0,0,16,0,"00","00","16","00"]
["00-01-00-15",5,null,16,0,1,0,15,"00","01","00","15"]
["00-01-01-14",5,null,16,0,1,1,14,"00","01","01","14"]
["00-01-02-13",5,null,16,0,1,2,13,"00","01","02","13"]
["00-01-03-12",5,null,16,0,1,3,12,"00","01","03","12"]
["00-01-04-11",5,null,16,0,1,4,11,"00","01","04","11"]
["00-01-05-10",5,null,16,0,1,5,10,"00","01","05","10"]
["00-01-06-09",5,null,16,0,1,6,9,"00","01","06","09"]
["00-01-07-08",5,null,16,0,1,7,8,"00","01","07","08"]
["00-01-08-07",5,null,16,0,1,8,7,"00","01","08","07"]
["00-01-09-06",5,null,16,0,1,9,6,"00","01","09","06"]
["00-01-10-05",5,null,16,0,1,10,5,"00","01","10","05"]
["00-01-11-04",5,null,16,0,1,11,4,"00","01","11","04"]
["00-01-12-03",4,null,16,0,1,12,3,"00","01","12","03"]
["00-01-13-02",4,null,16,0,1,13,2,"00","01","13","02"]
["00-01-14-01",4,null,16,0,1,14,1,"00","01","14","01"]
["00-01-15-00",4,null,16,0,1,15,0,"00","01","15","00"]
[{"$f":"I3911&\"-\"&J3911&\"-\"&K3911&\"-\"&L3911","v":"00-02-00-14"},5,null,16,0,2,0,14,"00","02","00","14"]
["00-02-01-13",5,null,16,0,2,1,13,{"$f":"IF(LEN(E3912)=1,0&E3912,IF(LEN(E3912)=0,\"00\",RIGHT(E3912,2)))","v":"00"},{"$f":"IF(LEN(F3912)=1,0&F3912,IF(LEN(F3912)=0,\"00\",RIGHT(F3912,2)))","v":"02"},{"$f":"IF(LEN(G3912)=1,0&G3912,IF(LEN(G3912)=0,\"00\",RIGHT(G3912,2)))","v":"01"},{"$f":"IF(LEN(H3912)=1,0&H3912,IF(LEN(H3912)=0,\"00\",RIGHT(H3912,2)))","v":"13"}]
["00-02-02-12",5,null,16,0,2,2,12,"00","02","02","12"]
["00-02-03-11",5,null,16,0,2,3,11,"00","02","03","11"]
["00-02-04-10",5,null,16,0,2,4,10,"00","02","04","10"]
["00-02-05-09",5,null,16,0,2,5,9,"00","02","05","09"]
["00-02-06-08",5,null,16,0,2,6,8,"00","02","06","08"]
["00-02-07-07",5,null,16,0,2,7,7,"00","02","07","07"]
["00-02-08-06",5,null,16,0,2,8,6,"00","02","08","06"]
["00-02-09-05",5,null,16,0,2,9,5,"00","02","09","05"]
["00-02-10-04",5,null,16,0,2,10,4,"00","02","10","04"]
["00-02-11-03",4,null,16,0,2,11,3,"00","02","11","03"]
["00-02-12-02",4,null,16,0,2,12,2,"00","02","12","02"]
["00-02-13-01",4,null,16,0,2,13,1,"00","02","13","01"]
["00-02-14-00",4,null,16,0,2,14,0,"00","02","14","00"]
["00-03-00-13",5,null,16,0,3,0,13,"00","03","00","13"]
["00-03-01-12",5,null,16,0,3,1,12,"00","03","01","12"]
["00-03-02-11",5,null,16,0,3,2,11,"00","03","02","11"]
["00-03-03-10",5,null,16,0,3,3,10,"00","03","03","10"]
["00-03-04-09",5,null,16,0,3,4,9,"00","03","04","09"]
["00-03-05-08",5,null,16,0,3,5,8,"00","03","05","08"]
["00-03-06-07",5,null,16,0,3,6,7,"00","03","06","07"]
["00-03-07-06",5,null,16,0,3,7,6,"00","03","07","06"]
["00-03-08-05",5,null,16,0,3,8,5,"00","03","08","05"]
["00-03-09-04",5,null,16,0,3,9,4,"00","03","09","04"]
["00-03-10-03",4,null,16,0,3,10,3,"00","03","10","03"]
["00-03-11-02",4,null,16,0,3,11,2,"00","03","11","02"]
["00-03-12-01",4,null,16,0,3,12,1,"00","03","12","01"]
["00-03-13-00",4,null,16,0,3,13,0,"00","03","13","00"]
["00-04-00-12",5,null,16,0,4,0,12,"00","04","00","12"]
["00-04-01-11",5,null,16,0,4,1,11,"00","04","01","11"]
["00-04-02-10",5,null,16,0,4,2,10,"00","04","02","10"]
["00-04-03-09",5,null,16,0,4,3,9,"00","04","03","09"]
["00-04-04-08",5,null,16,0,4,4,8,"00","04","04","08"]
["00-04-05-07",5,null,16,0,4,5,7,"00","04","05","07"]
["00-04-06-06",5,null,16,0,4,6,6,"00","04","06","06"]
["00-04-07-05",5,null,16,0,4,7,5,"00","04","07","05"]
["00-04-08-04",5,null,16,0,4,8,4,"00","04","08","04"]
["00-04-09-03",4,null,16,0,4,9,3,"00","04","09","03"]
["00-04-10-02",4,null,16,0,4,10,2,"00","04","10","02"]
["00-04-11-01",4,null,16,0,4,11,1,"00","04","11","01"]
["00-04-12-00",4,null,16,0,4,12,0,"00","04","12","00"]
["00-05-00-11",5,null,16,0,5,0,11,"00","05","00","11"]
["00-05-01-10",5,null,16,0,5,1,10,"00","05","01","10"]
["00-05-02-09",5,null,16,0,5,2,9,"00","05","02","09"]
["00-05-03-08",5,null,16,0,5,3,8,"00","05","03","08"]
["00-05-04-07",5,null,16,0,5,4,7,"00","05","04","07"]
["00-05-05-06",5,null,16,0,5,5,6,"00","05","05","06"]
["00-05-06-05",5,null,16,0,5,6,5,"00","05","06","05"]
["00-05-07-04",5,null,16,0,5,7,4,"00","05","07","04"]
["00-05-08-03",4,null,16,0,5,8,3,"00","05","08","03"]
["00-05-09-02",4,null,16,0,5,9,2,"00","05","09","02"]
["00-05-10-01",4,null,16,0,5,10,1,"00","05","10","01"]
["00-05-11-00",4,null,16,0,5,11,0,"00","05","11","00"]
["00-06-00-10",5,null,16,0,6,0,10,"00","06","00","10"]
["00-06-01-09",5,null,16,0,6,1,9,"00","06","01","09"]
["00-06-02-08",5,null,16,0,6,2,8,"00","06","02","08"]
["00-06-03-07",5,null,16,0,6,3,7,"00","06","03","07"]
["00-06-04-06",5,null,16,0,6,4,6,"00","06","04","06"]
["00-06-05-05",4,null,16,0,6,5,5,"00","06","05","05"]
["00-06-06-04",4,null,16,0,6,6,4,"00","06","06","04"]
["00-06-07-03",4,null,16,0,6,7,3,"00","06","07","03"]
["00-06-08-02",4,null,16,0,6,8,2,"00","06","08","02"]
["00-06-09-01",4,null,16,0,6,9,1,"00","06","09","01"]
[{"$f":"I3975&\"-\"&J3975&\"-\"&K3975&\"-\"&L3975","v":"00-06-10-00"},4,null,16,0,6,10,0,"00","06","10","00"]
["00-07-00-09",5,null,16,0,7,0,9,{"$f":"IF(LEN(E3976)=1,0&E3976,IF(LEN(E3976)=0,\"00\",RIGHT(E3976,2)))","v":"00"},{"$f":"IF(LEN(F3976)=1,0&F3976,IF(LEN(F3976)=0,\"00\",RIGHT(F3976,2)))","v":"07"},{"$f":"IF(LEN(G3976)=1,0&G3976,IF(LEN(G3976)=0,\"00\",RIGHT(G3976,2)))","v":"00"},{"$f":"IF(LEN(H3976)=1,0&H3976,IF(LEN(H3976)=0,\"00\",RIGHT(H3976,2)))","v":"09"}]
["00-07-01-08",5,null,16,0,7,1,8,"00","07","01","08"]
["00-07-02-07",5,null,16,0,7,2,7,"00","07","02","07"]
["00-07-03-06",4,null,16,0,7,3,6,"00","07","03","06"]
["00-07-04-05",4,null,16,0,7,4,5,"00","07","04","05"]
["00-07-05-04",4,null,16,0,7,5,4,"00","07","05","04"]
["00-07-06-03",4,null,16,0,7,6,3,"00","07","06","03"]
["00-07-07-02",4,null,16,0,7,7,2,"00","07","07","02"]
["00-07-08-01",4,null,16,0,7,8,1,"00","07","08","01"]
["00-07-09-00",4,null,16,0,7,9,0,"00","07","09","00"]
["00-08-00-08",4,null,16,0,8,0,8,"00","08","00","08"]
["00-08-01-07",4,null,16,0,8,1,7,"00","08","01","07"]
["00-08-02-06",4,null,16,0,8,2,6,"00","08","02","06"]
["00-08-03-05",4,null,16,0,8,3,5,"00","08","03","05"]
["00-08-04-04",4,null,16,0,8,4,4,"00","08","04","04"]
["00-08-05-03",4,null,16,0,8,5,3,"00","08","05","03"]
["00-08-06-02",4,null,16,0,8,6,2,"00","08","06","02"]
["00-08-07-01",4,null,16,0,8,7,1,"00","08","07","01"]
["00-08-08-00",4,null,16,0,8,8,0,"00","08","08","00"]
["00-09-00-07",3,null,16,0,9,0,7,"00","09","00","07"]
["00-09-01-06",3,null,16,0,9,1,6,"00","09","01","06"]
["00-09-02-05",3,null,16,0,9,2,5,"00","09","02","05"]
["00-09-03-04",3,null,16,0,9,3,4,"00","09","03","04"]
["00-09-04-03",3,null,16,0,9,4,3,"00","09","04","03"]
["00-09-05-02",3,null,16,0,9,5,2,"00","09","05","02"]
["00-09-06-01",3,null,16,0,9,6,1,"00","09","06","01"]
["00-09-07-00",3,null,16,0,9,7,0,"00","09","07","00"]
["00-10-00-06",3,null,16,0,10,0,6,"00","10","00","06"]
["00-10-01-05",3,null,16,0,10,1,5,"00","10","01","05"]
["00-10-02-04",3,null,16,0,10,2,4,"00","10","02","04"]
["00-10-03-03",3,null,16,0,10,3,3,"00","10","03","03"]
["00-10-04-02",3,null,16,0,10,4,2,"00","10","04","02"]
["00-10-05-01",3,null,16,0,10,5,1,"00","10","05","01"]
["00-10-06-00",3,null,16,0,10,6,0,"00","10","06","00"]
["00-11-00-05",3,null,16,0,11,0,5,"00","11","00","05"]
["00-11-01-04",3,null,16,0,11,1,4,"00","11","01","04"]
["00-11-02-03",3,null,16,0,11,2,3,"00","11","02","03"]
["00-11-03-02",3,null,16,0,11,3,2,"00","11","03","02"]
["00-11-04-01",3,null,16,0,11,4,1,"00","11","04","01"]
["00-11-05-00",3,null,16,0,11,5,0,"00","11","05","00"]
["00-12-00-04",3,null,16,0,12,0,4,"00","12","00","04"]
["00-12-01-03",3,null,16,0,12,1,3,"00","12","01","03"]
["00-12-02-02",3,null,16,0,12,2,2,"00","12","02","02"]
["00-12-03-01",3,null,16,0,12,3,1,"00","12","03","01"]
["00-12-04-00",3,null,16,0,12,4,0,"00","12","04","00"]
["00-13-00-03",3,null,16,0,13,0,3,"00","13","00","03"]
["00-13-01-02",3,null,16,0,13,1,2,"00","13","01","02"]
["00-13-02-01",3,null,16,0,13,2,1,"00","13","02","01"]
["00-13-03-00",3,null,16,0,13,3,0,"00","13","03","00"]
["00-14-00-02",3,null,16,0,14,0,2,"00","14","00","02"]
["00-14-01-01",2,null,16,0,14,1,1,"00","14","01","01"]
["00-14-02-00",2,null,16,0,14,2,0,"00","14","02","00"]
["00-15-00-01",2,null,16,0,15,0,1,"00","15","00","01"]
["00-15-01-00",2,null,16,0,15,1,0,"00","15","01","00"]
["00-16-00-00",2,null,16,0,16,0,0,"00","16","00","00"]
["01-00-00-15",5,null,16,1,0,0,15,"01","00","00","15"]
["01-00-01-14",5,null,16,1,0,1,14,"01","00","01","14"]
["01-00-02-13",5,null,16,1,0,2,13,"01","00","02","13"]
["01-00-03-12",5,null,16,1,0,3,12,"01","00","03","12"]
["01-00-04-11",5,null,16,1,0,4,11,"01","00","04","11"]
["01-00-05-10",5,null,16,1,0,5,10,"01","00","05","10"]
["01-00-06-09",5,null,16,1,0,6,9,"01","00","06","09"]
["01-00-07-08",5,null,16,1,0,7,8,"01","00","07","08"]
[{"$f":"I4039&\"-\"&J4039&\"-\"&K4039&\"-\"&L4039","v":"01-00-08-07"},5,null,16,1,0,8,7,"01","00","08","07"]
["01-00-09-06",5,null,16,1,0,9,6,{"$f":"IF(LEN(E4040)=1,0&E4040,IF(LEN(E4040)=0,\"00\",RIGHT(E4040,2)))","v":"01"},{"$f":"IF(LEN(F4040)=1,0&F4040,IF(LEN(F4040)=0,\"00\",RIGHT(F4040,2)))","v":"00"},{"$f":"IF(LEN(G4040)=1,0&G4040,IF(LEN(G4040)=0,\"00\",RIGHT(G4040,2)))","v":"09"},{"$f":"IF(LEN(H4040)=1,0&H4040,IF(LEN(H4040)=0,\"00\",RIGHT(H4040,2)))","v":"06"}]
["01-00-10-05",5,null,16,1,0,10,5,"01","00","10","05"]
["01-00-11-04",5,null,16,1,0,11,4,"01","00","11","04"]
["01-00-12-03",4,null,16,1,0,12,3,"01","00","12","03"]
["01-00-13-02",4,null,16,1,0,13,2,"01","00","13","02"]
["01-00-14-01",4,null,16,1,0,14,1,"01","00","14","01"]
["01-00-15-00",4,null,16,1,0,15,0,"01","00","15","00"]
["01-01-00-14",5,null,16,1,1,0,14,"01","01","00","14"]
["01-01-01-13",5,null,16,1,1,1,13,"01","01","01","13"]
["01-01-02-12",5,null,16,1,1,2,12,"01","01","02","12"]
["01-01-03-11",5,null,16,1,1,3,11,"01","01","03","11"]
["01-01-04-10",5,null,16,1,1,4,10,"01","01","04","10"]
["01-01-05-09",5,null,16,1,1,5,9,"01","01","05","09"]
["01-01-06-08",5,null,16,1,1,6,8,"01","01","06","08"]
["01-01-07-07",5,null,16,1,1,7,7,"01","01","07","07"]
["01-01-08-06",5,null,16,1,1,8,6,"01","01","08","06"]
["01-01-09-05",5,null,16,1,1,9,5,"01","01","09","05"]
["01-01-10-04",5,null,16,1,1,10,4,"01","01","10","04"]
["01-01-11-03",4,null,16,1,1,11,3,"01","01","11","03"]
["01-01-12-02",4,null,16,1,1,12,2,"01","01","12","02"]
["01-01-13-01",4,null,16,1,1,13,1,"01","01","13","01"]
["01-01-14-00",4,null,16,1,1,14,0,"01","01","14","00"]
["01-02-00-13",5,null,16,1,2,0,13,"01","02","00","13"]
["01-02-01-12",5,null,16,1,2,1,12,"01","02","01","12"]
["01-02-02-11",5,null,16,1,2,2,11,"01","02","02","11"]
["01-02-03-10",5,null,16,1,2,3,10,"01","02","03","10"]
["01-02-04-09",5,null,16,1,2,4,9,"01","02","04","09"]
["01-02-05-08",5,null,16,1,2,5,8,"01","02","05","08"]
["01-02-06-07",5,null,16,1,2,6,7,"01","02","06","07"]
["01-02-07-06",5,null,16,1,2,7,6,"01","02","07","06"]
["01-02-08-05",5,null,16,1,2,8,5,"01","02","08","05"]
["01-02-09-04",5,null,16,1,2,9,4,"01","02","09","04"]
["01-02-10-03",4,null,16,1,2,10,3,"01","02","10","03"]
["01-02-11-02",4,null,16,1,2,11,2,"01","02","11","02"]
["01-02-12-01",4,null,16,1,2,12,1,"01","02","12","01"]
["01-02-13-00",4,null,16,1,2,13,0,"01","02","13","00"]
["01-03-00-12",5,null,16,1,3,0,12,"01","03","00","12"]
["01-03-01-11",5,null,16,1,3,1,11,"01","03","01","11"]
["01-03-02-10",5,null,16,1,3,2,10,"01","03","02","10"]
["01-03-03-09",5,null,16,1,3,3,9,"01","03","03","09"]
["01-03-04-08",5,null,16,1,3,4,8,"01","03","04","08"]
["01-03-05-07",5,null,16,1,3,5,7,"01","03","05","07"]
["01-03-06-06",5,null,16,1,3,6,6,"01","03","06","06"]
["01-03-07-05",5,null,16,1,3,7,5,"01","03","07","05"]
["01-03-08-04",5,null,16,1,3,8,4,"01","03","08","04"]
["01-03-09-03",4,null,16,1,3,9,3,"01","03","09","03"]
["01-03-10-02",4,null,16,1,3,10,2,"01","03","10","02"]
["01-03-11-01",4,null,16,1,3,11,1,"01","03","11","01"]
["01-03-12-00",4,null,16,1,3,12,0,"01","03","12","00"]
["01-04-00-11",5,null,16,1,4,0,11,"01","04","00","11"]
["01-04-01-10",5,null,16,1,4,1,10,"01","04","01","10"]
["01-04-02-09",5,null,16,1,4,2,9,"01","04","02","09"]
["01-04-03-08",5,null,16,1,4,3,8,"01","04","03","08"]
["01-04-04-07",5,null,16,1,4,4,7,"01","04","04","07"]
["01-04-05-06",5,null,16,1,4,5,6,"01","04","05","06"]
["01-04-06-05",4,null,16,1,4,6,5,"01","04","06","05"]
["01-04-07-04",4,null,16,1,4,7,4,"01","04","07","04"]
["01-04-08-03",4,null,16,1,4,8,3,"01","04","08","03"]
["01-04-09-02",4,null,16,1,4,9,2,"01","04","09","02"]
["01-04-10-01",4,null,16,1,4,10,1,"01","04","10","01"]
["01-04-11-00",4,null,16,1,4,11,0,"01","04","11","00"]
["01-05-00-10",5,null,16,1,5,0,10,"01","05","00","10"]
["01-05-01-09",5,null,16,1,5,1,9,"01","05","01","09"]
[{"$f":"I4103&\"-\"&J4103&\"-\"&K4103&\"-\"&L4103","v":"01-05-02-08"},5,null,16,1,5,2,8,"01","05","02","08"]
["01-05-03-07",5,null,16,1,5,3,7,{"$f":"IF(LEN(E4104)=1,0&E4104,IF(LEN(E4104)=0,\"00\",RIGHT(E4104,2)))","v":"01"},{"$f":"IF(LEN(F4104)=1,0&F4104,IF(LEN(F4104)=0,\"00\",RIGHT(F4104,2)))","v":"05"},{"$f":"IF(LEN(G4104)=1,0&G4104,IF(LEN(G4104)=0,\"00\",RIGHT(G4104,2)))","v":"03"},{"$f":"IF(LEN(H4104)=1,0&H4104,IF(LEN(H4104)=0,\"00\",RIGHT(H4104,2)))","v":"07"}]
["01-05-04-06",4,null,16,1,5,4,6,"01","05","04","06"]
["01-05-05-05",4,null,16,1,5,5,5,"01","05","05","05"]
["01-05-06-04",4,null,16,1,5,6,4,"01","05","06","04"]
["01-05-07-03",4,null,16,1,5,7,3,"01","05","07","03"]
["01-05-08-02",4,null,16,1,5,8,2,"01","05","08","02"]
["01-05-09-01",4,null,16,1,5,9,1,"01","05","09","01"]
["01-05-10-00",4,null,16,1,5,10,0,"01","05","10","00"]
["01-06-00-09",5,null,16,1,6,0,9,"01","06","00","09"]
["01-06-01-08",4,null,16,1,6,1,8,"01","06","01","08"]
["01-06-02-07",4,null,16,1,6,2,7,"01","06","02","07"]
["01-06-03-06",4,null,16,1,6,3,6,"01","06","03","06"]
["01-06-04-05",4,null,16,1,6,4,5,"01","06","04","05"]
["01-06-05-04",4,null,16,1,6,5,4,"01","06","05","04"]
["01-06-06-03",4,null,16,1,6,6,3,"01","06","06","03"]
["01-06-07-02",4,null,16,1,6,7,2,"01","06","07","02"]
["01-06-08-01",4,null,16,1,6,8,1,"01","06","08","01"]
["01-06-09-00",4,null,16,1,6,9,0,"01","06","09","00"]
["01-07-00-08",4,null,16,1,7,0,8,"01","07","00","08"]
["01-07-01-07",4,null,16,1,7,1,7,"01","07","01","07"]
["01-07-02-06",4,null,16,1,7,2,6,"01","07","02","06"]
["01-07-03-05",4,null,16,1,7,3,5,"01","07","03","05"]
["01-07-04-04",4,null,16,1,7,4,4,"01","07","04","04"]
["01-07-05-03",4,null,16,1,7,5,3,"01","07","05","03"]
["01-07-06-02",4,null,16,1,7,6,2,"01","07","06","02"]
["01-07-07-01",4,null,16,1,7,7,1,"01","07","07","01"]
["01-07-08-00",4,null,16,1,7,8,0,"01","07","08","00"]
["01-08-00-07",3,null,16,1,8,0,7,"01","08","00","07"]
["01-08-01-06",3,null,16,1,8,1,6,"01","08","01","06"]
["01-08-02-05",3,null,16,1,8,2,5,"01","08","02","05"]
["01-08-03-04",3,null,16,1,8,3,4,"01","08","03","04"]
["01-08-04-03",3,null,16,1,8,4,3,"01","08","04","03"]
["01-08-05-02",3,null,16,1,8,5,2,"01","08","05","02"]
["01-08-06-01",3,null,16,1,8,6,1,"01","08","06","01"]
["01-08-07-00",3,null,16,1,8,7,0,"01","08","07","00"]
["01-09-00-06",3,null,16,1,9,0,6,"01","09","00","06"]
["01-09-01-05",3,null,16,1,9,1,5,"01","09","01","05"]
["01-09-02-04",3,null,16,1,9,2,4,"01","09","02","04"]
["01-09-03-03",3,null,16,1,9,3,3,"01","09","03","03"]
["01-09-04-02",3,null,16,1,9,4,2,"01","09","04","02"]
["01-09-05-01",3,null,16,1,9,5,1,"01","09","05","01"]
["01-09-06-00",3,null,16,1,9,6,0,"01","09","06","00"]
["01-10-00-05",3,null,16,1,10,0,5,"01","10","00","05"]
["01-10-01-04",3,null,16,1,10,1,4,"01","10","01","04"]
["01-10-02-03",3,null,16,1,10,2,3,"01","10","02","03"]
["01-10-03-02",3,null,16,1,10,3,2,"01","10","03","02"]
["01-10-04-01",3,null,16,1,10,4,1,"01","10","04","01"]
["01-10-05-00",3,null,16,1,10,5,0,"01","10","05","00"]
["01-11-00-04",3,null,16,1,11,0,4,"01","11","00","04"]
["01-11-01-03",3,null,16,1,11,1,3,"01","11","01","03"]
["01-11-02-02",3,null,16,1,11,2,2,"01","11","02","02"]
["01-11-03-01",3,null,16,1,11,3,1,"01","11","03","01"]
["01-11-04-00",3,null,16,1,11,4,0,"01","11","04","00"]
["01-12-00-03",3,null,16,1,12,0,3,"01","12","00","03"]
["01-12-01-02",3,null,16,1,12,1,2,"01","12","01","02"]
["01-12-02-01",2,null,16,1,12,2,1,"01","12","02","01"]
["01-12-03-00",2,null,16,1,12,3,0,"01","12","03","00"]
["01-13-00-02",2,null,16,1,13,0,2,"01","13","00","02"]
["01-13-01-01",2,null,16,1,13,1,1,"01","13","01","01"]
["01-13-02-00",2,null,16,1,13,2,0,"01","13","02","00"]
["01-14-00-01",2,null,16,1,14,0,1,"01","14","00","01"]
["01-14-01-00",2,null,16,1,14,1,0,"01","14","01","00"]
["01-15-00-00",2,null,16,1,15,0,0,"01","15","00","00"]
[{"$f":"I4167&\"-\"&J4167&\"-\"&K4167&\"-\"&L4167","v":"02-00-00-14"},5,null,16,2,0,0,14,"02","00","00","14"]
["02-00-01-13",5,null,16,2,0,1,13,{"$f":"IF(LEN(E4168)=1,0&E4168,IF(LEN(E4168)=0,\"00\",RIGHT(E4168,2)))","v":"02"},{"$f":"IF(LEN(F4168)=1,0&F4168,IF(LEN(F4168)=0,\"00\",RIGHT(F4168,2)))","v":"00"},{"$f":"IF(LEN(G4168)=1,0&G4168,IF(LEN(G4168)=0,\"00\",RIGHT(G4168,2)))","v":"01"},{"$f":"IF(LEN(H4168)=1,0&H4168,IF(LEN(H4168)=0,\"00\",RIGHT(H4168,2)))","v":"13"}]
["02-00-02-12",5,null,16,2,0,2,12,"02","00","02","12"]
["02-00-03-11",5,null,16,2,0,3,11,"02","00","03","11"]
["02-00-04-10",5,null,16,2,0,4,10,"02","00","04","10"]
["02-00-05-09",5,null,16,2,0,5,9,"02","00","05","09"]
["02-00-06-08",5,null,16,2,0,6,8,"02","00","06","08"]
["02-00-07-07",5,null,16,2,0,7,7,"02","00","07","07"]
["02-00-08-06",5,null,16,2,0,8,6,"02","00","08","06"]
["02-00-09-05",5,null,16,2,0,9,5,"02","00","09","05"]
["02-00-10-04",5,null,16,2,0,10,4,"02","00","10","04"]
["02-00-11-03",4,null,16,2,0,11,3,"02","00","11","03"]
["02-00-12-02",4,null,16,2,0,12,2,"02","00","12","02"]
["02-00-13-01",4,null,16,2,0,13,1,"02","00","13","01"]
["02-00-14-00",4,null,16,2,0,14,0,"02","00","14","00"]
["02-01-00-13",5,null,16,2,1,0,13,"02","01","00","13"]
["02-01-01-12",5,null,16,2,1,1,12,"02","01","01","12"]
["02-01-02-11",5,null,16,2,1,2,11,"02","01","02","11"]
["02-01-03-10",5,null,16,2,1,3,10,"02","01","03","10"]
["02-01-04-09",5,null,16,2,1,4,9,"02","01","04","09"]
["02-01-05-08",5,null,16,2,1,5,8,"02","01","05","08"]
["02-01-06-07",5,null,16,2,1,6,7,"02","01","06","07"]
["02-01-07-06",5,null,16,2,1,7,6,"02","01","07","06"]
["02-01-08-05",5,null,16,2,1,8,5,"02","01","08","05"]
["02-01-09-04",5,null,16,2,1,9,4,"02","01","09","04"]
["02-01-10-03",4,null,16,2,1,10,3,"02","01","10","03"]
["02-01-11-02",4,null,16,2,1,11,2,"02","01","11","02"]
["02-01-12-01",4,null,16,2,1,12,1,"02","01","12","01"]
["02-01-13-00",4,null,16,2,1,13,0,"02","01","13","00"]
["02-02-00-12",5,null,16,2,2,0,12,"02","02","00","12"]
["02-02-01-11",5,null,16,2,2,1,11,"02","02","01","11"]
["02-02-02-10",5,null,16,2,2,2,10,"02","02","02","10"]
["02-02-03-09",5,null,16,2,2,3,9,"02","02","03","09"]
["02-02-04-08",5,null,16,2,2,4,8,"02","02","04","08"]
["02-02-05-07",5,null,16,2,2,5,7,"02","02","05","07"]
["02-02-06-06",5,null,16,2,2,6,6,"02","02","06","06"]
["02-02-07-05",4,null,16,2,2,7,5,"02","02","07","05"]
["02-02-08-04",4,null,16,2,2,8,4,"02","02","08","04"]
["02-02-09-03",4,null,16,2,2,9,3,"02","02","09","03"]
["02-02-10-02",4,null,16,2,2,10,2,"02","02","10","02"]
["02-02-11-01",4,null,16,2,2,11,1,"02","02","11","01"]
["02-02-12-00",4,null,16,2,2,12,0,"02","02","12","00"]
["02-03-00-11",5,null,16,2,3,0,11,"02","03","00","11"]
["02-03-01-10",5,null,16,2,3,1,10,"02","03","01","10"]
["02-03-02-09",5,null,16,2,3,2,9,"02","03","02","09"]
["02-03-03-08",5,null,16,2,3,3,8,"02","03","03","08"]
["02-03-04-07",5,null,16,2,3,4,7,"02","03","04","07"]
["02-03-05-06",4,null,16,2,3,5,6,"02","03","05","06"]
["02-03-06-05",4,null,16,2,3,6,5,"02","03","06","05"]
["02-03-07-04",4,null,16,2,3,7,4,"02","03","07","04"]
["02-03-08-03",4,null,16,2,3,8,3,"02","03","08","03"]
["02-03-09-02",4,null,16,2,3,9,2,"02","03","09","02"]
["02-03-10-01",4,null,16,2,3,10,1,"02","03","10","01"]
["02-03-11-00",4,null,16,2,3,11,0,"02","03","11","00"]
["02-04-00-10",5,null,16,2,4,0,10,"02","04","00","10"]
["02-04-01-09",5,null,16,2,4,1,9,"02","04","01","09"]
["02-04-02-08",4,null,16,2,4,2,8,"02","04","02","08"]
["02-04-03-07",4,null,16,2,4,3,7,"02","04","03","07"]
["02-04-04-06",4,null,16,2,4,4,6,"02","04","04","06"]
["02-04-05-05",4,null,16,2,4,5,5,"02","04","05","05"]
["02-04-06-04",4,null,16,2,4,6,4,"02","04","06","04"]
["02-04-07-03",4,null,16,2,4,7,3,"02","04","07","03"]
["02-04-08-02",4,null,16,2,4,8,2,"02","04","08","02"]
["02-04-09-01",4,null,16,2,4,9,1,"02","04","09","01"]
[{"$f":"I4231&\"-\"&J4231&\"-\"&K4231&\"-\"&L4231","v":"02-04-10-00"},4,null,16,2,4,10,0,"02","04","10","00"]
["02-05-00-09",4,null,16,2,5,0,9,{"$f":"IF(LEN(E4232)=1,0&E4232,IF(LEN(E4232)=0,\"00\",RIGHT(E4232,2)))","v":"02"},{"$f":"IF(LEN(F4232)=1,0&F4232,IF(LEN(F4232)=0,\"00\",RIGHT(F4232,2)))","v":"05"},{"$f":"IF(LEN(G4232)=1,0&G4232,IF(LEN(G4232)=0,\"00\",RIGHT(G4232,2)))","v":"00"},{"$f":"IF(LEN(H4232)=1,0&H4232,IF(LEN(H4232)=0,\"00\",RIGHT(H4232,2)))","v":"09"}]
["02-05-01-08",4,null,16,2,5,1,8,"02","05","01","08"]
["02-05-02-07",4,null,16,2,5,2,7,"02","05","02","07"]
["02-05-03-06",4,null,16,2,5,3,6,"02","05","03","06"]
["02-05-04-05",4,null,16,2,5,4,5,"02","05","04","05"]
["02-05-05-04",4,null,16,2,5,5,4,"02","05","05","04"]
["02-05-06-03",4,null,16,2,5,6,3,"02","05","06","03"]
["02-05-07-02",4,null,16,2,5,7,2,"02","05","07","02"]
["02-05-08-01",4,null,16,2,5,8,1,"02","05","08","01"]
["02-05-09-00",4,null,16,2,5,9,0,"02","05","09","00"]
["02-06-00-08",4,null,16,2,6,0,8,"02","06","00","08"]
["02-06-01-07",4,null,16,2,6,1,7,"02","06","01","07"]
["02-06-02-06",4,null,16,2,6,2,6,"02","06","02","06"]
["02-06-03-05",4,null,16,2,6,3,5,"02","06","03","05"]
["02-06-04-04",4,null,16,2,6,4,4,"02","06","04","04"]
["02-06-05-03",4,null,16,2,6,5,3,"02","06","05","03"]
["02-06-06-02",4,null,16,2,6,6,2,"02","06","06","02"]
["02-06-07-01",4,null,16,2,6,7,1,"02","06","07","01"]
["02-06-08-00",4,null,16,2,6,8,0,"02","06","08","00"]
["02-07-00-07",3,null,16,2,7,0,7,"02","07","00","07"]
["02-07-01-06",3,null,16,2,7,1,6,"02","07","01","06"]
["02-07-02-05",3,null,16,2,7,2,5,"02","07","02","05"]
["02-07-03-04",3,null,16,2,7,3,4,"02","07","03","04"]
["02-07-04-03",3,null,16,2,7,4,3,"02","07","04","03"]
["02-07-05-02",3,null,16,2,7,5,2,"02","07","05","02"]
["02-07-06-01",3,null,16,2,7,6,1,"02","07","06","01"]
["02-07-07-00",3,null,16,2,7,7,0,"02","07","07","00"]
["02-08-00-06",3,null,16,2,8,0,6,"02","08","00","06"]
["02-08-01-05",3,null,16,2,8,1,5,"02","08","01","05"]
["02-08-02-04",3,null,16,2,8,2,4,"02","08","02","04"]
["02-08-03-03",3,null,16,2,8,3,3,"02","08","03","03"]
["02-08-04-02",3,null,16,2,8,4,2,"02","08","04","02"]
["02-08-05-01",3,null,16,2,8,5,1,"02","08","05","01"]
["02-08-06-00",3,null,16,2,8,6,0,"02","08","06","00"]
["02-09-00-05",3,null,16,2,9,0,5,"02","09","00","05"]
["02-09-01-04",3,null,16,2,9,1,4,"02","09","01","04"]
["02-09-02-03",3,null,16,2,9,2,3,"02","09","02","03"]
["02-09-03-02",3,null,16,2,9,3,2,"02","09","03","02"]
["02-09-04-01",3,null,16,2,9,4,1,"02","09","04","01"]
["02-09-05-00",3,null,16,2,9,5,0,"02","09","05","00"]
["02-10-00-04",3,null,16,2,10,0,4,"02","10","00","04"]
["02-10-01-03",3,null,16,2,10,1,3,"02","10","01","03"]
["02-10-02-02",3,null,16,2,10,2,2,"02","10","02","02"]
["02-10-03-01",2,null,16,2,10,3,1,"02","10","03","01"]
["02-10-04-00",2,null,16,2,10,4,0,"02","10","04","00"]
["02-11-00-03",3,null,16,2,11,0,3,"02","11","00","03"]
["02-11-01-02",2,null,16,2,11,1,2,"02","11","01","02"]
["02-11-02-01",2,null,16,2,11,2,1,"02","11","02","01"]
["02-11-03-00",2,null,16,2,11,3,0,"02","11","03","00"]
["02-12-00-02",2,null,16,2,12,0,2,"02","12","00","02"]
["02-12-01-01",2,null,16,2,12,1,1,"02","12","01","01"]
["02-12-02-00",2,null,16,2,12,2,0,"02","12","02","00"]
["02-13-00-01",2,null,16,2,13,0,1,"02","13","00","01"]
["02-13-01-00",2,null,16,2,13,1,0,"02","13","01","00"]
["02-14-00-00",2,null,16,2,14,0,0,"02","14","00","00"]
["03-00-00-13",5,null,16,3,0,0,13,"03","00","00","13"]
["03-00-01-12",5,null,16,3,0,1,12,"03","00","01","12"]
["03-00-02-11",5,null,16,3,0,2,11,"03","00","02","11"]
["03-00-03-10",5,null,16,3,0,3,10,"03","00","03","10"]
["03-00-04-09",5,null,16,3,0,4,9,"03","00","04","09"]
["03-00-05-08",5,null,16,3,0,5,8,"03","00","05","08"]
["03-00-06-07",5,null,16,3,0,6,7,"03","00","06","07"]
["03-00-07-06",5,null,16,3,0,7,6,"03","00","07","06"]
[{"$f":"I4295&\"-\"&J4295&\"-\"&K4295&\"-\"&L4295","v":"03-00-08-05"},4,null,16,3,0,8,5,"03","00","08","05"]
["03-00-09-04",4,null,16,3,0,9,4,{"$f":"IF(LEN(E4296)=1,0&E4296,IF(LEN(E4296)=0,\"00\",RIGHT(E4296,2)))","v":"03"},{"$f":"IF(LEN(F4296)=1,0&F4296,IF(LEN(F4296)=0,\"00\",RIGHT(F4296,2)))","v":"00"},{"$f":"IF(LEN(G4296)=1,0&G4296,IF(LEN(G4296)=0,\"00\",RIGHT(G4296,2)))","v":"09"},{"$f":"IF(LEN(H4296)=1,0&H4296,IF(LEN(H4296)=0,\"00\",RIGHT(H4296,2)))","v":"04"}]
["03-00-10-03",4,null,16,3,0,10,3,"03","00","10","03"]
["03-00-11-02",4,null,16,3,0,11,2,"03","00","11","02"]
["03-00-12-01",4,null,16,3,0,12,1,"03","00","12","01"]
["03-00-13-00",4,null,16,3,0,13,0,"03","00","13","00"]
["03-01-00-12",5,null,16,3,1,0,12,"03","01","00","12"]
["03-01-01-11",5,null,16,3,1,1,11,"03","01","01","11"]
["03-01-02-10",5,null,16,3,1,2,10,"03","01","02","10"]
["03-01-03-09",5,null,16,3,1,3,9,"03","01","03","09"]
["03-01-04-08",5,null,16,3,1,4,8,"03","01","04","08"]
["03-01-05-07",5,null,16,3,1,5,7,"03","01","05","07"]
["03-01-06-06",4,null,16,3,1,6,6,"03","01","06","06"]
["03-01-07-05",4,null,16,3,1,7,5,"03","01","07","05"]
["03-01-08-04",4,null,16,3,1,8,4,"03","01","08","04"]
["03-01-09-03",4,null,16,3,1,9,3,"03","01","09","03"]
["03-01-10-02",4,null,16,3,1,10,2,"03","01","10","02"]
["03-01-11-01",4,null,16,3,1,11,1,"03","01","11","01"]
["03-01-12-00",4,null,16,3,1,12,0,"03","01","12","00"]
["03-02-00-11",5,null,16,3,2,0,11,"03","02","00","11"]
["03-02-01-10",5,null,16,3,2,1,10,"03","02","01","10"]
["03-02-02-09",5,null,16,3,2,2,9,"03","02","02","09"]
["03-02-03-08",4,null,16,3,2,3,8,"03","02","03","08"]
["03-02-04-07",4,null,16,3,2,4,7,"03","02","04","07"]
["03-02-05-06",4,null,16,3,2,5,6,"03","02","05","06"]
["03-02-06-05",4,null,16,3,2,6,5,"03","02","06","05"]
["03-02-07-04",4,null,16,3,2,7,4,"03","02","07","04"]
["03-02-08-03",4,null,16,3,2,8,3,"03","02","08","03"]
["03-02-09-02",4,null,16,3,2,9,2,"03","02","09","02"]
["03-02-10-01",4,null,16,3,2,10,1,"03","02","10","01"]
["03-02-11-00",4,null,16,3,2,11,0,"03","02","11","00"]
["03-03-00-10",5,null,16,3,3,0,10,"03","03","00","10"]
["03-03-01-09",4,null,16,3,3,1,9,"03","03","01","09"]
["03-03-02-08",4,null,16,3,3,2,8,"03","03","02","08"]
["03-03-03-07",4,null,16,3,3,3,7,"03","03","03","07"]
["03-03-04-06",4,null,16,3,3,4,6,"03","03","04","06"]
["03-03-05-05",4,null,16,3,3,5,5,"03","03","05","05"]
["03-03-06-04",4,null,16,3,3,6,4,"03","03","06","04"]
["03-03-07-03",4,null,16,3,3,7,3,"03","03","07","03"]
["03-03-08-02",4,null,16,3,3,8,2,"03","03","08","02"]
["03-03-09-01",4,null,16,3,3,9,1,"03","03","09","01"]
["03-03-10-00",4,null,16,3,3,10,0,"03","03","10","00"]
["03-04-00-09",4,null,16,3,4,0,9,"03","04","00","09"]
["03-04-01-08",4,null,16,3,4,1,8,"03","04","01","08"]
["03-04-02-07",4,null,16,3,4,2,7,"03","04","02","07"]
["03-04-03-06",4,null,16,3,4,3,6,"03","04","03","06"]
["03-04-04-05",4,null,16,3,4,4,5,"03","04","04","05"]
["03-04-05-04",4,null,16,3,4,5,4,"03","04","05","04"]
["03-04-06-03",4,null,16,3,4,6,3,"03","04","06","03"]
["03-04-07-02",4,null,16,3,4,7,2,"03","04","07","02"]
["03-04-08-01",4,null,16,3,4,8,1,"03","04","08","01"]
["03-04-09-00",4,null,16,3,4,9,0,"03","04","09","00"]
["03-05-00-08",4,null,16,3,5,0,8,"03","05","00","08"]
["03-05-01-07",4,null,16,3,5,1,7,"03","05","01","07"]
["03-05-02-06",4,null,16,3,5,2,6,"03","05","02","06"]
["03-05-03-05",4,null,16,3,5,3,5,"03","05","03","05"]
["03-05-04-04",4,null,16,3,5,4,4,"03","05","04","04"]
["03-05-05-03",4,null,16,3,5,5,3,"03","05","05","03"]
["03-05-06-02",4,null,16,3,5,6,2,"03","05","06","02"]
["03-05-07-01",4,null,16,3,5,7,1,"03","05","07","01"]
["03-05-08-00",4,null,16,3,5,8,0,"03","05","08","00"]
["03-06-00-07",3,null,16,3,6,0,7,"03","06","00","07"]
["03-06-01-06",3,null,16,3,6,1,6,"03","06","01","06"]
["03-06-02-05",3,null,16,3,6,2,5,"03","06","02","05"]
[{"$f":"I4359&\"-\"&J4359&\"-\"&K4359&\"-\"&L4359","v":"03-06-03-04"},3,null,16,3,6,3,4,"03","06","03","04"]
["03-06-04-03",3,null,16,3,6,4,3,{"$f":"IF(LEN(E4360)=1,0&E4360,IF(LEN(E4360)=0,\"00\",RIGHT(E4360,2)))","v":"03"},{"$f":"IF(LEN(F4360)=1,0&F4360,IF(LEN(F4360)=0,\"00\",RIGHT(F4360,2)))","v":"06"},{"$f":"IF(LEN(G4360)=1,0&G4360,IF(LEN(G4360)=0,\"00\",RIGHT(G4360,2)))","v":"04"},{"$f":"IF(LEN(H4360)=1,0&H4360,IF(LEN(H4360)=0,\"00\",RIGHT(H4360,2)))","v":"03"}]
["03-06-05-02",3,null,16,3,6,5,2,"03","06","05","02"]
["03-06-06-01",3,null,16,3,6,6,1,"03","06","06","01"]
["03-06-07-00",3,null,16,3,6,7,0,"03","06","07","00"]
["03-07-00-06",3,null,16,3,7,0,6,"03","07","00","06"]
["03-07-01-05",3,null,16,3,7,1,5,"03","07","01","05"]
["03-07-02-04",3,null,16,3,7,2,4,"03","07","02","04"]
["03-07-03-03",3,null,16,3,7,3,3,"03","07","03","03"]
["03-07-04-02",3,null,16,3,7,4,2,"03","07","04","02"]
["03-07-05-01",3,null,16,3,7,5,1,"03","07","05","01"]
["03-07-06-00",3,null,16,3,7,6,0,"03","07","06","00"]
["03-08-00-05",3,null,16,3,8,0,5,"03","08","00","05"]
["03-08-01-04",3,null,16,3,8,1,4,"03","08","01","04"]
["03-08-02-03",3,null,16,3,8,2,3,"03","08","02","03"]
["03-08-03-02",3,null,16,3,8,3,2,"03","08","03","02"]
["03-08-04-01",3,null,16,3,8,4,1,"03","08","04","01"]
["03-08-05-00",3,null,16,3,8,5,0,"03","08","05","00"]
["03-09-00-04",3,null,16,3,9,0,4,"03","09","00","04"]
["03-09-01-03",3,null,16,3,9,1,3,"03","09","01","03"]
["03-09-02-02",2,null,16,3,9,2,2,"03","09","02","02"]
["03-09-03-01",2,null,16,3,9,3,1,"03","09","03","01"]
["03-09-04-00",2,null,16,3,9,4,0,"03","09","04","00"]
["03-10-00-03",2,null,16,3,10,0,3,"03","10","00","03"]
["03-10-01-02",2,null,16,3,10,1,2,"03","10","01","02"]
["03-10-02-01",2,null,16,3,10,2,1,"03","10","02","01"]
["03-10-03-00",2,null,16,3,10,3,0,"03","10","03","00"]
["03-11-00-02",2,null,16,3,11,0,2,"03","11","00","02"]
["03-11-01-01",2,null,16,3,11,1,1,"03","11","01","01"]
["03-11-02-00",2,null,16,3,11,2,0,"03","11","02","00"]
["03-12-00-01",2,null,16,3,12,0,1,"03","12","00","01"]
["03-12-01-00",2,null,16,3,12,1,0,"03","12","01","00"]
["03-13-00-00",2,null,16,3,13,0,0,"03","13","00","00"]
["04-00-00-12",5,null,16,4,0,0,12,"04","00","00","12"]
["04-00-01-11",5,null,16,4,0,1,11,"04","00","01","11"]
["04-00-02-10",5,null,16,4,0,2,10,"04","00","02","10"]
["04-00-03-09",5,null,16,4,0,3,9,"04","00","03","09"]
["04-00-04-08",4,null,16,4,0,4,8,"04","00","04","08"]
["04-00-05-07",4,null,16,4,0,5,7,"04","00","05","07"]
["04-00-06-06",4,null,16,4,0,6,6,"04","00","06","06"]
["04-00-07-05",4,null,16,4,0,7,5,"04","00","07","05"]
["04-00-08-04",4,null,16,4,0,8,4,"04","00","08","04"]
["04-00-09-03",4,null,16,4,0,9,3,"04","00","09","03"]
["04-00-10-02",4,null,16,4,0,10,2,"04","00","10","02"]
["04-00-11-01",4,null,16,4,0,11,1,"04","00","11","01"]
["04-00-12-00",4,null,16,4,0,12,0,"04","00","12","00"]
["04-01-00-11",5,null,16,4,1,0,11,"04","01","00","11"]
["04-01-01-10",5,null,16,4,1,1,10,"04","01","01","10"]
["04-01-02-09",4,null,16,4,1,2,9,"04","01","02","09"]
["04-01-03-08",4,null,16,4,1,3,8,"04","01","03","08"]
["04-01-04-07",4,null,16,4,1,4,7,"04","01","04","07"]
["04-01-05-06",4,null,16,4,1,5,6,"04","01","05","06"]
["04-01-06-05",4,null,16,4,1,6,5,"04","01","06","05"]
["04-01-07-04",4,null,16,4,1,7,4,"04","01","07","04"]
["04-01-08-03",4,null,16,4,1,8,3,"04","01","08","03"]
["04-01-09-02",4,null,16,4,1,9,2,"04","01","09","02"]
["04-01-10-01",4,null,16,4,1,10,1,"04","01","10","01"]
["04-01-11-00",4,null,16,4,1,11,0,"04","01","11","00"]
["04-02-00-10",4,null,16,4,2,0,10,"04","02","00","10"]
["04-02-01-09",4,null,16,4,2,1,9,"04","02","01","09"]
["04-02-02-08",4,null,16,4,2,2,8,"04","02","02","08"]
["04-02-03-07",4,null,16,4,2,3,7,"04","02","03","07"]
["04-02-04-06",4,null,16,4,2,4,6,"04","02","04","06"]
["04-02-05-05",4,null,16,4,2,5,5,"04","02","05","05"]
[{"$f":"I4423&\"-\"&J4423&\"-\"&K4423&\"-\"&L4423","v":"04-02-06-04"},4,null,16,4,2,6,4,"04","02","06","04"]
["04-02-07-03",4,null,16,4,2,7,3,{"$f":"IF(LEN(E4424)=1,0&E4424,IF(LEN(E4424)=0,\"00\",RIGHT(E4424,2)))","v":"04"},{"$f":"IF(LEN(F4424)=1,0&F4424,IF(LEN(F4424)=0,\"00\",RIGHT(F4424,2)))","v":"02"},{"$f":"IF(LEN(G4424)=1,0&G4424,IF(LEN(G4424)=0,\"00\",RIGHT(G4424,2)))","v":"07"},{"$f":"IF(LEN(H4424)=1,0&H4424,IF(LEN(H4424)=0,\"00\",RIGHT(H4424,2)))","v":"03"}]
["04-02-08-02",4,null,16,4,2,8,2,"04","02","08","02"]
["04-02-09-01",4,null,16,4,2,9,1,"04","02","09","01"]
["04-02-10-00",4,null,16,4,2,10,0,"04","02","10","00"]
["04-03-00-09",4,null,16,4,3,0,9,"04","03","00","09"]
["04-03-01-08",4,null,16,4,3,1,8,"04","03","01","08"]
["04-03-02-07",4,null,16,4,3,2,7,"04","03","02","07"]
["04-03-03-06",4,null,16,4,3,3,6,"04","03","03","06"]
["04-03-04-05",4,null,16,4,3,4,5,"04","03","04","05"]
["04-03-05-04",4,null,16,4,3,5,4,"04","03","05","04"]
["04-03-06-03",4,null,16,4,3,6,3,"04","03","06","03"]
["04-03-07-02",4,null,16,4,3,7,2,"04","03","07","02"]
["04-03-08-01",4,null,16,4,3,8,1,"04","03","08","01"]
["04-03-09-00",4,null,16,4,3,9,0,"04","03","09","00"]
["04-04-00-08",4,null,16,4,4,0,8,"04","04","00","08"]
["04-04-01-07",4,null,16,4,4,1,7,"04","04","01","07"]
["04-04-02-06",4,null,16,4,4,2,6,"04","04","02","06"]
["04-04-03-05",4,null,16,4,4,3,5,"04","04","03","05"]
["04-04-04-04",4,null,16,4,4,4,4,"04","04","04","04"]
["04-04-05-03",4,null,16,4,4,5,3,"04","04","05","03"]
["04-04-06-02",4,null,16,4,4,6,2,"04","04","06","02"]
["04-04-07-01",4,null,16,4,4,7,1,"04","04","07","01"]
["04-04-08-00",4,null,16,4,4,8,0,"04","04","08","00"]
["04-05-00-07",3,null,16,4,5,0,7,"04","05","00","07"]
["04-05-01-06",3,null,16,4,5,1,6,"04","05","01","06"]
["04-05-02-05",3,null,16,4,5,2,5,"04","05","02","05"]
["04-05-03-04",3,null,16,4,5,3,4,"04","05","03","04"]
["04-05-04-03",3,null,16,4,5,4,3,"04","05","04","03"]
["04-05-05-02",3,null,16,4,5,5,2,"04","05","05","02"]
["04-05-06-01",3,null,16,4,5,6,1,"04","05","06","01"]
["04-05-07-00",3,null,16,4,5,7,0,"04","05","07","00"]
["04-06-00-06",3,null,16,4,6,0,6,"04","06","00","06"]
["04-06-01-05",3,null,16,4,6,1,5,"04","06","01","05"]
["04-06-02-04",3,null,16,4,6,2,4,"04","06","02","04"]
["04-06-03-03",3,null,16,4,6,3,3,"04","06","03","03"]
["04-06-04-02",3,null,16,4,6,4,2,"04","06","04","02"]
["04-06-05-01",3,null,16,4,6,5,1,"04","06","05","01"]
["04-06-06-00",3,null,16,4,6,6,0,"04","06","06","00"]
["04-07-00-05",3,null,16,4,7,0,5,"04","07","00","05"]
["04-07-01-04",3,null,16,4,7,1,4,"04","07","01","04"]
["04-07-02-03",3,null,16,4,7,2,3,"04","07","02","03"]
["04-07-03-02",3,null,16,4,7,3,2,"04","07","03","02"]
["04-07-04-01",3,null,16,4,7,4,1,"04","07","04","01"]
["04-07-05-00",3,null,16,4,7,5,0,"04","07","05","00"]
["04-08-00-04",3,null,16,4,8,0,4,"04","08","00","04"]
["04-08-01-03",2,null,16,4,8,1,3,"04","08","01","03"]
["04-08-02-02",2,null,16,4,8,2,2,"04","08","02","02"]
["04-08-03-01",2,null,16,4,8,3,1,"04","08","03","01"]
["04-08-04-00",2,null,16,4,8,4,0,"04","08","04","00"]
["04-09-00-03",2,null,16,4,9,0,3,"04","09","00","03"]
["04-09-01-02",2,null,16,4,9,1,2,"04","09","01","02"]
["04-09-02-01",2,null,16,4,9,2,1,"04","09","02","01"]
["04-09-03-00",2,null,16,4,9,3,0,"04","09","03","00"]
["04-10-00-02",2,null,16,4,10,0,2,"04","10","00","02"]
["04-10-01-01",2,null,16,4,10,1,1,"04","10","01","01"]
["04-10-02-00",2,null,16,4,10,2,0,"04","10","02","00"]
["04-11-00-01",2,null,16,4,11,0,1,"04","11","00","01"]
["04-11-01-00",2,null,16,4,11,1,0,"04","11","01","00"]
["04-12-00-00",2,null,16,4,12,0,0,"04","12","00","00"]
["05-00-00-11",4,null,16,5,0,0,11,"05","00","00","11"]
["05-00-01-10",4,null,16,5,0,1,10,"05","00","01","10"]
["05-00-02-09",4,null,16,5,0,2,9,"05","00","02","09"]
["05-00-03-08",4,null,16,5,0,3,8,"05","00","03","08"]
[{"$f":"I4487&\"-\"&J4487&\"-\"&K4487&\"-\"&L4487","v":"05-00-04-07"},4,null,16,5,0,4,7,"05","00","04","07"]
["05-00-05-06",4,null,16,5,0,5,6,{"$f":"IF(LEN(E4488)=1,0&E4488,IF(LEN(E4488)=0,\"00\",RIGHT(E4488,2)))","v":"05"},{"$f":"IF(LEN(F4488)=1,0&F4488,IF(LEN(F4488)=0,\"00\",RIGHT(F4488,2)))","v":"00"},{"$f":"IF(LEN(G4488)=1,0&G4488,IF(LEN(G4488)=0,\"00\",RIGHT(G4488,2)))","v":"05"},{"$f":"IF(LEN(H4488)=1,0&H4488,IF(LEN(H4488)=0,\"00\",RIGHT(H4488,2)))","v":"06"}]
["05-00-06-05",4,null,16,5,0,6,5,"05","00","06","05"]
["05-00-07-04",4,null,16,5,0,7,4,"05","00","07","04"]
["05-00-08-03",4,null,16,5,0,8,3,"05","00","08","03"]
["05-00-09-02",4,null,16,5,0,9,2,"05","00","09","02"]
["05-00-10-01",4,null,16,5,0,10,1,"05","00","10","01"]
["05-00-11-00",4,null,16,5,0,11,0,"05","00","11","00"]
["05-01-00-10",4,null,16,5,1,0,10,"05","01","00","10"]
["05-01-01-09",4,null,16,5,1,1,9,"05","01","01","09"]
["05-01-02-08",4,null,16,5,1,2,8,"05","01","02","08"]
["05-01-03-07",4,null,16,5,1,3,7,"05","01","03","07"]
["05-01-04-06",4,null,16,5,1,4,6,"05","01","04","06"]
["05-01-05-05",4,null,16,5,1,5,5,"05","01","05","05"]
["05-01-06-04",4,null,16,5,1,6,4,"05","01","06","04"]
["05-01-07-03",4,null,16,5,1,7,3,"05","01","07","03"]
["05-01-08-02",4,null,16,5,1,8,2,"05","01","08","02"]
["05-01-09-01",4,null,16,5,1,9,1,"05","01","09","01"]
["05-01-10-00",4,null,16,5,1,10,0,"05","01","10","00"]
["05-02-00-09",4,null,16,5,2,0,9,"05","02","00","09"]
["05-02-01-08",4,null,16,5,2,1,8,"05","02","01","08"]
["05-02-02-07",4,null,16,5,2,2,7,"05","02","02","07"]
["05-02-03-06",4,null,16,5,2,3,6,"05","02","03","06"]
["05-02-04-05",4,null,16,5,2,4,5,"05","02","04","05"]
["05-02-05-04",4,null,16,5,2,5,4,"05","02","05","04"]
["05-02-06-03",4,null,16,5,2,6,3,"05","02","06","03"]
["05-02-07-02",4,null,16,5,2,7,2,"05","02","07","02"]
["05-02-08-01",4,null,16,5,2,8,1,"05","02","08","01"]
["05-02-09-00",4,null,16,5,2,9,0,"05","02","09","00"]
["05-03-00-08",4,null,16,5,3,0,8,"05","03","00","08"]
["05-03-01-07",4,null,16,5,3,1,7,"05","03","01","07"]
["05-03-02-06",4,null,16,5,3,2,6,"05","03","02","06"]
["05-03-03-05",4,null,16,5,3,3,5,"05","03","03","05"]
["05-03-04-04",4,null,16,5,3,4,4,"05","03","04","04"]
["05-03-05-03",4,null,16,5,3,5,3,"05","03","05","03"]
["05-03-06-02",4,null,16,5,3,6,2,"05","03","06","02"]
["05-03-07-01",4,null,16,5,3,7,1,"05","03","07","01"]
["05-03-08-00",4,null,16,5,3,8,0,"05","03","08","00"]
["05-04-00-07",3,null,16,5,4,0,7,"05","04","00","07"]
["05-04-01-06",3,null,16,5,4,1,6,"05","04","01","06"]
["05-04-02-05",3,null,16,5,4,2,5,"05","04","02","05"]
["05-04-03-04",3,null,16,5,4,3,4,"05","04","03","04"]
["05-04-04-03",3,null,16,5,4,4,3,"05","04","04","03"]
["05-04-05-02",3,null,16,5,4,5,2,"05","04","05","02"]
["05-04-06-01",3,null,16,5,4,6,1,"05","04","06","01"]
["05-04-07-00",3,null,16,5,4,7,0,"05","04","07","00"]
["05-05-00-06",3,null,16,5,5,0,6,"05","05","00","06"]
["05-05-01-05",3,null,16,5,5,1,5,"05","05","01","05"]
["05-05-02-04",3,null,16,5,5,2,4,"05","05","02","04"]
["05-05-03-03",3,null,16,5,5,3,3,"05","05","03","03"]
["05-05-04-02",3,null,16,5,5,4,2,"05","05","04","02"]
["05-05-05-01",3,null,16,5,5,5,1,"05","05","05","01"]
["05-05-06-00",3,null,16,5,5,6,0,"05","05","06","00"]
["05-06-00-05",3,null,16,5,6,0,5,"05","06","00","05"]
["05-06-01-04",3,null,16,5,6,1,4,"05","06","01","04"]
["05-06-02-03",3,null,16,5,6,2,3,"05","06","02","03"]
["05-06-03-02",3,null,16,5,6,3,2,"05","06","03","02"]
["05-06-04-01",3,null,16,5,6,4,1,"05","06","04","01"]
["05-06-05-00",3,null,16,5,6,5,0,"05","06","05","00"]
["05-07-00-04",3,null,16,5,7,0,4,"05","07","00","04"]
["05-07-01-03",2,null,16,5,7,1,3,"05","07","01","03"]
["05-07-02-02",2,null,16,5,7,2,2,"05","07","02","02"]
["05-07-03-01",2,null,16,5,7,3,1,"05","07","03","01"]
["05-07-04-00",2,null,16,5,7,4,0,"05","07","04","00"]
[{"$f":"I4551&\"-\"&J4551&\"-\"&K4551&\"-\"&L4551","v":"05-08-00-03"},2,null,16,5,8,0,3,"05","08","00","03"]
["05-08-01-02",2,null,16,5,8,1,2,{"$f":"IF(LEN(E4552)=1,0&E4552,IF(LEN(E4552)=0,\"00\",RIGHT(E4552,2)))","v":"05"},{"$f":"IF(LEN(F4552)=1,0&F4552,IF(LEN(F4552)=0,\"00\",RIGHT(F4552,2)))","v":"08"},{"$f":"IF(LEN(G4552)=1,0&G4552,IF(LEN(G4552)=0,\"00\",RIGHT(G4552,2)))","v":"01"},{"$f":"IF(LEN(H4552)=1,0&H4552,IF(LEN(H4552)=0,\"00\",RIGHT(H4552,2)))","v":"02"}]
["05-08-02-01",2,null,16,5,8,2,1,"05","08","02","01"]
["05-08-03-00",2,null,16,5,8,3,0,"05","08","03","00"]
["05-09-00-02",2,null,16,5,9,0,2,"05","09","00","02"]
["05-09-01-01",2,null,16,5,9,1,1,"05","09","01","01"]
["05-09-02-00",2,null,16,5,9,2,0,"05","09","02","00"]
["05-10-00-01",2,null,16,5,10,0,1,"05","10","00","01"]
["05-10-01-00",2,null,16,5,10,1,0,"05","10","01","00"]
["05-11-00-00",2,null,16,5,11,0,0,"05","11","00","00"]
["06-00-00-10",4,null,16,6,0,0,10,"06","00","00","10"]
["06-00-01-09",4,null,16,6,0,1,9,"06","00","01","09"]
["06-00-02-08",4,null,16,6,0,2,8,"06","00","02","08"]
["06-00-03-07",4,null,16,6,0,3,7,"06","00","03","07"]
["06-00-04-06",4,null,16,6,0,4,6,"06","00","04","06"]
["06-00-05-05",4,null,16,6,0,5,5,"06","00","05","05"]
["06-00-06-04",4,null,16,6,0,6,4,"06","00","06","04"]
["06-00-07-03",4,null,16,6,0,7,3,"06","00","07","03"]
["06-00-08-02",4,null,16,6,0,8,2,"06","00","08","02"]
["06-00-09-01",4,null,16,6,0,9,1,"06","00","09","01"]
["06-00-10-00",4,null,16,6,0,10,0,"06","00","10","00"]
["06-01-00-09",4,null,16,6,1,0,9,"06","01","00","09"]
["06-01-01-08",4,null,16,6,1,1,8,"06","01","01","08"]
["06-01-02-07",4,null,16,6,1,2,7,"06","01","02","07"]
["06-01-03-06",4,null,16,6,1,3,6,"06","01","03","06"]
["06-01-04-05",4,null,16,6,1,4,5,"06","01","04","05"]
["06-01-05-04",4,null,16,6,1,5,4,"06","01","05","04"]
["06-01-06-03",4,null,16,6,1,6,3,"06","01","06","03"]
["06-01-07-02",4,null,16,6,1,7,2,"06","01","07","02"]
["06-01-08-01",4,null,16,6,1,8,1,"06","01","08","01"]
["06-01-09-00",4,null,16,6,1,9,0,"06","01","09","00"]
["06-02-00-08",4,null,16,6,2,0,8,"06","02","00","08"]
["06-02-01-07",4,null,16,6,2,1,7,"06","02","01","07"]
["06-02-02-06",4,null,16,6,2,2,6,"06","02","02","06"]
["06-02-03-05",4,null,16,6,2,3,5,"06","02","03","05"]
["06-02-04-04",4,null,16,6,2,4,4,"06","02","04","04"]
["06-02-05-03",4,null,16,6,2,5,3,"06","02","05","03"]
["06-02-06-02",4,null,16,6,2,6,2,"06","02","06","02"]
["06-02-07-01",3,null,16,6,2,7,1,"06","02","07","01"]
["06-02-08-00",3,null,16,6,2,8,0,"06","02","08","00"]
["06-03-00-07",3,null,16,6,3,0,7,"06","03","00","07"]
["06-03-01-06",3,null,16,6,3,1,6,"06","03","01","06"]
["06-03-02-05",3,null,16,6,3,2,5,"06","03","02","05"]
["06-03-03-04",3,null,16,6,3,3,4,"06","03","03","04"]
["06-03-04-03",3,null,16,6,3,4,3,"06","03","04","03"]
["06-03-05-02",3,null,16,6,3,5,2,"06","03","05","02"]
["06-03-06-01",3,null,16,6,3,6,1,"06","03","06","01"]
["06-03-07-00",3,null,16,6,3,7,0,"06","03","07","00"]
["06-04-00-06",3,null,16,6,4,0,6,"06","04","00","06"]
["06-04-01-05",3,null,16,6,4,1,5,"06","04","01","05"]
["06-04-02-04",3,null,16,6,4,2,4,"06","04","02","04"]
["06-04-03-03",3,null,16,6,4,3,3,"06","04","03","03"]
["06-04-04-02",3,null,16,6,4,4,2,"06","04","04","02"]
["06-04-05-01",3,null,16,6,4,5,1,"06","04","05","01"]
["06-04-06-00",3,null,16,6,4,6,0,"06","04","06","00"]
["06-05-00-05",3,null,16,6,5,0,5,"06","05","00","05"]
["06-05-01-04",3,null,16,6,5,1,4,"06","05","01","04"]
["06-05-02-03",3,null,16,6,5,2,3,"06","05","02","03"]
["06-05-03-02",3,null,16,6,5,3,2,"06","05","03","02"]
["06-05-04-01",3,null,16,6,5,4,1,"06","05","04","01"]
["06-05-05-00",3,null,16,6,5,5,0,"06","05","05","00"]
["06-06-00-04",3,null,16,6,6,0,4,"06","06","00","04"]
["06-06-01-03",2,null,16,6,6,1,3,"06","06","01","03"]
["06-06-02-02",2,null,16,6,6,2,2,"06","06","02","02"]
[{"$f":"I4615&\"-\"&J4615&\"-\"&K4615&\"-\"&L4615","v":"06-06-03-01"},2,null,16,6,6,3,1,"06","06","03","01"]
["06-06-04-00",2,null,16,6,6,4,0,{"$f":"IF(LEN(E4616)=1,0&E4616,IF(LEN(E4616)=0,\"00\",RIGHT(E4616,2)))","v":"06"},{"$f":"IF(LEN(F4616)=1,0&F4616,IF(LEN(F4616)=0,\"00\",RIGHT(F4616,2)))","v":"06"},{"$f":"IF(LEN(G4616)=1,0&G4616,IF(LEN(G4616)=0,\"00\",RIGHT(G4616,2)))","v":"04"},{"$f":"IF(LEN(H4616)=1,0&H4616,IF(LEN(H4616)=0,\"00\",RIGHT(H4616,2)))","v":"00"}]
["06-07-00-03",2,null,16,6,7,0,3,"06","07","00","03"]
["06-07-01-02",2,null,16,6,7,1,2,"06","07","01","02"]
["06-07-02-01",2,null,16,6,7,2,1,"06","07","02","01"]
["06-07-03-00",2,null,16,6,7,3,0,"06","07","03","00"]
["06-08-00-02",2,null,16,6,8,0,2,"06","08","00","02"]
["06-08-01-01",2,null,16,6,8,1,1,"06","08","01","01"]
["06-08-02-00",2,null,16,6,8,2,0,"06","08","02","00"]
["06-09-00-01",2,null,16,6,9,0,1,"06","09","00","01"]
["06-09-01-00",2,null,16,6,9,1,0,"06","09","01","00"]
["06-10-00-00",2,null,16,6,10,0,0,"06","10","00","00"]
["07-00-00-09",4,null,16,7,0,0,9,"07","00","00","09"]
["07-00-01-08",4,null,16,7,0,1,8,"07","00","01","08"]
["07-00-02-07",4,null,16,7,0,2,7,"07","00","02","07"]
["07-00-03-06",4,null,16,7,0,3,6,"07","00","03","06"]
["07-00-04-05",4,null,16,7,0,4,5,"07","00","04","05"]
["07-00-05-04",4,null,16,7,0,5,4,"07","00","05","04"]
["07-00-06-03",4,null,16,7,0,6,3,"07","00","06","03"]
["07-00-07-02",4,null,16,7,0,7,2,"07","00","07","02"]
["07-00-08-01",3,null,16,7,0,8,1,"07","00","08","01"]
["07-00-09-00",3,null,16,7,0,9,0,"07","00","09","00"]
["07-01-00-08",4,null,16,7,1,0,8,"07","01","00","08"]
["07-01-01-07",4,null,16,7,1,1,7,"07","01","01","07"]
["07-01-02-06",4,null,16,7,1,2,6,"07","01","02","06"]
["07-01-03-05",4,null,16,7,1,3,5,"07","01","03","05"]
["07-01-04-04",4,null,16,7,1,4,4,"07","01","04","04"]
["07-01-05-03",4,null,16,7,1,5,3,"07","01","05","03"]
["07-01-06-02",3,null,16,7,1,6,2,"07","01","06","02"]
["07-01-07-01",3,null,16,7,1,7,1,"07","01","07","01"]
["07-01-08-00",3,null,16,7,1,8,0,"07","01","08","00"]
["07-02-00-07",3,null,16,7,2,0,7,"07","02","00","07"]
["07-02-01-06",3,null,16,7,2,1,6,"07","02","01","06"]
["07-02-02-05",3,null,16,7,2,2,5,"07","02","02","05"]
["07-02-03-04",3,null,16,7,2,3,4,"07","02","03","04"]
["07-02-04-03",3,null,16,7,2,4,3,"07","02","04","03"]
["07-02-05-02",3,null,16,7,2,5,2,"07","02","05","02"]
["07-02-06-01",3,null,16,7,2,6,1,"07","02","06","01"]
["07-02-07-00",3,null,16,7,2,7,0,"07","02","07","00"]
["07-03-00-06",3,null,16,7,3,0,6,"07","03","00","06"]
["07-03-01-05",3,null,16,7,3,1,5,"07","03","01","05"]
["07-03-02-04",3,null,16,7,3,2,4,"07","03","02","04"]
["07-03-03-03",3,null,16,7,3,3,3,"07","03","03","03"]
["07-03-04-02",3,null,16,7,3,4,2,"07","03","04","02"]
["07-03-05-01",3,null,16,7,3,5,1,"07","03","05","01"]
["07-03-06-00",3,null,16,7,3,6,0,"07","03","06","00"]
["07-04-00-05",3,null,16,7,4,0,5,"07","04","00","05"]
["07-04-01-04",3,null,16,7,4,1,4,"07","04","01","04"]
["07-04-02-03",3,null,16,7,4,2,3,"07","04","02","03"]
["07-04-03-02",3,null,16,7,4,3,2,"07","04","03","02"]
["07-04-04-01",3,null,16,7,4,4,1,"07","04","04","01"]
["07-04-05-00",3,null,16,7,4,5,0,"07","04","05","00"]
["07-05-00-04",3,null,16,7,5,0,4,"07","05","00","04"]
["07-05-01-03",2,null,16,7,5,1,3,"07","05","01","03"]
["07-05-02-02",2,null,16,7,5,2,2,"07","05","02","02"]
["07-05-03-01",2,null,16,7,5,3,1,"07","05","03","01"]
["07-05-04-00",2,null,16,7,5,4,0,"07","05","04","00"]
["07-06-00-03",2,null,16,7,6,0,3,"07","06","00","03"]
["07-06-01-02",2,null,16,7,6,1,2,"07","06","01","02"]
["07-06-02-01",2,null,16,7,6,2,1,"07","06","02","01"]
["07-06-03-00",2,null,16,7,6,3,0,"07","06","03","00"]
["07-07-00-02",2,null,16,7,7,0,2,"07","07","00","02"]
["07-07-01-01",2,null,16,7,7,1,1,"07","07","01","01"]
["07-07-02-00",2,null,16,7,7,2,0,"07","07","02","00"]
[{"$f":"I4679&\"-\"&J4679&\"-\"&K4679&\"-\"&L4679","v":"07-08-00-01"},2,null,16,7,8,0,1,"07","08","00","01"]
["07-08-01-00",2,null,16,7,8,1,0,{"$f":"IF(LEN(E4680)=1,0&E4680,IF(LEN(E4680)=0,\"00\",RIGHT(E4680,2)))","v":"07"},{"$f":"IF(LEN(F4680)=1,0&F4680,IF(LEN(F4680)=0,\"00\",RIGHT(F4680,2)))","v":"08"},{"$f":"IF(LEN(G4680)=1,0&G4680,IF(LEN(G4680)=0,\"00\",RIGHT(G4680,2)))","v":"01"},{"$f":"IF(LEN(H4680)=1,0&H4680,IF(LEN(H4680)=0,\"00\",RIGHT(H4680,2)))","v":"00"}]
["07-09-00-00",2,null,16,7,9,0,0,"07","09","00","00"]
["08-00-00-08",4,null,16,8,0,0,8,"08","00","00","08"]
["08-00-01-07",4,null,16,8,0,1,7,"08","00","01","07"]
["08-00-02-06",4,null,16,8,0,2,6,"08","00","02","06"]
["08-00-03-05",4,null,16,8,0,3,5,"08","00","03","05"]
["08-00-04-04",3,null,16,8,0,4,4,"08","00","04","04"]
["08-00-05-03",3,null,16,8,0,5,3,"08","00","05","03"]
["08-00-06-02",3,null,16,8,0,6,2,"08","00","06","02"]
["08-00-07-01",3,null,16,8,0,7,1,"08","00","07","01"]
["08-00-08-00",3,null,16,8,0,8,0,"08","00","08","00"]
["08-01-00-07",3,null,16,8,1,0,7,"08","01","00","07"]
["08-01-01-06",3,null,16,8,1,1,6,"08","01","01","06"]
["08-01-02-05",3,null,16,8,1,2,5,"08","01","02","05"]
["08-01-03-04",3,null,16,8,1,3,4,"08","01","03","04"]
["08-01-04-03",3,null,16,8,1,4,3,"08","01","04","03"]
["08-01-05-02",3,null,16,8,1,5,2,"08","01","05","02"]
["08-01-06-01",3,null,16,8,1,6,1,"08","01","06","01"]
["08-01-07-00",3,null,16,8,1,7,0,"08","01","07","00"]
["08-02-00-06",3,null,16,8,2,0,6,"08","02","00","06"]
["08-02-01-05",3,null,16,8,2,1,5,"08","02","01","05"]
["08-02-02-04",3,null,16,8,2,2,4,"08","02","02","04"]
["08-02-03-03",3,null,16,8,2,3,3,"08","02","03","03"]
["08-02-04-02",3,null,16,8,2,4,2,"08","02","04","02"]
["08-02-05-01",3,null,16,8,2,5,1,"08","02","05","01"]
["08-02-06-00",3,null,16,8,2,6,0,"08","02","06","00"]
["08-03-00-05",3,null,16,8,3,0,5,"08","03","00","05"]
["08-03-01-04",3,null,16,8,3,1,4,"08","03","01","04"]
["08-03-02-03",3,null,16,8,3,2,3,"08","03","02","03"]
["08-03-03-02",3,null,16,8,3,3,2,"08","03","03","02"]
["08-03-04-01",3,null,16,8,3,4,1,"08","03","04","01"]
["08-03-05-00",3,null,16,8,3,5,0,"08","03","05","00"]
["08-04-00-04",3,null,16,8,4,0,4,"08","04","00","04"]
["08-04-01-03",2,null,16,8,4,1,3,"08","04","01","03"]
["08-04-02-02",2,null,16,8,4,2,2,"08","04","02","02"]
["08-04-03-01",2,null,16,8,4,3,1,"08","04","03","01"]
["08-04-04-00",2,null,16,8,4,4,0,"08","04","04","00"]
["08-05-00-03",2,null,16,8,5,0,3,"08","05","00","03"]
["08-05-01-02",2,null,16,8,5,1,2,"08","05","01","02"]
["08-05-02-01",2,null,16,8,5,2,1,"08","05","02","01"]
["08-05-03-00",2,null,16,8,5,3,0,"08","05","03","00"]
["08-06-00-02",2,null,16,8,6,0,2,"08","06","00","02"]
["08-06-01-01",2,null,16,8,6,1,1,"08","06","01","01"]
["08-06-02-00",2,null,16,8,6,2,0,"08","06","02","00"]
["08-07-00-01",2,null,16,8,7,0,1,"08","07","00","01"]
["08-07-01-00",2,null,16,8,7,1,0,"08","07","01","00"]
["08-08-00-00",2,null,16,8,8,0,0,"08","08","00","00"]
["09-00-00-07",3,null,16,9,0,0,7,"09","00","00","07"]
["09-00-01-06",3,null,16,9,0,1,6,"09","00","01","06"]
["09-00-02-05",3,null,16,9,0,2,5,"09","00","02","05"]
["09-00-03-04",3,null,16,9,0,3,4,"09","00","03","04"]
["09-00-04-03",3,null,16,9,0,4,3,"09","00","04","03"]
["09-00-05-02",3,null,16,9,0,5,2,"09","00","05","02"]
["09-00-06-01",3,null,16,9,0,6,1,"09","00","06","01"]
["09-00-07-00",3,null,16,9,0,7,0,"09","00","07","00"]
["09-01-00-06",3,null,16,9,1,0,6,"09","01","00","06"]
["09-01-01-05",3,null,16,9,1,1,5,"09","01","01","05"]
["09-01-02-04",3,null,16,9,1,2,4,"09","01","02","04"]
["09-01-03-03",3,null,16,9,1,3,3,"09","01","03","03"]
["09-01-04-02",3,null,16,9,1,4,2,"09","01","04","02"]
["09-01-05-01",3,null,16,9,1,5,1,"09","01","05","01"]
["09-01-06-00",3,null,16,9,1,6,0,"09","01","06","00"]
["09-02-00-05",3,null,16,9,2,0,5,"09","02","00","05"]
[{"$f":"I4743&\"-\"&J4743&\"-\"&K4743&\"-\"&L4743","v":"09-02-01-04"},3,null,16,9,2,1,4,"09","02","01","04"]
["09-02-02-03",3,null,16,9,2,2,3,{"$f":"IF(LEN(E4744)=1,0&E4744,IF(LEN(E4744)=0,\"00\",RIGHT(E4744,2)))","v":"09"},{"$f":"IF(LEN(F4744)=1,0&F4744,IF(LEN(F4744)=0,\"00\",RIGHT(F4744,2)))","v":"02"},{"$f":"IF(LEN(G4744)=1,0&G4744,IF(LEN(G4744)=0,\"00\",RIGHT(G4744,2)))","v":"02"},{"$f":"IF(LEN(H4744)=1,0&H4744,IF(LEN(H4744)=0,\"00\",RIGHT(H4744,2)))","v":"03"}]
["09-02-03-02",3,null,16,9,2,3,2,"09","02","03","02"]
["09-02-04-01",3,null,16,9,2,4,1,"09","02","04","01"]
["09-02-05-00",3,null,16,9,2,5,0,"09","02","05","00"]
["09-03-00-04",3,null,16,9,3,0,4,"09","03","00","04"]
["09-03-01-03",2,null,16,9,3,1,3,"09","03","01","03"]
["09-03-02-02",2,null,16,9,3,2,2,"09","03","02","02"]
["09-03-03-01",2,null,16,9,3,3,1,"09","03","03","01"]
["09-03-04-00",2,null,16,9,3,4,0,"09","03","04","00"]
["09-04-00-03",2,null,16,9,4,0,3,"09","04","00","03"]
["09-04-01-02",2,null,16,9,4,1,2,"09","04","01","02"]
["09-04-02-01",2,null,16,9,4,2,1,"09","04","02","01"]
["09-04-03-00",2,null,16,9,4,3,0,"09","04","03","00"]
["09-05-00-02",2,null,16,9,5,0,2,"09","05","00","02"]
["09-05-01-01",2,null,16,9,5,1,1,"09","05","01","01"]
["09-05-02-00",2,null,16,9,5,2,0,"09","05","02","00"]
["09-06-00-01",2,null,16,9,6,0,1,"09","06","00","01"]
["09-06-01-00",2,null,16,9,6,1,0,"09","06","01","00"]
["09-07-00-00",2,null,16,9,7,0,0,"09","07","00","00"]
["10-00-00-06",3,null,16,10,0,0,6,"10","00","00","06"]
["10-00-01-05",3,null,16,10,0,1,5,"10","00","01","05"]
["10-00-02-04",3,null,16,10,0,2,4,"10","00","02","04"]
["10-00-03-03",3,null,16,10,0,3,3,"10","00","03","03"]
["10-00-04-02",3,null,16,10,0,4,2,"10","00","04","02"]
["10-00-05-01",3,null,16,10,0,5,1,"10","00","05","01"]
["10-00-06-00",3,null,16,10,0,6,0,"10","00","06","00"]
["10-01-00-05",3,null,16,10,1,0,5,"10","01","00","05"]
["10-01-01-04",3,null,16,10,1,1,4,"10","01","01","04"]
["10-01-02-03",3,null,16,10,1,2,3,"10","01","02","03"]
["10-01-03-02",3,null,16,10,1,3,2,"10","01","03","02"]
["10-01-04-01",3,null,16,10,1,4,1,"10","01","04","01"]
["10-01-05-00",3,null,16,10,1,5,0,"10","01","05","00"]
["10-02-00-04",3,null,16,10,2,0,4,"10","02","00","04"]
["10-02-01-03",2,null,16,10,2,1,3,"10","02","01","03"]
["10-02-02-02",2,null,16,10,2,2,2,"10","02","02","02"]
["10-02-03-01",2,null,16,10,2,3,1,"10","02","03","01"]
["10-02-04-00",2,null,16,10,2,4,0,"10","02","04","00"]
["10-03-00-03",2,null,16,10,3,0,3,"10","03","00","03"]
["10-03-01-02",2,null,16,10,3,1,2,"10","03","01","02"]
["10-03-02-01",2,null,16,10,3,2,1,"10","03","02","01"]
["10-03-03-00",2,null,16,10,3,3,0,"10","03","03","00"]
["10-04-00-02",2,null,16,10,4,0,2,"10","04","00","02"]
["10-04-01-01",2,null,16,10,4,1,1,"10","04","01","01"]
["10-04-02-00",2,null,16,10,4,2,0,"10","04","02","00"]
["10-05-00-01",2,null,16,10,5,0,1,"10","05","00","01"]
["10-05-01-00",2,null,16,10,5,1,0,"10","05","01","00"]
["10-06-00-00",2,null,16,10,6,0,0,"10","06","00","00"]
["11-00-00-05",3,null,16,11,0,0,5,"11","00","00","05"]
["11-00-01-04",3,null,16,11,0,1,4,"11","00","01","04"]
["11-00-02-03",3,null,16,11,0,2,3,"11","00","02","03"]
["11-00-03-02",3,null,16,11,0,3,2,"11","00","03","02"]
["11-00-04-01",3,null,16,11,0,4,1,"11","00","04","01"]
["11-00-05-00",3,null,16,11,0,5,0,"11","00","05","00"]
["11-01-00-04",3,null,16,11,1,0,4,"11","01","00","04"]
["11-01-01-03",2,null,16,11,1,1,3,"11","01","01","03"]
["11-01-02-02",2,null,16,11,1,2,2,"11","01","02","02"]
["11-01-03-01",2,null,16,11,1,3,1,"11","01","03","01"]
["11-01-04-00",2,null,16,11,1,4,0,"11","01","04","00"]
["11-02-00-03",2,null,16,11,2,0,3,"11","02","00","03"]
["11-02-01-02",2,null,16,11,2,1,2,"11","02","01","02"]
["11-02-02-01",2,null,16,11,2,2,1,"11","02","02","01"]
["11-02-03-00",2,null,16,11,2,3,0,"11","02","03","00"]
["11-03-00-02",2,null,16,11,3,0,2,"11","03","00","02"]
[{"$f":"I4807&\"-\"&J4807&\"-\"&K4807&\"-\"&L4807","v":"11-03-01-01"},2,null,16,11,3,1,1,"11","03","01","01"]
["11-03-02-00",2,null,16,11,3,2,0,{"$f":"IF(LEN(E4808)=1,0&E4808,IF(LEN(E4808)=0,\"00\",RIGHT(E4808,2)))","v":"11"},{"$f":"IF(LEN(F4808)=1,0&F4808,IF(LEN(F4808)=0,\"00\",RIGHT(F4808,2)))","v":"03"},{"$f":"IF(LEN(G4808)=1,0&G4808,IF(LEN(G4808)=0,\"00\",RIGHT(G4808,2)))","v":"02"},{"$f":"IF(LEN(H4808)=1,0&H4808,IF(LEN(H4808)=0,\"00\",RIGHT(H4808,2)))","v":"00"}]
["11-04-00-01",2,null,16,11,4,0,1,"11","04","00","01"]
["11-04-01-00",2,null,16,11,4,1,0,"11","04","01","00"]
["11-05-00-00",2,null,16,11,5,0,0,"11","05","00","00"]
["12-00-00-04",3,null,16,12,0,0,4,"12","00","00","04"]
["12-00-01-03",2,null,16,12,0,1,3,"12","00","01","03"]
["12-00-02-02",2,null,16,12,0,2,2,"12","00","02","02"]
["12-00-03-01",2,null,16,12,0,3,1,"12","00","03","01"]
["12-00-04-00",2,null,16,12,0,4,0,"12","00","04","00"]
["12-01-00-03",2,null,16,12,1,0,3,"12","01","00","03"]
["12-01-01-02",2,null,16,12,1,1,2,"12","01","01","02"]
["12-01-02-01",2,null,16,12,1,2,1,"12","01","02","01"]
["12-01-03-00",2,null,16,12,1,3,0,"12","01","03","00"]
["12-02-00-02",2,null,16,12,2,0,2,"12","02","00","02"]
["12-02-01-01",2,null,16,12,2,1,1,"12","02","01","01"]
["12-02-02-00",2,null,16,12,2,2,0,"12","02","02","00"]
["12-03-00-01",2,null,16,12,3,0,1,"12","03","00","01"]
["12-03-01-00",2,null,16,12,3,1,0,"12","03","01","00"]
["12-04-00-00",2,null,16,12,4,0,0,"12","04","00","00"]
["13-00-00-03",2,null,16,13,0,0,3,"13","00","00","03"]
["13-00-01-02",2,null,16,13,0,1,2,"13","00","01","02"]
["13-00-02-01",2,null,16,13,0,2,1,"13","00","02","01"]
["13-00-03-00",2,null,16,13,0,3,0,"13","00","03","00"]
["13-01-00-02",2,null,16,13,1,0,2,"13","01","00","02"]
["13-01-01-01",2,null,16,13,1,1,1,"13","01","01","01"]
["13-01-02-00",2,null,16,13,1,2,0,"13","01","02","00"]
["13-02-00-01",2,null,16,13,2,0,1,"13","02","00","01"]
["13-02-01-00",2,null,16,13,2,1,0,"13","02","01","00"]
["13-03-00-00",2,null,16,13,3,0,0,"13","03","00","00"]
["14-00-00-02",2,null,16,14,0,0,2,"14","00","00","02"]
["14-00-01-01",2,null,16,14,0,1,1,"14","00","01","01"]
["14-00-02-00",2,null,16,14,0,2,0,"14","00","02","00"]
["14-01-00-01",2,null,16,14,1,0,1,"14","01","00","01"]
["14-01-01-00",2,null,16,14,1,1,0,"14","01","01","00"]
["14-02-00-00",2,null,16,14,2,0,0,"14","02","00","00"]
["15-00-00-01",2,null,16,15,0,0,1,"15","00","00","01"]
["15-00-01-00",2,null,16,15,0,1,0,"15","00","01","00"]
["15-01-00-00",2,null,16,15,1,0,0,"15","01","00","00"]
["16-00-00-00",1,null,16,16,0,0,0,"16","00","00","00"]

{"sheet":"ElementRatingScale","index":14,"n_rows":12,"n_cols":5,"rows_kept":12,"cut":false,"hidden":true,"merged":[]}
["Element Rating","Description",null,"Brief Element Description","Element Rating"]
[1,"No - element not in place and not planning to work on it at this time",null,1,1]
[2,"No - element not in place but planning to work on it or getting started",null,2,2]
[3,"Yes - element partially implemented",null,3,3]
[4,"Yes - element fully implemented",null,4,4]
[]
[null,null,null,"Brief Element Description Plus","Element Rating"]
["Priority Rating",null,null,1,1]
["L","Low",null,2,2]
["M","Medium",null,3,3]
["H","High",null,4,4]
[null,null,null,"Not applicable",{"$f":"\"\"","v":""}]

{"sheet":"IndicatorRating","index":15,"n_rows":21,"n_cols":2,"rows_kept":21,"cut":false,"hidden":true,"merged":[[19,0,20,0],[1,0,2,0],[3,0,4,0],[5,0,9,0],[10,0,13,0],[14,0,16,0],[17,0,18,0]]}
["Quality Indicator Rating","Description"]
[1,"None of the elements are yet planned or in place.  "]
[null,"None of the elements are yet a 2 or higher."]
[2,"Most of the elements are not yet planned or in place. "]
[null,"Less than one half are 3’s; no 4’s. The rest are 1’s or 2’s."]
[3,"Some elements are in place, a few may be fully implemented."]
[null,"Half or less are 3s and 4s; or at least one is a 4."]
[null,"Does not have to have a 4."]
[null,"This is the lowest score with one 4."]
[null,"This is the highest score if no 4."]
[4,"At least half of the elements are in place, a few may be fully implemented."]
[null,"More than ½ are 3 or 4 combined. "]
[null,"Need at least one 4 to get “4” or higher on the scale."]
[null,"If fewer than 7 elements, one or more 1s; if 7 or more elements, 2 or more 1s"]
[5,"At least half of the elements are in place, some are fully implemented."]
[null,"More than half of the elements are 3 and/or 4s, at least 20% are 4s, no elements are rated 1 (if fewer than 7 elements) or one element could be rated 1 if there are 7 or more elements"]
[null,"This is the highest score with a 2."]
[6,"At least half of the elements are fully implemented, the rest are partially implemented."]
[null,"At least half the elements are 4 and the rest are 3."]
[7,"All elements are fully implemented."]
[null,"All element ratings are 4."]